maven-notifications mailing list archives

Site index · List index
Message view « Date » · « Thread »
Top « Date » · « Thread »
From "GRiD .ORG" <bui...@lists.sonatype.com>
Subject Build failed in Hudson: maven-3.0.x-ITs » java-5x,ubuntu #444
Date Fri, 21 Jan 2011 12:46:49 GMT
See <https://grid.sonatype.org/ci/job/maven-3.0.x-ITs/./jdk=java-5x,label=ubuntu/444/>

------------------------------------------
[...truncated 1961 lines...]
	at org.apache.maven.lifecycle.internal.LifecycleStarter.execute(LifecycleStarter.java:161)
	at org.apache.maven.DefaultMaven.doExecute(DefaultMaven.java:319)
	at org.apache.maven.DefaultMaven.execute(DefaultMaven.java:156)
	at org.apache.maven.cli.MavenCli.execute(MavenCli.java:534)
	at org.apache.maven.cli.MavenCli.doMain(MavenCli.java:196)
	at org.apache.maven.cli.MavenCli.doMain(MavenCli.java:171)
	at sun.reflect.GeneratedMethodAccessor10.invoke(Unknown Source)
	at sun.reflect.DelegatingMethodAccessorImpl.invoke(DelegatingMethodAccessorImpl.java:25)
	at java.lang.reflect.Method.invoke(Method.java:592)
	at org.apache.maven.it.Embedded3xLauncher.run(Embedded3xLauncher.java:177)
	at org.apache.maven.it.Verifier.executeGoals(Verifier.java:1369)
	at org.apache.maven.it.Verifier.executeGoal(Verifier.java:1234)
	at org.apache.maven.it.Verifier.executeGoal(Verifier.java:1228)
	at org.apache.maven.it.MavenITmng2693SitePluginRealmTest.testit(MavenITmng2693SitePluginRealmTest.java:52)
Caused by: org.apache.maven.plugin.PluginExecutionException: Execution load of goal org.apache.maven.its.plugins:maven-it-plugin-class-loader:2.1-SNAPSHOT:load
failed: Plugin org.apache.maven.its.plugins:maven-it-plugin-class-loader:2.1-SNAPSHOT or one
of its dependencies could not be resolved: The following artifacts could not be resolved:
org.apache.maven.its.plugins.class-loader:dep-b:jar:2.1-SNAPSHOT, org.apache.maven.its.plugins.class-loader:dep-a:jar:2.1-SNAPSHOT:
Could not find artifact org.apache.maven.its.plugins.class-loader:dep-b:jar:2.1-20110115.061301-731
in central (file:target/null)
	at org.apache.maven.plugin.DefaultBuildPluginManager.executeMojo(DefaultBuildPluginManager.java:86)
	at org.apache.maven.lifecycle.internal.MojoExecutor.execute(MojoExecutor.java:209)
	... 48 more
Caused by: org.apache.maven.plugin.PluginResolutionException: Plugin org.apache.maven.its.plugins:maven-it-plugin-class-loader:2.1-SNAPSHOT
or one of its dependencies could not be resolved: The following artifacts could not be resolved:
org.apache.maven.its.plugins.class-loader:dep-b:jar:2.1-SNAPSHOT, org.apache.maven.its.plugins.class-loader:dep-a:jar:2.1-SNAPSHOT:
Could not find artifact org.apache.maven.its.plugins.class-loader:dep-b:jar:2.1-20110115.061301-731
in central (file:target/null)
	at org.apache.maven.plugin.internal.DefaultPluginDependenciesResolver.resolve(DefaultPluginDependenciesResolver.java:199)
	at org.apache.maven.plugin.internal.DefaultMavenPluginManager.createPluginRealm(DefaultMavenPluginManager.java:349)
	at org.apache.maven.plugin.internal.DefaultMavenPluginManager.setupPluginRealm(DefaultMavenPluginManager.java:317)
	at org.apache.maven.plugin.DefaultBuildPluginManager.getPluginRealm(DefaultBuildPluginManager.java:182)
	at org.apache.maven.plugin.DefaultBuildPluginManager.executeMojo(DefaultBuildPluginManager.java:82)
	... 49 more
Caused by: org.sonatype.aether.resolution.ArtifactResolutionException: The following artifacts
could not be resolved: org.apache.maven.its.plugins.class-loader:dep-b:jar:2.1-SNAPSHOT, org.apache.maven.its.plugins.class-loader:dep-a:jar:2.1-SNAPSHOT:
Could not find artifact org.apache.maven.its.plugins.class-loader:dep-b:jar:2.1-20110115.061301-731
in central (file:target/null)
	at org.sonatype.aether.impl.internal.DefaultArtifactResolver.resolveArtifacts(DefaultArtifactResolver.java:526)
	at org.sonatype.aether.impl.internal.DefaultRepositorySystem.resolveArtifacts(DefaultRepositorySystem.java:304)
	at org.sonatype.aether.impl.internal.DefaultRepositorySystem.resolveDependencies(DefaultRepositorySystem.java:334)
	at org.apache.maven.plugin.internal.DefaultPluginDependenciesResolver.resolve(DefaultPluginDependenciesResolver.java:191)
	... 53 more
Caused by: org.sonatype.aether.transfer.ArtifactNotFoundException: Could not find artifact
org.apache.maven.its.plugins.class-loader:dep-b:jar:2.1-20110115.061301-731 in central (file:target/null)
	at org.sonatype.aether.connector.wagon.WagonRepositoryConnector$4.wrap(WagonRepositoryConnector.java:945)
	at org.sonatype.aether.connector.wagon.WagonRepositoryConnector$4.wrap(WagonRepositoryConnector.java:940)
	at org.sonatype.aether.connector.wagon.WagonRepositoryConnector$GetTask.flush(WagonRepositoryConnector.java:696)
	at org.sonatype.aether.connector.wagon.WagonRepositoryConnector$GetTask.flush(WagonRepositoryConnector.java:690)
	at org.sonatype.aether.connector.wagon.WagonRepositoryConnector.get(WagonRepositoryConnector.java:435)
	at org.sonatype.aether.impl.internal.DefaultArtifactResolver.resolveArtifacts(DefaultArtifactResolver.java:438)
	... 56 more
[ERROR] 
[ERROR] Re-run Maven using the -X switch to enable full debug logging.
[ERROR] 
[ERROR] For more information about the errors and possible solutions, please read the following
articles:
[ERROR] [Help 1] http://cwiki.apache.org/confluence/display/MAVEN/PluginResolutionException
	at org.apache.maven.it.Verifier.executeGoals(Verifier.java:1391)
	at org.apache.maven.it.Verifier.executeGoal(Verifier.java:1234)
	at org.apache.maven.it.Verifier.executeGoal(Verifier.java:1228)
	at org.apache.maven.it.MavenITmng2693SitePluginRealmTest.testit(MavenITmng2693SitePluginRealmTest.java:52)
	at sun.reflect.NativeMethodAccessorImpl.invoke0(Native Method)
	at sun.reflect.NativeMethodAccessorImpl.invoke(NativeMethodAccessorImpl.java:39)
	at sun.reflect.DelegatingMethodAccessorImpl.invoke(DelegatingMethodAccessorImpl.java:25)
	at java.lang.reflect.Method.invoke(Method.java:592)
	at junit.framework.TestCase.runTest(TestCase.java:164)
	at org.apache.maven.it.AbstractMavenIntegrationTestCase.runTest(AbstractMavenIntegrationTestCase.java:220)
	at junit.framework.TestCase.runBare(TestCase.java:130)
	at junit.framework.TestResult$1.protect(TestResult.java:106)
	at junit.framework.TestResult.runProtected(TestResult.java:124)
	at junit.framework.TestResult.run(TestResult.java:109)
	at junit.framework.TestCase.run(TestCase.java:120)
	at junit.framework.TestSuite.runTest(TestSuite.java:230)
	at junit.framework.TestSuite.run(TestSuite.java:225)
	at junit.framework.TestSuite.runTest(TestSuite.java:230)
	at junit.framework.TestSuite.run(TestSuite.java:225)
	at sun.reflect.NativeMethodAccessorImpl.invoke0(Native Method)
	at sun.reflect.NativeMethodAccessorImpl.invoke(NativeMethodAccessorImpl.java:39)
	at sun.reflect.DelegatingMethodAccessorImpl.invoke(DelegatingMethodAccessorImpl.java:25)
	at java.lang.reflect.Method.invoke(Method.java:592)
	at org.apache.maven.surefire.junit.JUnitTestSet.execute(JUnitTestSet.java:213)
	at org.apache.maven.surefire.suite.AbstractDirectoryTestSuite.executeTestSet(AbstractDirectoryTestSuite.java:140)
	at org.apache.maven.surefire.suite.AbstractDirectoryTestSuite.execute(AbstractDirectoryTestSuite.java:127)
	at org.apache.maven.surefire.Surefire.run(Surefire.java:177)
	at sun.reflect.NativeMethodAccessorImpl.invoke0(Native Method)
	at sun.reflect.NativeMethodAccessorImpl.invoke(NativeMethodAccessorImpl.java:39)
	at sun.reflect.DelegatingMethodAccessorImpl.invoke(DelegatingMethodAccessorImpl.java:25)
	at java.lang.reflect.Method.invoke(Method.java:592)
	at org.apache.maven.surefire.booter.SurefireBooter.runSuitesInProcess(SurefireBooter.java:345)
	at org.apache.maven.surefire.booter.SurefireBooter.main(SurefireBooter.java:1009)

testit0086(org.apache.maven.it.MavenIT0086PluginRealmTest)  Time elapsed: 1.634 sec  <<<
ERROR!
org.apache.maven.it.VerificationException: Exit code was non-zero: 1; command line and log
= 
/opt/grid/slave/workspace/maven-3.0.x-ITs/jdk/java-5x/label/ubuntu/core-integration-tests/target/distro/bin/mvn
--global-settings /opt/grid/slave/workspace/maven-3.0.x-ITs/jdk/java-5x/label/ubuntu/core-integration-tests/target/test-classes/settings.xml
-e --batch-mode -Dmaven.repo.local=<https://grid.sonatype.org/ci/job/maven-3.0.x-ITs/./jdk=java-5x,label=ubuntu/ws/.repository>
validate
[INFO] Error stacktraces are turned on.
[INFO] Scanning for projects...
[INFO]                                                                         
[INFO] ------------------------------------------------------------------------
[INFO] Building Maven Integration Test :: it0086 1.0
[INFO] ------------------------------------------------------------------------
[INFO] 
[INFO] --- maven-it-plugin-class-loader:2.1-SNAPSHOT:load (load) @ maven-it-it0086 ---
Downloading: file:target/null/org/apache/maven/its/plugins/class-loader/dep-b/2.1-SNAPSHOT/dep-b-2.1-20110115.061301-731.jar
Downloading: file:target/null/org/apache/maven/its/plugins/class-loader/dep-a/2.1-SNAPSHOT/dep-a-2.1-20110115.061301-731.jar
[INFO] ------------------------------------------------------------------------
[INFO] BUILD FAILURE
[INFO] ------------------------------------------------------------------------
[INFO] Total time: 0.160s
[INFO] Finished at: Fri Jan 21 06:45:51 CST 2011
[INFO] Final Memory: 236M/358M
[INFO] ------------------------------------------------------------------------
[ERROR] Failed to execute goal org.apache.maven.its.plugins:maven-it-plugin-class-loader:2.1-SNAPSHOT:load
(load) on project maven-it-it0086: Execution load of goal org.apache.maven.its.plugins:maven-it-plugin-class-loader:2.1-SNAPSHOT:load
failed: Plugin org.apache.maven.its.plugins:maven-it-plugin-class-loader:2.1-SNAPSHOT or one
of its dependencies could not be resolved: The following artifacts could not be resolved:
org.apache.maven.its.plugins.class-loader:dep-b:jar:2.1-SNAPSHOT, org.apache.maven.its.plugins.class-loader:dep-a:jar:2.1-SNAPSHOT:
Could not find artifact org.apache.maven.its.plugins.class-loader:dep-b:jar:2.1-20110115.061301-731
in central (file:target/null) -> [Help 1]
org.apache.maven.lifecycle.LifecycleExecutionException: Failed to execute goal org.apache.maven.its.plugins:maven-it-plugin-class-loader:2.1-SNAPSHOT:load
(load) on project maven-it-it0086: Execution load of goal org.apache.maven.its.plugins:maven-it-plugin-class-loader:2.1-SNAPSHOT:load
failed: Plugin org.apache.maven.its.plugins:maven-it-plugin-class-loader:2.1-SNAPSHOT or one
of its dependencies could not be resolved: The following artifacts could not be resolved:
org.apache.maven.its.plugins.class-loader:dep-b:jar:2.1-SNAPSHOT, org.apache.maven.its.plugins.class-loader:dep-a:jar:2.1-SNAPSHOT:
Could not find artifact org.apache.maven.its.plugins.class-loader:dep-b:jar:2.1-20110115.061301-731
in central (file:target/null)
	at org.apache.maven.lifecycle.internal.MojoExecutor.execute(MojoExecutor.java:225)
	at org.apache.maven.lifecycle.internal.MojoExecutor.execute(MojoExecutor.java:153)
	at org.apache.maven.lifecycle.internal.MojoExecutor.execute(MojoExecutor.java:145)
	at org.apache.maven.lifecycle.internal.LifecycleModuleBuilder.buildProject(LifecycleModuleBuilder.java:84)
	at org.apache.maven.lifecycle.internal.LifecycleModuleBuilder.buildProject(LifecycleModuleBuilder.java:59)
	at org.apache.maven.lifecycle.internal.LifecycleStarter.singleThreadedBuild(LifecycleStarter.java:183)
	at org.apache.maven.lifecycle.internal.LifecycleStarter.execute(LifecycleStarter.java:161)
	at org.apache.maven.DefaultMaven.doExecute(DefaultMaven.java:319)
	at org.apache.maven.DefaultMaven.execute(DefaultMaven.java:156)
	at org.apache.maven.cli.MavenCli.execute(MavenCli.java:534)
	at org.apache.maven.cli.MavenCli.doMain(MavenCli.java:196)
	at org.apache.maven.cli.MavenCli.doMain(MavenCli.java:171)
	at sun.reflect.GeneratedMethodAccessor10.invoke(Unknown Source)
	at sun.reflect.DelegatingMethodAccessorImpl.invoke(DelegatingMethodAccessorImpl.java:25)
	at java.lang.reflect.Method.invoke(Method.java:592)
	at org.apache.maven.it.Embedded3xLauncher.run(Embedded3xLauncher.java:177)
	at org.apache.maven.it.Verifier.executeGoals(Verifier.java:1369)
	at org.apache.maven.it.Verifier.executeGoal(Verifier.java:1234)
	at org.apache.maven.it.Verifier.executeGoal(Verifier.java:1228)
	at org.apache.maven.it.MavenIT0086PluginRealmTest.testit0086(MavenIT0086PluginRealmTest.java:54)
Caused by: org.apache.maven.plugin.PluginExecutionException: Execution load of goal org.apache.maven.its.plugins:maven-it-plugin-class-loader:2.1-SNAPSHOT:load
failed: Plugin org.apache.maven.its.plugins:maven-it-plugin-class-loader:2.1-SNAPSHOT or one
of its dependencies could not be resolved: The following artifacts could not be resolved:
org.apache.maven.its.plugins.class-loader:dep-b:jar:2.1-SNAPSHOT, org.apache.maven.its.plugins.class-loader:dep-a:jar:2.1-SNAPSHOT:
Could not find artifact org.apache.maven.its.plugins.class-loader:dep-b:jar:2.1-20110115.061301-731
in central (file:target/null)
	at org.apache.maven.plugin.DefaultBuildPluginManager.executeMojo(DefaultBuildPluginManager.java:86)
	at org.apache.maven.lifecycle.internal.MojoExecutor.execute(MojoExecutor.java:209)
	... 48 more
Caused by: org.apache.maven.plugin.PluginResolutionException: Plugin org.apache.maven.its.plugins:maven-it-plugin-class-loader:2.1-SNAPSHOT
or one of its dependencies could not be resolved: The following artifacts could not be resolved:
org.apache.maven.its.plugins.class-loader:dep-b:jar:2.1-SNAPSHOT, org.apache.maven.its.plugins.class-loader:dep-a:jar:2.1-SNAPSHOT:
Could not find artifact org.apache.maven.its.plugins.class-loader:dep-b:jar:2.1-20110115.061301-731
in central (file:target/null)
	at org.apache.maven.plugin.internal.DefaultPluginDependenciesResolver.resolve(DefaultPluginDependenciesResolver.java:199)
	at org.apache.maven.plugin.internal.DefaultMavenPluginManager.createPluginRealm(DefaultMavenPluginManager.java:349)
	at org.apache.maven.plugin.internal.DefaultMavenPluginManager.setupPluginRealm(DefaultMavenPluginManager.java:317)
	at org.apache.maven.plugin.DefaultBuildPluginManager.getPluginRealm(DefaultBuildPluginManager.java:182)
	at org.apache.maven.plugin.DefaultBuildPluginManager.executeMojo(DefaultBuildPluginManager.java:82)
	... 49 more
Caused by: org.sonatype.aether.resolution.ArtifactResolutionException: The following artifacts
could not be resolved: org.apache.maven.its.plugins.class-loader:dep-b:jar:2.1-SNAPSHOT, org.apache.maven.its.plugins.class-loader:dep-a:jar:2.1-SNAPSHOT:
Could not find artifact org.apache.maven.its.plugins.class-loader:dep-b:jar:2.1-20110115.061301-731
in central (file:target/null)
	at org.sonatype.aether.impl.internal.DefaultArtifactResolver.resolveArtifacts(DefaultArtifactResolver.java:526)
	at org.sonatype.aether.impl.internal.DefaultRepositorySystem.resolveArtifacts(DefaultRepositorySystem.java:304)
	at org.sonatype.aether.impl.internal.DefaultRepositorySystem.resolveDependencies(DefaultRepositorySystem.java:334)
	at org.apache.maven.plugin.internal.DefaultPluginDependenciesResolver.resolve(DefaultPluginDependenciesResolver.java:191)
	... 53 more
Caused by: org.sonatype.aether.transfer.ArtifactNotFoundException: Could not find artifact
org.apache.maven.its.plugins.class-loader:dep-b:jar:2.1-20110115.061301-731 in central (file:target/null)
	at org.sonatype.aether.connector.wagon.WagonRepositoryConnector$4.wrap(WagonRepositoryConnector.java:945)
	at org.sonatype.aether.connector.wagon.WagonRepositoryConnector$4.wrap(WagonRepositoryConnector.java:940)
	at org.sonatype.aether.connector.wagon.WagonRepositoryConnector$GetTask.flush(WagonRepositoryConnector.java:696)
	at org.sonatype.aether.connector.wagon.WagonRepositoryConnector$GetTask.flush(WagonRepositoryConnector.java:690)
	at org.sonatype.aether.connector.wagon.WagonRepositoryConnector.get(WagonRepositoryConnector.java:435)
	at org.sonatype.aether.impl.internal.DefaultArtifactResolver.resolveArtifacts(DefaultArtifactResolver.java:438)
	... 56 more
[ERROR] 
[ERROR] Re-run Maven using the -X switch to enable full debug logging.
[ERROR] 
[ERROR] For more information about the errors and possible solutions, please read the following
articles:
[ERROR] [Help 1] http://cwiki.apache.org/confluence/display/MAVEN/PluginResolutionException
	at org.apache.maven.it.Verifier.executeGoals(Verifier.java:1391)
	at org.apache.maven.it.Verifier.executeGoal(Verifier.java:1234)
	at org.apache.maven.it.Verifier.executeGoal(Verifier.java:1228)
	at org.apache.maven.it.MavenIT0086PluginRealmTest.testit0086(MavenIT0086PluginRealmTest.java:54)
	at sun.reflect.NativeMethodAccessorImpl.invoke0(Native Method)
	at sun.reflect.NativeMethodAccessorImpl.invoke(NativeMethodAccessorImpl.java:39)
	at sun.reflect.DelegatingMethodAccessorImpl.invoke(DelegatingMethodAccessorImpl.java:25)
	at java.lang.reflect.Method.invoke(Method.java:592)
	at junit.framework.TestCase.runTest(TestCase.java:164)
	at org.apache.maven.it.AbstractMavenIntegrationTestCase.runTest(AbstractMavenIntegrationTestCase.java:220)
	at junit.framework.TestCase.runBare(TestCase.java:130)
	at junit.framework.TestResult$1.protect(TestResult.java:106)
	at junit.framework.TestResult.runProtected(TestResult.java:124)
	at junit.framework.TestResult.run(TestResult.java:109)
	at junit.framework.TestCase.run(TestCase.java:120)
	at junit.framework.TestSuite.runTest(TestSuite.java:230)
	at junit.framework.TestSuite.run(TestSuite.java:225)
	at junit.framework.TestSuite.runTest(TestSuite.java:230)
	at junit.framework.TestSuite.run(TestSuite.java:225)
	at sun.reflect.NativeMethodAccessorImpl.invoke0(Native Method)
	at sun.reflect.NativeMethodAccessorImpl.invoke(NativeMethodAccessorImpl.java:39)
	at sun.reflect.DelegatingMethodAccessorImpl.invoke(DelegatingMethodAccessorImpl.java:25)
	at java.lang.reflect.Method.invoke(Method.java:592)
	at org.apache.maven.surefire.junit.JUnitTestSet.execute(JUnitTestSet.java:213)
	at org.apache.maven.surefire.suite.AbstractDirectoryTestSuite.executeTestSet(AbstractDirectoryTestSuite.java:140)
	at org.apache.maven.surefire.suite.AbstractDirectoryTestSuite.execute(AbstractDirectoryTestSuite.java:127)
	at org.apache.maven.surefire.Surefire.run(Surefire.java:177)
	at sun.reflect.NativeMethodAccessorImpl.invoke0(Native Method)
	at sun.reflect.NativeMethodAccessorImpl.invoke(NativeMethodAccessorImpl.java:39)
	at sun.reflect.DelegatingMethodAccessorImpl.invoke(DelegatingMethodAccessorImpl.java:25)
	at java.lang.reflect.Method.invoke(Method.java:592)
	at org.apache.maven.surefire.booter.SurefireBooter.runSuitesInProcess(SurefireBooter.java:345)
	at org.apache.maven.surefire.booter.SurefireBooter.main(SurefireBooter.java:1009)


Results :

Tests in error: 
  testit(org.apache.maven.it.MavenITmng4747JavaAgentUsedByPluginTest)
  testit(org.apache.maven.it.MavenITmng4580ProjectLevelPluginDepUsedForCliInvocInReactorTest)
  testit(org.apache.maven.it.MavenITmng4381ExtensionSingletonComponentTest)
  testit(org.apache.maven.it.MavenITmng4273RestrictedCoreRealmAccessForPluginTest)
  testit(org.apache.maven.it.MavenITmng4196ExclusionOnPluginDepTest)
  testitMNG3819(org.apache.maven.it.MavenITmng3819PluginDepPlexusUtilsTest)
  testitMNG3796(org.apache.maven.it.MavenITmng3796ClassImportInconsistencyTest)
  testit(org.apache.maven.it.MavenITmng3607ClassLoadersUseValidUrlsTest)
  testitFromProject(org.apache.maven.it.MavenITmng3586SystemScopePluginDependencyTest)
  testit(org.apache.maven.it.MavenITmng2693SitePluginRealmTest)
  testit0086(org.apache.maven.it.MavenIT0086PluginRealmTest)

Tests run: 690, Failures: 0, Errors: 11, Skipped: 0

[INFO] ------------------------------------------------------------------------
[INFO] BUILD FAILURE
[INFO] ------------------------------------------------------------------------
[INFO] Total time: 25:00.320s
[INFO] Finished at: Fri Jan 21 06:46:48 CST 2011
[INFO] Final Memory: 17M/369M
[INFO] ------------------------------------------------------------------------
[ERROR] Failed to execute goal org.apache.maven.plugins:maven-surefire-plugin:2.4.3:test (default-test)
on project core-it-suite: There are test failures.
[ERROR] 
[ERROR] Please refer to /opt/grid/slave/workspace/maven-3.0.x-ITs/jdk/java-5x/label/ubuntu/core-integration-tests/target/surefire-reports
for the individual test results.
[ERROR] -> [Help 1]
org.apache.maven.lifecycle.LifecycleExecutionException: Failed to execute goal org.apache.maven.plugins:maven-surefire-plugin:2.4.3:test
(default-test) on project core-it-suite: There are test failures.

Please refer to /opt/grid/slave/workspace/maven-3.0.x-ITs/jdk/java-5x/label/ubuntu/core-integration-tests/target/surefire-reports
for the individual test results.
	at org.apache.maven.lifecycle.internal.MojoExecutor.execute(MojoExecutor.java:213)
	at org.apache.maven.lifecycle.internal.MojoExecutor.execute(MojoExecutor.java:153)
	at org.apache.maven.lifecycle.internal.MojoExecutor.execute(MojoExecutor.java:145)
	at org.apache.maven.lifecycle.internal.LifecycleModuleBuilder.buildProject(LifecycleModuleBuilder.java:84)
	at org.apache.maven.lifecycle.internal.LifecycleModuleBuilder.buildProject(LifecycleModuleBuilder.java:59)
	at org.apache.maven.lifecycle.internal.LifecycleStarter.singleThreadedBuild(LifecycleStarter.java:183)
	at org.apache.maven.lifecycle.internal.LifecycleStarter.execute(LifecycleStarter.java:161)
	at org.apache.maven.DefaultMaven.doExecute(DefaultMaven.java:319)
	at org.apache.maven.DefaultMaven.execute(DefaultMaven.java:156)
	at org.apache.maven.cli.MavenCli.execute(MavenCli.java:534)
	at org.apache.maven.cli.MavenCli.doMain(MavenCli.java:196)
	at org.apache.maven.cli.MavenCli.main(MavenCli.java:141)
	at sun.reflect.NativeMethodAccessorImpl.invoke0(Native Method)
	at sun.reflect.NativeMethodAccessorImpl.invoke(NativeMethodAccessorImpl.java:39)
	at sun.reflect.DelegatingMethodAccessorImpl.invoke(DelegatingMethodAccessorImpl.java:25)
	at java.lang.reflect.Method.invoke(Method.java:592)
	at org.codehaus.plexus.classworlds.launcher.Launcher.launchEnhanced(Launcher.java:290)
	at org.codehaus.plexus.classworlds.launcher.Launcher.launch(Launcher.java:230)
	at org.codehaus.plexus.classworlds.launcher.Launcher.mainWithExitCode(Launcher.java:409)
	at org.codehaus.plexus.classworlds.launcher.Launcher.main(Launcher.java:352)
Caused by: org.apache.maven.plugin.MojoFailureException: There are test failures.

Please refer to /opt/grid/slave/workspace/maven-3.0.x-ITs/jdk/java-5x/label/ubuntu/core-integration-tests/target/surefire-reports
for the individual test results.
	at org.apache.maven.plugin.surefire.SurefirePlugin.execute(SurefirePlugin.java:575)
	at org.apache.maven.plugin.DefaultBuildPluginManager.executeMojo(DefaultBuildPluginManager.java:107)
	at org.apache.maven.lifecycle.internal.MojoExecutor.execute(MojoExecutor.java:209)
	... 19 more
[ERROR] 
[ERROR] Re-run Maven using the -X switch to enable full debug logging.
[ERROR] 
[ERROR] For more information about the errors and possible solutions, please read the following
articles:
[ERROR] [Help 1] http://cwiki.apache.org/confluence/display/MAVEN/MojoFailureException
Emma: looking for coverage reports in the provided path: core-integration-tests/target/site/emma/coverage.xml


Mime
View raw message