maven-notifications mailing list archives

Site index · List index
Message view « Date » · « Thread »
Top « Date » · « Thread »
From "GRiD .ORG" <bui...@lists.sonatype.com>
Subject Build failed in Hudson: maven-plugins-UTs » java-5x,ubuntu #888
Date Tue, 04 Jan 2011 12:26:30 GMT
See <https://grid.sonatype.org/ci/job/maven-plugins-UTs/./jdk=java-5x,label=ubuntu/888/changes>

Changes:

[Hervé Boutemy] use an artifact with less transitive dependencies

[Hervé Boutemy] use plexus FileUtils.readFile(File) API

[Hervé Boutemy] use plexus FileUtils.readFile(File) API

[Hervé Boutemy] IT optimization: don't generate unused project info reports

------------------------------------------
[...truncated 3741 lines...]
[INFO] Processing war project
[INFO] Copying webapp resources [/opt/grid/slave/workspace/maven-plugins-UTs/jdk/java-5x/label/ubuntu/trunk/maven-war-plugin/target/test-classes/unit/warexplodedmojo/test-dir/testExplodedWarMergeWarLocalFileOverride-test-data/source]
[INFO] Processing overlay [ id wartests:simple]
[INFO] Webapp assembled in [4 msecs]
[INFO] Exploding webapp
[INFO] Assembling webapp [maven-war-plugin-test] in [/opt/grid/slave/workspace/maven-plugins-UTs/jdk/java-5x/label/ubuntu/trunk/maven-war-plugin/target/test-classes/unit/warexplodedmojo/test-dir/ExplodedWar_WithEJB]
[INFO] Processing war project
[INFO] Copying webapp resources [/opt/grid/slave/workspace/maven-plugins-UTs/jdk/java-5x/label/ubuntu/trunk/maven-war-plugin/target/test-classes/unit/warexplodedmojo/test-dir/ExplodedWar_WithEJB-test-data/source]
[INFO] Webapp assembled in [15 msecs]
[INFO] Exploding webapp
[INFO] Assembling webapp [maven-war-plugin-test] in [/opt/grid/slave/workspace/maven-plugins-UTs/jdk/java-5x/label/ubuntu/trunk/maven-war-plugin/target/test-classes/unit/warexplodedmojo/test-dir/ExplodedWarWithJar]
[INFO] Processing war project
[INFO] Copying webapp resources [/opt/grid/slave/workspace/maven-plugins-UTs/jdk/java-5x/label/ubuntu/trunk/maven-war-plugin/target/test-classes/unit/warexplodedmojo/test-dir/ExplodedWarWithJar-test-data/source]
[INFO] Webapp assembled in [5 msecs]
[INFO] Exploding webapp
[INFO] Assembling webapp [maven-war-plugin-test] in [/opt/grid/slave/workspace/maven-plugins-UTs/jdk/java-5x/label/ubuntu/trunk/maven-war-plugin/target/test-classes/unit/warexplodedmojo/test-dir/ExplodedWar_WithEJB]
[INFO] Processing war project
[INFO] Copying webapp resources [/opt/grid/slave/workspace/maven-plugins-UTs/jdk/java-5x/label/ubuntu/trunk/maven-war-plugin/target/test-classes/unit/warexplodedmojo/test-dir/ExplodedWar_WithEJB-test-data/source]
[INFO] Webapp assembled in [5 msecs]
[INFO] Exploding webapp
[INFO] Assembling webapp [maven-war-plugin-test] in [/opt/grid/slave/workspace/maven-plugins-UTs/jdk/java-5x/label/ubuntu/trunk/maven-war-plugin/target/test-classes/unit/warexplodedmojo/test-dir/ExplodedWar_WithTLD]
[INFO] Processing war project
[INFO] Copying webapp resources [/opt/grid/slave/workspace/maven-plugins-UTs/jdk/java-5x/label/ubuntu/trunk/maven-war-plugin/target/test-classes/unit/warexplodedmojo/test-dir/ExplodedWar_WithTLD-test-data/source]
[INFO] Webapp assembled in [5 msecs]
[INFO] Exploding webapp
[INFO] Assembling webapp [maven-war-plugin-test] in [/opt/grid/slave/workspace/maven-plugins-UTs/jdk/java-5x/label/ubuntu/trunk/maven-war-plugin/target/test-classes/unit/warexplodedmojo/test-dir/ExplodedWar_WithPAR]
[INFO] Processing war project
[INFO] Copying webapp resources [/opt/grid/slave/workspace/maven-plugins-UTs/jdk/java-5x/label/ubuntu/trunk/maven-war-plugin/target/test-classes/unit/warexplodedmojo/test-dir/ExplodedWar_WithPAR-test-data/source]
[INFO] Webapp assembled in [5 msecs]
[INFO] Exploding webapp
[INFO] Assembling webapp [maven-war-plugin-test] in [/opt/grid/slave/workspace/maven-plugins-UTs/jdk/java-5x/label/ubuntu/trunk/maven-war-plugin/target/test-classes/unit/warexplodedmojo/test-dir/ExplodedWarWithAar]
[INFO] Processing war project
[INFO] Copying webapp resources [/opt/grid/slave/workspace/maven-plugins-UTs/jdk/java-5x/label/ubuntu/trunk/maven-war-plugin/target/test-classes/unit/warexplodedmojo/test-dir/ExplodedWarWithAar-test-data/source]
[INFO] Webapp assembled in [12 msecs]
[INFO] Exploding webapp
[INFO] Assembling webapp [maven-war-plugin-test] in [/opt/grid/slave/workspace/maven-plugins-UTs/jdk/java-5x/label/ubuntu/trunk/maven-war-plugin/target/test-classes/unit/warexplodedmojo/test-dir/ExplodedWarWithMar]
[INFO] Processing war project
[INFO] Copying webapp resources [/opt/grid/slave/workspace/maven-plugins-UTs/jdk/java-5x/label/ubuntu/trunk/maven-war-plugin/target/test-classes/unit/warexplodedmojo/test-dir/ExplodedWarWithMar-test-data/source]
[INFO] Webapp assembled in [4 msecs]
[INFO] Exploding webapp
[INFO] Assembling webapp [maven-war-plugin-test] in [/opt/grid/slave/workspace/maven-plugins-UTs/jdk/java-5x/label/ubuntu/trunk/maven-war-plugin/target/test-classes/unit/warexplodedmojo/test-dir/ExplodedWar_WithDuplicateDependencies]
[INFO] Processing war project
[INFO] Copying webapp resources [/opt/grid/slave/workspace/maven-plugins-UTs/jdk/java-5x/label/ubuntu/trunk/maven-war-plugin/target/test-classes/unit/warexplodedmojo/test-dir/ExplodedWar_WithDuplicateDependencies-test-data/source]
[INFO] Webapp assembled in [5 msecs]
[INFO] Exploding webapp
[INFO] Assembling webapp [maven-war-plugin-test] in [/opt/grid/slave/workspace/maven-plugins-UTs/jdk/java-5x/label/ubuntu/trunk/maven-war-plugin/target/test-classes/unit/warexplodedmojo/test-dir/ExplodedWar_DuplicateWithClassifier]
[INFO] Processing war project
[INFO] Copying webapp resources [/opt/grid/slave/workspace/maven-plugins-UTs/jdk/java-5x/label/ubuntu/trunk/maven-war-plugin/target/test-classes/unit/warexplodedmojo/test-dir/ExplodedWar_DuplicateWithClassifier-test-data/source]
[INFO] Webapp assembled in [7 msecs]
[INFO] Exploding webapp
[INFO] Assembling webapp [maven-war-plugin-test] in [/opt/grid/slave/workspace/maven-plugins-UTs/jdk/java-5x/label/ubuntu/trunk/maven-war-plugin/target/test-classes/unit/warexplodedmojo/test-dir/ExplodedWar_WithClasses]
[INFO] Processing war project
[INFO] Copying webapp resources [/opt/grid/slave/workspace/maven-plugins-UTs/jdk/java-5x/label/ubuntu/trunk/maven-war-plugin/target/test-classes/unit/warexplodedmojo/test-dir/ExplodedWar_WithClasses-test-data/source]
[INFO] Webapp assembled in [4 msecs]
[INFO] Exploding webapp
[INFO] Assembling webapp [maven-war-plugin-test] in [/opt/grid/slave/workspace/maven-plugins-UTs/jdk/java-5x/label/ubuntu/trunk/maven-war-plugin/target/test-classes/unit/warexplodedmojo/test-dir/ExplodedWar_WithSourceIncludeExclude]
[INFO] Processing war project
[INFO] Copying webapp resources [/opt/grid/slave/workspace/maven-plugins-UTs/jdk/java-5x/label/ubuntu/trunk/maven-war-plugin/target/test-classes/unit/warexplodedmojo/test-dir/ExplodedWar_WithSourceIncludeExclude-test-data/source]
[INFO] Webapp assembled in [2 msecs]
[INFO] Exploding webapp
[INFO] Assembling webapp [maven-war-plugin-test] in [/opt/grid/slave/workspace/maven-plugins-UTs/jdk/java-5x/label/ubuntu/trunk/maven-war-plugin/target/test-classes/unit/warexplodedmojo/test-dir/ExplodedWar_WithWarDependencyIncludeExclude]
[INFO] Processing war project
[INFO] Copying webapp resources [/opt/grid/slave/workspace/maven-plugins-UTs/jdk/java-5x/label/ubuntu/trunk/maven-war-plugin/target/test-classes/unit/warexplodedmojo/test-dir/ExplodedWar_WithWarDependencyIncludeExclude-test-data/source]
[INFO] Processing overlay [ id wartests:war-include-exclude]
[INFO] Webapp assembled in [9 msecs]
[INFO] Exploding webapp
[INFO] Assembling webapp [maven-war-plugin-test] in [/opt/grid/slave/workspace/maven-plugins-UTs/jdk/java-5x/label/ubuntu/trunk/maven-war-plugin/target/test-classes/unit/warexplodedmojo/test-dir/ExplodedWarWithSourceModificationCheck]
[INFO] Processing war project
[INFO] Copying webapp resources [/opt/grid/slave/workspace/maven-plugins-UTs/jdk/java-5x/label/ubuntu/trunk/maven-war-plugin/target/test-classes/unit/warexplodedmojo/test-dir/ExplodedWarWithSourceModificationCheck-test-data/source]
[INFO] Webapp assembled in [5 msecs]
[INFO] Exploding webapp
[INFO] Assembling webapp [maven-war-plugin-test] in [/opt/grid/slave/workspace/maven-plugins-UTs/jdk/java-5x/label/ubuntu/trunk/maven-war-plugin/target/test-classes/unit/warexplodedmojo/test-dir/ExplodedWarWithFileNameMapping]
[INFO] Processing war project
[INFO] Copying webapp resources [/opt/grid/slave/workspace/maven-plugins-UTs/jdk/java-5x/label/ubuntu/trunk/maven-war-plugin/target/test-classes/unit/warexplodedmojo/test-dir/ExplodedWarWithFileNameMapping-test-data/source]
[INFO] Webapp assembled in [11 msecs]
[INFO] Exploding webapp
[INFO] Assembling webapp [maven-war-plugin-test] in [/opt/grid/slave/workspace/maven-plugins-UTs/jdk/java-5x/label/ubuntu/trunk/maven-war-plugin/target/test-classes/unit/warexplodedmojo/test-dir/ExplodedWarWithFileNameMappingAndDuplicateDependencies]
[INFO] Processing war project
[INFO] Copying webapp resources [/opt/grid/slave/workspace/maven-plugins-UTs/jdk/java-5x/label/ubuntu/trunk/maven-war-plugin/target/test-classes/unit/warexplodedmojo/test-dir/ExplodedWarWithFileNameMappingAndDuplicateDependencies-test-data/source]
[INFO] Webapp assembled in [3 msecs]
Tests run: 21, Failures: 0, Errors: 0, Skipped: 0, Time elapsed: 1.459 sec
Running org.apache.maven.plugin.war.WarInPlaceMojoTest
[INFO] Generating webapp in source directory [/opt/grid/slave/workspace/maven-plugins-UTs/jdk/java-5x/label/ubuntu/trunk/maven-war-plugin/target/test-classes/unit/warexplodedinplacemojo/test-dir/SimpleExplodedInplaceWar-test-data/source]
[INFO] Assembling webapp [maven-war-plugin-test] in [/opt/grid/slave/workspace/maven-plugins-UTs/jdk/java-5x/label/ubuntu/trunk/maven-war-plugin/target/test-classes/unit/warexplodedinplacemojo/test-dir/SimpleExplodedInplaceWar-test-data/source]
[INFO] Processing war project
[INFO] Copying webapp webResources [/opt/grid/slave/workspace/maven-plugins-UTs/jdk/java-5x/label/ubuntu/trunk/maven-war-plugin/target/test-classes/unit/warexplodedinplacemojo/test-dir/resources]
to [/opt/grid/slave/workspace/maven-plugins-UTs/jdk/java-5x/label/ubuntu/trunk/maven-war-plugin/target/test-classes/unit/warexplodedinplacemojo/test-dir/SimpleExplodedInplaceWar-test-data/source]
[INFO] Webapp assembled in [3 msecs]
Tests run: 2, Failures: 0, Errors: 0, Skipped: 0, Time elapsed: 0.068 sec
Running org.apache.maven.plugin.war.WarManifestMojoTest
Tests run: 6, Failures: 0, Errors: 0, Skipped: 0, Time elapsed: 0.265 sec
Running org.apache.maven.plugin.war.util.PathSetTest
Tests run: 5, Failures: 0, Errors: 0, Skipped: 0, Time elapsed: 0.005 sec
Running org.apache.maven.plugin.war.util.WarUtilsTest
Tests run: 1, Failures: 0, Errors: 0, Skipped: 0, Time elapsed: 0.002 sec
Running org.apache.maven.plugin.war.overlay.OverlayManagerTest
Tests run: 5, Failures: 0, Errors: 0, Skipped: 0, Time elapsed: 0.184 sec
Running org.apache.maven.plugin.war.WarDependenciesAnalysisTest
[INFO] Exploding webapp
[INFO] Assembling webapp [maven-war-plugin-test] in [/opt/grid/slave/workspace/maven-plugins-UTs/jdk/java-5x/label/ubuntu/trunk/maven-war-plugin/target/test-classes/unit/dependenciesanalysis/test-dir/no-change]
[INFO] Processing war project
[INFO] Copying webapp resources [/opt/grid/slave/workspace/maven-plugins-UTs/jdk/java-5x/label/ubuntu/trunk/maven-war-plugin/target/test-classes/unit/dependenciesanalysis/test-dir/no-change-test-data/source]
[INFO] Webapp assembled in [5 msecs]
[INFO] Exploding webapp
[INFO] Assembling webapp [maven-war-plugin-test] in [/opt/grid/slave/workspace/maven-plugins-UTs/jdk/java-5x/label/ubuntu/trunk/maven-war-plugin/target/test-classes/unit/dependenciesanalysis/test-dir/no-change]
[INFO] Processing war project
[INFO] Copying webapp resources [/opt/grid/slave/workspace/maven-plugins-UTs/jdk/java-5x/label/ubuntu/trunk/maven-war-plugin/target/test-classes/unit/dependenciesanalysis/test-dir/no-change-test-data/source]
[INFO] Webapp assembled in [3 msecs]
[INFO] Exploding webapp
[INFO] Assembling webapp [maven-war-plugin-test] in [/opt/grid/slave/workspace/maven-plugins-UTs/jdk/java-5x/label/ubuntu/trunk/maven-war-plugin/target/test-classes/unit/dependenciesanalysis/test-dir/remove-dependency]
[INFO] Processing war project
[INFO] Copying webapp resources [/opt/grid/slave/workspace/maven-plugins-UTs/jdk/java-5x/label/ubuntu/trunk/maven-war-plugin/target/test-classes/unit/dependenciesanalysis/test-dir/remove-dependency-test-data/source]
[INFO] Webapp assembled in [5 msecs]
[INFO] Exploding webapp
[INFO] Assembling webapp [maven-war-plugin-test] in [/opt/grid/slave/workspace/maven-plugins-UTs/jdk/java-5x/label/ubuntu/trunk/maven-war-plugin/target/test-classes/unit/dependenciesanalysis/test-dir/remove-dependency]
[INFO] Dependency [Dependency {groupId=org.sample.jar, artifactId=lib-test, version=1.0, type=jar}]
has been removed from the project.
[INFO] Processing war project
[INFO] Copying webapp resources [/opt/grid/slave/workspace/maven-plugins-UTs/jdk/java-5x/label/ubuntu/trunk/maven-war-plugin/target/test-classes/unit/dependenciesanalysis/test-dir/remove-dependency-test-data/source]
[INFO] Webapp assembled in [7 msecs]
[INFO] Exploding webapp
[INFO] Assembling webapp [maven-war-plugin-test] in [/opt/grid/slave/workspace/maven-plugins-UTs/jdk/java-5x/label/ubuntu/trunk/maven-war-plugin/target/test-classes/unit/dependenciesanalysis/test-dir/dependency-update-version]
[INFO] Processing war project
[INFO] Copying webapp resources [/opt/grid/slave/workspace/maven-plugins-UTs/jdk/java-5x/label/ubuntu/trunk/maven-war-plugin/target/test-classes/unit/dependenciesanalysis/test-dir/dependency-update-version-test-data/source]
[INFO] Webapp assembled in [4 msecs]
[INFO] Exploding webapp
[INFO] Assembling webapp [maven-war-plugin-test] in [/opt/grid/slave/workspace/maven-plugins-UTs/jdk/java-5x/label/ubuntu/trunk/maven-war-plugin/target/test-classes/unit/dependenciesanalysis/test-dir/dependency-update-version]
[INFO] Version of dependency [Dependency {groupId=org.sample.jar, artifactId=lib-test, version=2.0,
type=jar}] has changed (1.0 -> 2.0).
[INFO] Processing war project
[INFO] Copying webapp resources [/opt/grid/slave/workspace/maven-plugins-UTs/jdk/java-5x/label/ubuntu/trunk/maven-war-plugin/target/test-classes/unit/dependenciesanalysis/test-dir/dependency-update-version-test-data/source]
[INFO] Webapp assembled in [3 msecs]
[INFO] Exploding webapp
[INFO] Assembling webapp [maven-war-plugin-test] in [/opt/grid/slave/workspace/maven-plugins-UTs/jdk/java-5x/label/ubuntu/trunk/maven-war-plugin/target/test-classes/unit/dependenciesanalysis/test-dir/dependency-now-provided]
[INFO] Processing war project
[INFO] Copying webapp resources [/opt/grid/slave/workspace/maven-plugins-UTs/jdk/java-5x/label/ubuntu/trunk/maven-war-plugin/target/test-classes/unit/dependenciesanalysis/test-dir/dependency-now-provided-test-data/source]
[INFO] Webapp assembled in [4 msecs]
[INFO] Exploding webapp
[INFO] Assembling webapp [maven-war-plugin-test] in [/opt/grid/slave/workspace/maven-plugins-UTs/jdk/java-5x/label/ubuntu/trunk/maven-war-plugin/target/test-classes/unit/dependenciesanalysis/test-dir/dependency-now-provided]
[INFO] Scope of dependency [Dependency {groupId=org.sample.jar, artifactId=lib-test, version=1.0,
type=jar}] has changed (runtime -> provided).
[INFO] Processing war project
[INFO] Copying webapp resources [/opt/grid/slave/workspace/maven-plugins-UTs/jdk/java-5x/label/ubuntu/trunk/maven-war-plugin/target/test-classes/unit/dependenciesanalysis/test-dir/dependency-now-provided-test-data/source]
[INFO] Webapp assembled in [14 msecs]
Tests run: 4, Failures: 0, Errors: 0, Skipped: 0, Time elapsed: 0.244 sec

Results :

Tests run: 83, Failures: 0, Errors: 0, Skipped: 0

[INFO] [jar:jar {execution: default-jar}]
[INFO] Building jar: /opt/grid/slave/workspace/maven-plugins-UTs/jdk/java-5x/label/ubuntu/trunk/maven-war-plugin/target/maven-war-plugin-2.2-SNAPSHOT.jar
[INFO] [plugin:addPluginArtifactMetadata {execution: default-addPluginArtifactMetadata}]
[INFO] [install:install {execution: default-install}]
[INFO] Installing /opt/grid/slave/workspace/maven-plugins-UTs/jdk/java-5x/label/ubuntu/trunk/maven-war-plugin/target/maven-war-plugin-2.2-SNAPSHOT.jar
to <https://grid.sonatype.org/ci/job/maven-plugins-UTs/./jdk=java-5x,label=ubuntu/ws/.repository/org/apache/maven/plugins/maven-war-plugin/2.2-SNAPSHOT/maven-war-plugin-2.2-SNAPSHOT.jar>
[INFO] ------------------------------------------------------------------------
[INFO] Building Maven Plugins Aggregator
[INFO]    task-segment: [clean, install]
[INFO] ------------------------------------------------------------------------
[INFO] [clean:clean {execution: default-clean}]
[INFO] Deleting /opt/grid/slave/workspace/maven-plugins-UTs/jdk/java-5x/label/ubuntu/trunk/target
[INFO] [remote-resources:process {execution: default}]
[INFO] [site:attach-descriptor {execution: default-attach-descriptor}]
[INFO] [install:install {execution: default-install}]
[INFO] Installing /opt/grid/slave/workspace/maven-plugins-UTs/jdk/java-5x/label/ubuntu/trunk/pom.xml
to <https://grid.sonatype.org/ci/job/maven-plugins-UTs/./jdk=java-5x,label=ubuntu/ws/.repository/org/apache/maven/plugins/maven-plugins-aggregator/1-SNAPSHOT/maven-plugins-aggregator-1-SNAPSHOT.pom>
[INFO] 
[INFO] 
[INFO] ------------------------------------------------------------------------
[INFO] Reactor Summary:
[INFO] ------------------------------------------------------------------------
[INFO] Maven Plugins ......................................... SUCCESS [13.029s]
[INFO] Maven Ant Plugin ...................................... SUCCESS [22.773s]
[INFO] Maven AntRun Plugin ................................... SUCCESS [4.343s]
[INFO] Maven Eclipse Plugin .................................. SUCCESS [46.859s]
[INFO] Maven Changelog Plugin ................................ SUCCESS [13.899s]
[INFO] Maven Changes Report Plugin ........................... SUCCESS [14.444s]
[INFO] Maven Checkstyle Plugin ............................... SUCCESS [25.181s]
[INFO] Maven Clean Plugin .................................... SUCCESS [5.878s]
[INFO] Maven Compiler Plugin ................................. SUCCESS [8.937s]
[INFO] Maven Dependency Plugin ............................... SUCCESS [2:53.795s]
[INFO] Maven Deploy Plugin ................................... SUCCESS [7.387s]
[INFO] Maven DOAP Plugin ..................................... SUCCESS [15.060s]
[INFO] Maven Documentation Checker Plugin .................... SUCCESS [2.691s]
[INFO] Maven EAR Plugin ...................................... SUCCESS [10.428s]
[INFO] Maven EJB Plugin ...................................... SUCCESS [13.868s]
[INFO] Maven GPG Plugin ...................................... SUCCESS [2.906s]
[INFO] Maven Help Plugin ..................................... SUCCESS [5.374s]
[INFO] Maven IDEA Plugin ..................................... SUCCESS [17.612s]
[INFO] Maven Install Plugin .................................. SUCCESS [6.197s]
[INFO] Maven Invoker Plugin .................................. SUCCESS [12.152s]
[INFO] Maven JAR Plugin ...................................... SUCCESS [4.262s]
[INFO] Maven Jarsigner Plugin ................................ SUCCESS [3.341s]
[INFO] Maven Shade Plugin .................................... SUCCESS [9.992s]
[INFO] Maven Javadoc Plugin .................................. SUCCESS [4:05.007s]
[INFO] Maven Linkcheck Plugin ................................ SUCCESS [3.889s]
[INFO] Maven One Plugin ...................................... SUCCESS [2.024s]
[INFO] Maven Patch Plugin .................................... SUCCESS [2.503s]
[INFO] Maven PDF Plugin ...................................... FAILED [2:52.014s]
[INFO] Maven PMD Plugin ...................................... SUCCESS [12.295s]
[INFO] Maven RAR Plugin ...................................... SUCCESS [7.448s]
[INFO] Maven Reactor Plugin .................................. SUCCESS [2.933s]
[INFO] Maven Repository Plugin ............................... SUCCESS [7.964s]
[INFO] Maven Resources Plugin ................................ SUCCESS [7.469s]
[INFO] Maven Site Plugin ..................................... SUCCESS [7.814s]
[INFO] Maven Source Plugin ................................... SUCCESS [9.489s]
[INFO] Maven Stage Plugin .................................... SUCCESS [2.278s]
[INFO] Maven Toolchains Plugin ............................... SUCCESS [3.365s]
[INFO] Maven Verifier Plugin ................................. SUCCESS [4.799s]
[INFO] Maven WAR Plugin ...................................... SUCCESS [29.148s]
[INFO] Maven Plugins Aggregator .............................. SUCCESS [0.049s]
[INFO] ------------------------------------------------------------------------
[INFO] Error for project: Maven PDF Plugin (during install)
[INFO] ------------------------------------------------------------------------
[INFO] There are test failures.

Please refer to /opt/grid/slave/workspace/maven-plugins-UTs/jdk/java-5x/label/ubuntu/trunk/maven-pdf-plugin/target/surefire-reports
for the individual test results.
[INFO] ------------------------------------------------------------------------
[INFO] Trace
org.apache.maven.BuildFailureException: There are test failures.

Please refer to /opt/grid/slave/workspace/maven-plugins-UTs/jdk/java-5x/label/ubuntu/trunk/maven-pdf-plugin/target/surefire-reports
for the individual test results.
	at org.apache.maven.lifecycle.DefaultLifecycleExecutor.executeGoals(DefaultLifecycleExecutor.java:715)
	at org.apache.maven.lifecycle.DefaultLifecycleExecutor.executeGoalWithLifecycle(DefaultLifecycleExecutor.java:556)
	at org.apache.maven.lifecycle.DefaultLifecycleExecutor.executeGoal(DefaultLifecycleExecutor.java:535)
	at org.apache.maven.lifecycle.DefaultLifecycleExecutor.executeGoalAndHandleFailures(DefaultLifecycleExecutor.java:387)
	at org.apache.maven.lifecycle.DefaultLifecycleExecutor.executeTaskSegments(DefaultLifecycleExecutor.java:348)
	at org.apache.maven.lifecycle.DefaultLifecycleExecutor.execute(DefaultLifecycleExecutor.java:180)
	at org.apache.maven.DefaultMaven.doExecute(DefaultMaven.java:328)
	at org.apache.maven.DefaultMaven.execute(DefaultMaven.java:138)
	at org.apache.maven.cli.MavenCli.main(MavenCli.java:362)
	at org.apache.maven.cli.compat.CompatibleMain.main(CompatibleMain.java:60)
	at sun.reflect.NativeMethodAccessorImpl.invoke0(Native Method)
	at sun.reflect.NativeMethodAccessorImpl.invoke(NativeMethodAccessorImpl.java:39)
	at sun.reflect.DelegatingMethodAccessorImpl.invoke(DelegatingMethodAccessorImpl.java:25)
	at java.lang.reflect.Method.invoke(Method.java:592)
	at org.codehaus.classworlds.Launcher.launchEnhanced(Launcher.java:315)
	at org.codehaus.classworlds.Launcher.launch(Launcher.java:255)
	at org.codehaus.classworlds.Launcher.mainWithExitCode(Launcher.java:430)
	at org.codehaus.classworlds.Launcher.main(Launcher.java:375)
Caused by: org.apache.maven.plugin.MojoFailureException: There are test failures.

Please refer to /opt/grid/slave/workspace/maven-plugins-UTs/jdk/java-5x/label/ubuntu/trunk/maven-pdf-plugin/target/surefire-reports
for the individual test results.
	at org.apache.maven.plugin.surefire.SurefirePlugin.execute(SurefirePlugin.java:575)
	at org.apache.maven.plugin.DefaultPluginManager.executeMojo(DefaultPluginManager.java:490)
	at org.apache.maven.lifecycle.DefaultLifecycleExecutor.executeGoals(DefaultLifecycleExecutor.java:694)
	... 17 more
[INFO] ------------------------------------------------------------------------
[INFO] BUILD ERRORS
[INFO] ------------------------------------------------------------------------
[INFO] Total time: 16 minutes 12 seconds
[INFO] Finished at: Tue Jan 04 06:26:30 CST 2011
[INFO] Final Memory: 173M/242M
[INFO] ------------------------------------------------------------------------


Mime
View raw message