maven-notifications mailing list archives

Site index · List index
Message view « Date » · « Thread »
Top « Date » · « Thread »
From "GRiD .ORG" <bui...@lists.sonatype.com>
Subject Build failed in Hudson: maven-plugins-ITs » java-5x,windows #641
Date Mon, 14 Mar 2011 07:12:31 GMT
See <https://grid.sonatype.org/ci/job/maven-plugins-ITs/./jdk=java-5x,label=windows/641/changes>

Changes:

[Olivier Lamy] upgrade to last parent.

[Hervé Boutemy] improved error message, since this tests fails sometimes on grid on Windows

------------------------------------------
[...truncated 6810 lines...]
[INFO] outputDirectory: X:\slave\workspace\maven-plugins-ITs\jdk\java-5x\label\windows\trunk\maven-remote-resources-plugin\target\generated-sources\modello
[INFO] Working on model: src/main/mdo/supplemental-model.mdo
[INFO] Generating current version: 1.0.0
[INFO] 
[INFO] --- modello-maven-plugin:1.4.1:xpp3-reader (supplemental-models) @ maven-remote-resources-plugin
---
[INFO] outputDirectory: X:\slave\workspace\maven-plugins-ITs\jdk\java-5x\label\windows\trunk\maven-remote-resources-plugin\target\generated-sources\modello
[INFO] Working on model: src/main/mdo/supplemental-model.mdo
[INFO] Generating current version: 1.0.0
[INFO] 
[INFO] --- maven-plugin-plugin:2.7:descriptor (default-descriptor) @ maven-remote-resources-plugin
---
[INFO] Using 'UTF-8' encoding to read mojo metadata.
[INFO] Applying mojo extractor for language: java
[INFO] Mojo extractor for language: java found 3 mojo descriptors.
[INFO] Applying mojo extractor for language: bsh
[INFO] Mojo extractor for language: bsh found 0 mojo descriptors.
[INFO] 
[INFO] --- maven-remote-resources-plugin:1.1:process (default) @ maven-remote-resources-plugin
---
[INFO] 
[INFO] --- maven-resources-plugin:2.4.3:resources (default-resources) @ maven-remote-resources-plugin
---
[INFO] Using 'UTF-8' encoding to copy filtered resources.
[INFO] Copying 1 resource
[INFO] Copying 3 resources
[INFO] 
[INFO] --- maven-compiler-plugin:2.3.2:compile (default-compile) @ maven-remote-resources-plugin
---
[INFO] Compiling 11 source files to X:\slave\workspace\maven-plugins-ITs\jdk\java-5x\label\windows\trunk\maven-remote-resources-plugin\target\classes
[INFO] 
[INFO] --- maven-resources-plugin:2.4.3:testResources (default-testResources) @ maven-remote-resources-plugin
---
[INFO] Using 'UTF-8' encoding to copy filtered resources.
[INFO] Copying 7 resources
[INFO] Copying 42 resources
[INFO] Copying 1 resource
[INFO] Copying 3 resources
[INFO] 
[INFO] --- maven-compiler-plugin:2.3.2:testCompile (default-testCompile) @ maven-remote-resources-plugin
---
[INFO] Compiling 17 source files to X:\slave\workspace\maven-plugins-ITs\jdk\java-5x\label\windows\trunk\maven-remote-resources-plugin\target\test-classes
[INFO] 
[INFO] --- maven-surefire-plugin:2.7.2:test (default-test) @ maven-remote-resources-plugin
---
[INFO] Surefire report directory: X:\slave\workspace\maven-plugins-ITs\jdk\java-5x\label\windows\trunk\maven-remote-resources-plugin\target\surefire-reports

-------------------------------------------------------
 T E S T S
-------------------------------------------------------
Running org.apache.maven.plugin.resources.remote.RemoteResourcesMojoTest
[INFO] Setting property: classpath.resource.loader.class => 'org.codehaus.plexus.velocity.ContextClassLoaderResourceLoader'.
[INFO] Setting property: velocimacro.messages.on => 'false'.
[INFO] Setting property: resource.loader => 'classpath'.
[INFO] Setting property: resource.manager.logwhenfound => 'false'.
[INFO] Setting property: classpath.resource.loader.class => 'org.codehaus.plexus.velocity.ContextClassLoaderResourceLoader'.
[INFO] Setting property: velocimacro.messages.on => 'false'.
[INFO] Setting property: resource.loader => 'classpath'.
[INFO] Setting property: resource.manager.logwhenfound => 'false'.
[INFO] Setting property: classpath.resource.loader.class => 'org.codehaus.plexus.velocity.ContextClassLoaderResourceLoader'.
[INFO] Setting property: velocimacro.messages.on => 'false'.
[INFO] Setting property: resource.loader => 'classpath'.
[INFO] Setting property: resource.manager.logwhenfound => 'false'.
[INFO] Setting property: classpath.resource.loader.class => 'org.codehaus.plexus.velocity.ContextClassLoaderResourceLoader'.
[INFO] Setting property: velocimacro.messages.on => 'false'.
[INFO] Setting property: resource.loader => 'classpath'.
[INFO] Setting property: resource.manager.logwhenfound => 'false'.
[INFO] Setting property: classpath.resource.loader.class => 'org.codehaus.plexus.velocity.ContextClassLoaderResourceLoader'.
[INFO] Setting property: velocimacro.messages.on => 'false'.
[INFO] Setting property: resource.loader => 'classpath'.
[INFO] Setting property: resource.manager.logwhenfound => 'false'.
[INFO] Setting property: classpath.resource.loader.class => 'org.codehaus.plexus.velocity.ContextClassLoaderResourceLoader'.
[INFO] Setting property: velocimacro.messages.on => 'false'.
[INFO] Setting property: resource.loader => 'classpath'.
[INFO] Setting property: resource.manager.logwhenfound => 'false'.
[INFO] Setting property: classpath.resource.loader.class => 'org.codehaus.plexus.velocity.ContextClassLoaderResourceLoader'.
[INFO] Setting property: velocimacro.messages.on => 'false'.
[INFO] Setting property: resource.loader => 'classpath'.
[INFO] Setting property: resource.manager.logwhenfound => 'false'.
Tests run: 8, Failures: 0, Errors: 0, Skipped: 0, Time elapsed: 1.582 sec

Results :

Tests run: 8, Failures: 0, Errors: 0, Skipped: 0

[INFO] 
[INFO] --- maven-jar-plugin:2.3.1:jar (default-jar) @ maven-remote-resources-plugin ---
[INFO] Building jar: X:\slave\workspace\maven-plugins-ITs\jdk\java-5x\label\windows\trunk\maven-remote-resources-plugin\target\maven-remote-resources-plugin-1.3-SNAPSHOT.jar
[INFO] 
[INFO] --- maven-plugin-plugin:2.7:addPluginArtifactMetadata (default-addPluginArtifactMetadata)
@ maven-remote-resources-plugin ---
[INFO] 
[INFO] --- maven-invoker-plugin:1.5:install (install-descriptor) @ maven-remote-resources-plugin
---
[INFO] Installing X:\slave\workspace\maven-plugins-ITs\jdk\java-5x\label\windows\trunk\maven-remote-resources-plugin\pom.xml
to X:\slave\workspace\maven-plugins-ITs\jdk\java-5x\label\windows\trunk\maven-remote-resources-plugin\target\it-repo\org\apache\maven\plugins\maven-remote-resources-plugin\1.3-SNAPSHOT\maven-remote-resources-plugin-1.3-SNAPSHOT.pom
[INFO] Installing X:\slave\workspace\maven-plugins-ITs\jdk\java-5x\label\windows\trunk\maven-remote-resources-plugin\target\maven-remote-resources-plugin-1.3-SNAPSHOT.jar
to X:\slave\workspace\maven-plugins-ITs\jdk\java-5x\label\windows\trunk\maven-remote-resources-plugin\target\it-repo\org\apache\maven\plugins\maven-remote-resources-plugin\1.3-SNAPSHOT\maven-remote-resources-plugin-1.3-SNAPSHOT.jar
[INFO] 
[INFO] --- maven-surefire-plugin:2.7.2:test (integration-tests) @ maven-remote-resources-plugin
---
[INFO] Surefire report directory: X:\slave\workspace\maven-plugins-ITs\jdk\java-5x\label\windows\trunk\maven-remote-resources-plugin\target\surefire-reports

-------------------------------------------------------
 T E S T S
-------------------------------------------------------
Running org.apache.maven.plugin.resources.remote.it.IT_BadDependencyPoms
Tests run: 1, Failures: 0, Errors: 0, Skipped: 0, Time elapsed: 22.692 sec
Running org.apache.maven.plugin.resources.remote.it.IT_CustomFilterDelimiter
Tests run: 1, Failures: 0, Errors: 0, Skipped: 0, Time elapsed: 3.818 sec
Running org.apache.maven.plugin.resources.remote.it.IT_FilterLocalOverride
Tests run: 1, Failures: 0, Errors: 0, Skipped: 0, Time elapsed: 3.624 sec
Running org.apache.maven.plugin.resources.remote.it.IT_GenerateFromBundle
Tests run: 1, Failures: 0, Errors: 0, Skipped: 0, Time elapsed: 3.514 sec
Running org.apache.maven.plugin.resources.remote.it.IT_GenerateFromOverride
Tests run: 1, Failures: 0, Errors: 0, Skipped: 0, Time elapsed: 3.554 sec
Running org.apache.maven.plugin.resources.remote.it.IT_GetDependencyProjects
Tests run: 1, Failures: 0, Errors: 0, Skipped: 0, Time elapsed: 12.174 sec
Running org.apache.maven.plugin.resources.remote.it.IT_RunOnlyAtExecutionRoot
Tests run: 1, Failures: 0, Errors: 0, Skipped: 0, Time elapsed: 12.572 sec
Running org.apache.maven.plugin.resources.remote.it.IT_SupplementalArtifact
Tests run: 1, Failures: 0, Errors: 0, Skipped: 0, Time elapsed: 9.683 sec

Results :

Tests run: 8, Failures: 0, Errors: 0, Skipped: 0

[INFO] 
[INFO] --- maven-install-plugin:2.3.1:install (default-install) @ maven-remote-resources-plugin
---
[INFO] Installing X:\slave\workspace\maven-plugins-ITs\jdk\java-5x\label\windows\trunk\maven-remote-resources-plugin\target\maven-remote-resources-plugin-1.3-SNAPSHOT.jar
to x:\slave\workspace\maven-plugins-ITs\jdk\java-5x\label\windows\.repository\org\apache\maven\plugins\maven-remote-resources-plugin\1.3-SNAPSHOT\maven-remote-resources-plugin-1.3-SNAPSHOT.jar
[INFO] Installing X:\slave\workspace\maven-plugins-ITs\jdk\java-5x\label\windows\trunk\maven-remote-resources-plugin\pom.xml
to x:\slave\workspace\maven-plugins-ITs\jdk\java-5x\label\windows\.repository\org\apache\maven\plugins\maven-remote-resources-plugin\1.3-SNAPSHOT\maven-remote-resources-plugin-1.3-SNAPSHOT.pom
[INFO] 
[INFO] --- maven-deploy-plugin:2.5:deploy (default-deploy) @ maven-remote-resources-plugin
---
Downloading: file:/opt/repos/deploy-junk/org/apache/maven/plugins/maven-remote-resources-plugin/1.3-SNAPSHOT/maven-metadata.xml
Downloaded: file:/opt/repos/deploy-junk/org/apache/maven/plugins/maven-remote-resources-plugin/1.3-SNAPSHOT/maven-metadata.xml
(800 B at 19.1 KB/sec)
Uploading: file:/opt/repos/deploy-junk/org/apache/maven/plugins/maven-remote-resources-plugin/1.3-SNAPSHOT/maven-remote-resources-plugin-1.3-20110314.071229-17.jar
Uploaded: file:/opt/repos/deploy-junk/org/apache/maven/plugins/maven-remote-resources-plugin/1.3-SNAPSHOT/maven-remote-resources-plugin-1.3-20110314.071229-17.jar
(63 KB at 3499.2 KB/sec)
Uploading: file:/opt/repos/deploy-junk/org/apache/maven/plugins/maven-remote-resources-plugin/1.3-SNAPSHOT/maven-remote-resources-plugin-1.3-20110314.071229-17.pom
Uploaded: file:/opt/repos/deploy-junk/org/apache/maven/plugins/maven-remote-resources-plugin/1.3-SNAPSHOT/maven-remote-resources-plugin-1.3-20110314.071229-17.pom
(13 KB at 1553.5 KB/sec)
Downloading: file:/opt/repos/deploy-junk/org/apache/maven/plugins/maven-remote-resources-plugin/maven-metadata.xml
Downloaded: file:/opt/repos/deploy-junk/org/apache/maven/plugins/maven-remote-resources-plugin/maven-metadata.xml
(383 B at 93.5 KB/sec)
Downloading: file:/opt/repos/deploy-junk/org/apache/maven/plugins/maven-metadata.xml
Downloaded: file:/opt/repos/deploy-junk/org/apache/maven/plugins/maven-metadata.xml (7 KB
at 1712.6 KB/sec)
Uploading: file:/opt/repos/deploy-junk/org/apache/maven/plugins/maven-remote-resources-plugin/1.3-SNAPSHOT/maven-metadata.xml
Uploaded: file:/opt/repos/deploy-junk/org/apache/maven/plugins/maven-remote-resources-plugin/1.3-SNAPSHOT/maven-metadata.xml
(800 B at 195.3 KB/sec)
Uploading: file:/opt/repos/deploy-junk/org/apache/maven/plugins/maven-remote-resources-plugin/maven-metadata.xml
Uploaded: file:/opt/repos/deploy-junk/org/apache/maven/plugins/maven-remote-resources-plugin/maven-metadata.xml
(383 B at 187.0 KB/sec)
Uploading: file:/opt/repos/deploy-junk/org/apache/maven/plugins/maven-metadata.xml
Uploaded: file:/opt/repos/deploy-junk/org/apache/maven/plugins/maven-metadata.xml (7 KB at
2283.5 KB/sec)
[INFO]                                                                         
[INFO] ------------------------------------------------------------------------
[INFO] Building Maven Plugins Aggregator 1-SNAPSHOT
[INFO] ------------------------------------------------------------------------
[INFO] 
[INFO] --- maven-clean-plugin:2.4.1:clean (default-clean) @ maven-plugins-aggregator ---
[INFO] Deleting x:\slave\workspace\maven-plugins-ITs\jdk\java-5x\label\windows\trunk\target
[INFO] 
[INFO] --- maven-remote-resources-plugin:1.1:process (default) @ maven-plugins-aggregator
---
[INFO] 
[INFO] --- maven-install-plugin:2.3.1:install (default-install) @ maven-plugins-aggregator
---
[INFO] Installing x:\slave\workspace\maven-plugins-ITs\jdk\java-5x\label\windows\trunk\pom.xml
to x:\slave\workspace\maven-plugins-ITs\jdk\java-5x\label\windows\.repository\org\apache\maven\plugins\maven-plugins-aggregator\1-SNAPSHOT\maven-plugins-aggregator-1-SNAPSHOT.pom
[INFO] 
[INFO] --- maven-deploy-plugin:2.5:deploy (default-deploy) @ maven-plugins-aggregator ---
Downloading: file:/opt/repos/deploy-junk/org/apache/maven/plugins/maven-plugins-aggregator/1-SNAPSHOT/maven-metadata.xml
Downloaded: file:/opt/repos/deploy-junk/org/apache/maven/plugins/maven-plugins-aggregator/1-SNAPSHOT/maven-metadata.xml
(619 B at 26.3 KB/sec)
Uploading: file:/opt/repos/deploy-junk/org/apache/maven/plugins/maven-plugins-aggregator/1-SNAPSHOT/maven-plugins-aggregator-1-20110314.071229-43.pom
Uploaded: file:/opt/repos/deploy-junk/org/apache/maven/plugins/maven-plugins-aggregator/1-SNAPSHOT/maven-plugins-aggregator-1-20110314.071229-43.pom
(4 KB at 180.4 KB/sec)
Downloading: file:/opt/repos/deploy-junk/org/apache/maven/plugins/maven-plugins-aggregator/maven-metadata.xml
Downloaded: file:/opt/repos/deploy-junk/org/apache/maven/plugins/maven-plugins-aggregator/maven-metadata.xml
(304 B at 59.4 KB/sec)
Uploading: file:/opt/repos/deploy-junk/org/apache/maven/plugins/maven-plugins-aggregator/1-SNAPSHOT/maven-metadata.xml
Uploaded: file:/opt/repos/deploy-junk/org/apache/maven/plugins/maven-plugins-aggregator/1-SNAPSHOT/maven-metadata.xml
(619 B at 151.1 KB/sec)
Uploading: file:/opt/repos/deploy-junk/org/apache/maven/plugins/maven-plugins-aggregator/maven-metadata.xml
Uploaded: file:/opt/repos/deploy-junk/org/apache/maven/plugins/maven-plugins-aggregator/maven-metadata.xml
(304 B at 99.0 KB/sec)
[INFO] ------------------------------------------------------------------------
[INFO] Reactor Summary:
[INFO] 
[INFO] Maven Plugins ..................................... SUCCESS [10.923s]
[INFO] Maven Ant Plugin .................................. SUCCESS [2:16.430s]
[INFO] Maven AntRun Plugin ............................... SUCCESS [1:19.312s]
[INFO] Maven Eclipse Plugin .............................. SUCCESS [10:46.749s]
[INFO] Maven Changelog Plugin ............................ SUCCESS [1:00.386s]
[INFO] Maven Changes Report Plugin ....................... SUCCESS [1:26.347s]
[INFO] Maven Checkstyle Plugin ........................... SUCCESS [1:53.555s]
[INFO] Maven Clean Plugin ................................ SUCCESS [22.963s]
[INFO] Maven Compiler Plugin ............................. SUCCESS [27.700s]
[INFO] Maven Dependency Plugin ........................... SUCCESS [2:30.592s]
[INFO] Maven Deploy Plugin ............................... SUCCESS [2:02.282s]
[INFO] Maven DOAP Plugin ................................. SUCCESS [28.368s]
[INFO] Maven Documentation Checker Plugin ................ SUCCESS [7.622s]
[INFO] Maven EAR Plugin .................................. SUCCESS [3:42.535s]
[INFO] Maven EJB Plugin .................................. SUCCESS [38.523s]
[INFO] Maven GPG Plugin .................................. SUCCESS [42.349s]
[INFO] Maven Help Plugin ................................. SUCCESS [1:03.115s]
[INFO] Maven IDEA Plugin ................................. SUCCESS [13.266s]
[INFO] Maven Install Plugin .............................. SUCCESS [1:15.652s]
[INFO] Maven Invoker Plugin .............................. SUCCESS [4:56.068s]
[INFO] Maven JAR Plugin .................................. SUCCESS [1:54.250s]
[INFO] Maven Jarsigner Plugin ............................ SUCCESS [1:01.344s]
[INFO] Maven Javadoc Plugin .............................. SUCCESS [9:02.476s]
[INFO] Maven Linkcheck Plugin ............................ SUCCESS [2.474s]
[INFO] Maven One Plugin .................................. SUCCESS [3.431s]
[INFO] Maven Patch Plugin ................................ SUCCESS [15.639s]
[INFO] Maven PDF Plugin .................................. SUCCESS [34.680s]
[INFO] Maven PMD Plugin .................................. SUCCESS [1:05.340s]
[INFO] Maven RAR Plugin .................................. SUCCESS [11.201s]
[INFO] Maven Reactor Plugin .............................. SUCCESS [4.087s]
[INFO] Maven Repository Plugin ........................... SUCCESS [1:45.977s]
[INFO] Maven Resources Plugin ............................ SUCCESS [1:05.849s]
[INFO] Maven Shade Plugin ................................ SUCCESS [2:52.792s]
[INFO] Maven Site Plugin ................................. FAILURE [46.382s]
[INFO] Maven Source Plugin ............................... SUCCESS [43.856s]
[INFO] Maven Stage Plugin ................................ SUCCESS [2.494s]
[INFO] Maven Toolchains Plugin ........................... SUCCESS [2.579s]
[INFO] Maven Verifier Plugin ............................. SUCCESS [14.572s]
[INFO] Maven WAR Plugin .................................. SUCCESS [1:36.268s]
[INFO] Maven Project Info Reports Plugin ................. SUCCESS [3:00.250s]
[INFO] Maven Remote Resources Plugin ..................... SUCCESS [1:20.844s]
[INFO] Maven Plugins Aggregator .......................... SUCCESS [0.104s]
[INFO] ------------------------------------------------------------------------
[INFO] BUILD FAILURE
[INFO] ------------------------------------------------------------------------
[INFO] Total time: 1:05:13.519s
[INFO] Finished at: Mon Mar 14 00:12:29 PDT 2011
[INFO] Final Memory: 54M/99M
[INFO] ------------------------------------------------------------------------
[ERROR] Failed to execute goal org.apache.maven.plugins:maven-invoker-plugin:1.5:run (integration-test)
on project maven-site-plugin: 1 build failed. -> [Help 1]
org.apache.maven.lifecycle.LifecycleExecutionException: Failed to execute goal org.apache.maven.plugins:maven-invoker-plugin:1.5:run
(integration-test) on project maven-site-plugin: 1 build failed.
	at org.apache.maven.lifecycle.internal.MojoExecutor.execute(MojoExecutor.java:213)
	at org.apache.maven.lifecycle.internal.MojoExecutor.execute(MojoExecutor.java:153)
	at org.apache.maven.lifecycle.internal.MojoExecutor.execute(MojoExecutor.java:145)
	at org.apache.maven.lifecycle.internal.LifecycleModuleBuilder.buildProject(LifecycleModuleBuilder.java:84)
	at org.apache.maven.lifecycle.internal.LifecycleModuleBuilder.buildProject(LifecycleModuleBuilder.java:59)
	at org.apache.maven.lifecycle.internal.LifecycleStarter.singleThreadedBuild(LifecycleStarter.java:183)
	at org.apache.maven.lifecycle.internal.LifecycleStarter.execute(LifecycleStarter.java:161)
	at org.apache.maven.DefaultMaven.doExecute(DefaultMaven.java:319)
	at org.apache.maven.DefaultMaven.execute(DefaultMaven.java:156)
	at org.apache.maven.cli.MavenCli.execute(MavenCli.java:537)
	at org.apache.maven.cli.MavenCli.doMain(MavenCli.java:196)
	at org.apache.maven.cli.MavenCli.main(MavenCli.java:141)
	at sun.reflect.NativeMethodAccessorImpl.invoke0(Native Method)
	at sun.reflect.NativeMethodAccessorImpl.invoke(NativeMethodAccessorImpl.java:39)
	at sun.reflect.DelegatingMethodAccessorImpl.invoke(DelegatingMethodAccessorImpl.java:25)
	at java.lang.reflect.Method.invoke(Method.java:592)
	at org.codehaus.plexus.classworlds.launcher.Launcher.launchEnhanced(Launcher.java:290)
	at org.codehaus.plexus.classworlds.launcher.Launcher.launch(Launcher.java:230)
	at org.codehaus.plexus.classworlds.launcher.Launcher.mainWithExitCode(Launcher.java:409)
	at org.codehaus.plexus.classworlds.launcher.Launcher.main(Launcher.java:352)
Caused by: org.apache.maven.plugin.MojoFailureException: 1 build failed.
	at org.apache.maven.plugin.invoker.InvokerSession.handleFailures(InvokerSession.java:263)
	at org.apache.maven.plugin.invoker.InvokerMojo.processResults(InvokerMojo.java:58)
	at org.apache.maven.plugin.invoker.AbstractInvokerMojo.execute(AbstractInvokerMojo.java:620)
	at org.apache.maven.plugin.DefaultBuildPluginManager.executeMojo(DefaultBuildPluginManager.java:101)
	at org.apache.maven.lifecycle.internal.MojoExecutor.execute(MojoExecutor.java:209)
	... 19 more
[ERROR] 
[ERROR] Re-run Maven using the -X switch to enable full debug logging.
[ERROR] 
[ERROR] For more information about the errors and possible solutions, please read the following
articles:
[ERROR] [Help 1] http://cwiki.apache.org/confluence/display/MAVEN/MojoFailureException
[ERROR] 
[ERROR] After correcting the problems, you can resume the build with the command
[ERROR]   mvn <goals> -rf :maven-site-plugin


Mime
View raw message