maven-notifications mailing list archives

Site index · List index
Message view « Date » · « Thread »
Top « Date » · « Thread »
From "GRiD .ORG" <bui...@lists.sonatype.com>
Subject Build failed in Hudson: surefire » java-5x,ubuntu #248
Date Thu, 03 Mar 2011 12:18:47 GMT
See <https://grid.sonatype.org/ci/job/surefire/./jdk=java-5x,label=ubuntu/248/changes>

Changes:

[Lukas Theussl] [SUREFIRE-566] upgrade to doxia 1.1

------------------------------------------
[...truncated 961 lines...]
Tests run: 1, Failures: 0, Errors: 0, Skipped: 0, Time elapsed: 5.694 sec
Running org.apache.maven.surefire.its.Surefire257NotRerunningTestsIT
Tests run: 1, Failures: 0, Errors: 1, Skipped: 0, Time elapsed: 15.104 sec <<< FAILURE!
Running org.apache.maven.surefire.its.Surefire408ManualProviderSelectionIT
Tests run: 1, Failures: 0, Errors: 0, Skipped: 0, Time elapsed: 7.944 sec
Running org.apache.maven.surefire.its.PlexusConflictIT
Tests run: 2, Failures: 0, Errors: 0, Skipped: 0, Time elapsed: 7.663 sec
Running org.apache.maven.surefire.its.SiblingAggregatorIT
Tests run: 1, Failures: 0, Errors: 0, Skipped: 0, Time elapsed: 4.215 sec
Running org.apache.maven.surefire.its.Surefire673MockitoIT
Tests run: 1, Failures: 0, Errors: 0, Skipped: 0, Time elapsed: 5.995 sec
Running org.apache.maven.surefire.its.TwoTestCasesIT
Tests run: 4, Failures: 0, Errors: 0, Skipped: 0, Time elapsed: 19.269 sec
Running org.apache.maven.surefire.its.CheckTestNgPathWithSpacesIT
Tests run: 1, Failures: 0, Errors: 0, Skipped: 0, Time elapsed: 7.07 sec
Running org.apache.maven.surefire.its.Junit47concurrencyIT
Tests run: 1, Failures: 0, Errors: 0, Skipped: 0, Time elapsed: 5.327 sec
Running org.apache.maven.surefire.its.Surefire141PluggableProvidersIT
Tests run: 1, Failures: 0, Errors: 0, Skipped: 0, Time elapsed: 11.479 sec
Running org.apache.maven.surefire.its.ClasspathScopeFilteringIT
Tests run: 1, Failures: 0, Errors: 0, Skipped: 0, Time elapsed: 4.665 sec
Running org.apache.maven.surefire.its.Surefire500PuzzlingErrorIT
Tests run: 1, Failures: 0, Errors: 0, Skipped: 0, Time elapsed: 5.136 sec
Running org.apache.maven.surefire.its.ForkConsoleOutputIT
Tests run: 4, Failures: 0, Errors: 0, Skipped: 0, Time elapsed: 22.917 sec
Running org.apache.maven.surefire.its.TestNgTestSingleMethod5149IT
Tests run: 1, Failures: 0, Errors: 0, Skipped: 0, Time elapsed: 9.593 sec
Running org.apache.maven.surefire.its.RunOrderIT
Tests run: 3, Failures: 0, Errors: 0, Skipped: 0, Time elapsed: 13.489 sec
Running org.apache.maven.surefire.its.Surefire377TestNgAndJUnitTogetherIT
Tests run: 1, Failures: 0, Errors: 0, Skipped: 0, Time elapsed: 5.751 sec
Running org.apache.maven.surefire.its.WorkingDirectoryIT
Tests run: 4, Failures: 0, Errors: 0, Skipped: 0, Time elapsed: 18.929 sec
Running org.apache.maven.surefire.its.EnvironmentVariableIT
Tests run: 1, Failures: 0, Errors: 0, Skipped: 0, Time elapsed: 4.596 sec
Running org.apache.maven.surefire.its.TestNgTestMethodPatternIT
Tests run: 1, Failures: 0, Errors: 0, Skipped: 0, Time elapsed: 8.137 sec
Running org.apache.maven.surefire.its.CheckTestNgGroupThreadParallelIT
Tests run: 1, Failures: 0, Errors: 0, Skipped: 0, Time elapsed: 5.24 sec
Running org.apache.maven.surefire.its.Surefire621TestCountingJunit3InParallelIT
Tests run: 1, Failures: 0, Errors: 0, Skipped: 0, Time elapsed: 6.427 sec
Running org.apache.maven.surefire.its.ForkModeIT
Tests run: 5, Failures: 0, Errors: 0, Skipped: 0, Time elapsed: 26.384 sec
Running org.apache.maven.surefire.its.AbstractTestCaseIT
Tests run: 1, Failures: 0, Errors: 0, Skipped: 0, Time elapsed: 4.978 sec
Running org.apache.maven.surefire.its.PojoSimpleIT
Tests run: 1, Failures: 0, Errors: 0, Skipped: 0, Time elapsed: 4.845 sec
Running org.apache.maven.surefire.its.DefaultConfigurationIT
Tests run: 1, Failures: 0, Errors: 0, Skipped: 0, Time elapsed: 4.341 sec
Running org.apache.maven.surefire.its.CheckTestNgVersionsIT
Tests run: 16, Failures: 0, Errors: 0, Skipped: 0, Time elapsed: 78.948 sec
Running org.apache.maven.surefire.its.CheckTestNgSuiteXmlIT
Tests run: 2, Failures: 0, Errors: 0, Skipped: 0, Time elapsed: 8.52 sec
Running org.apache.maven.surefire.its.AdditionalClasspathIT
Tests run: 1, Failures: 0, Errors: 0, Skipped: 0, Time elapsed: 4.416 sec
Running org.apache.maven.surefire.its.TimeoutForkedTestIT
Tests run: 1, Failures: 0, Errors: 0, Skipped: 0, Time elapsed: 2.809 sec
Running org.apache.maven.surefire.its.Surefire44InnerClassTestIT
Tests run: 1, Failures: 0, Errors: 0, Skipped: 0, Time elapsed: 5.457 sec
Running org.apache.maven.surefire.its.Surefire705ParallelForkTimeoutIT
Tests run: 1, Failures: 0, Errors: 0, Skipped: 0, Time elapsed: 8.009 sec
Running org.apache.maven.surefire.its.Surefire685CommaSeparatedIncludesIT
Tests run: 1, Failures: 0, Errors: 0, Skipped: 0, Time elapsed: 4.777 sec
Running org.apache.maven.surefire.its.Surefire260TestWithIdenticalNamesIT
Tests run: 1, Failures: 0, Errors: 0, Skipped: 0, Time elapsed: 15.954 sec
Running org.apache.maven.surefire.its.JUnit4RunListenerIT
Tests run: 2, Failures: 0, Errors: 0, Skipped: 0, Time elapsed: 14.247 sec
Running org.apache.maven.surefire.its.NoRunnableTestsInClassIT
Tests run: 1, Failures: 0, Errors: 0, Skipped: 0, Time elapsed: 6.39 sec
Running org.apache.maven.surefire.its.ReportersIT
Tests run: 1, Failures: 0, Errors: 0, Skipped: 0, Time elapsed: 6.306 sec
Running org.apache.maven.surefire.its.Junit4IgnoreIT
Tests run: 1, Failures: 0, Errors: 0, Skipped: 0, Time elapsed: 6.258 sec
Running org.apache.maven.surefire.its.AggregateReportIT
Tests run: 1, Failures: 0, Errors: 0, Skipped: 0, Time elapsed: 10.058 sec
Running org.apache.maven.surefire.its.CheckTestNgSuiteXmlSingleIT
Tests run: 1, Failures: 0, Errors: 0, Skipped: 0, Time elapsed: 5.681 sec
Running org.apache.maven.surefire.its.IncludesExcludesIT
Tests run: 1, Failures: 0, Errors: 0, Skipped: 0, Time elapsed: 5.048 sec
Running org.apache.maven.surefire.its.ClasspathFilteringIT
Tests run: 1, Failures: 0, Errors: 0, Skipped: 0, Time elapsed: 4.914 sec
Running org.apache.maven.surefire.its.Junit4VersionsIT
Tests run: 9, Failures: 0, Errors: 0, Skipped: 0, Time elapsed: 50.478 sec
Running org.apache.maven.surefire.its.WorkingDirectoryMissingIT
Tests run: 1, Failures: 0, Errors: 0, Skipped: 0, Time elapsed: 3.862 sec
Running org.apache.maven.surefire.its.Surefire674BuildFailingWhenErrorsIT
Tests run: 1, Failures: 0, Errors: 0, Skipped: 0, Time elapsed: 4.848 sec
Running org.apache.maven.surefire.its.SystemPropertiesTestIT
Tests run: 2, Failures: 0, Errors: 0, Skipped: 0, Time elapsed: 9.286 sec
Running org.apache.maven.surefire.its.JUnit48TestMethodPatternIT
Tests run: 1, Failures: 0, Errors: 0, Skipped: 0, Time elapsed: 4.501 sec

Results :

Tests in error: 
  testShouldNotRerun(org.apache.maven.surefire.its.Surefire257NotRerunningTestsIT): Exit code
was non-zero: 1; command line and log = 
/home/hudson/slave/tools/maven-2.2x/bin/mvn -e --batch-mode -Dmaven.repo.local=<https://grid.sonatype.org/ci/job/surefire/./jdk=java-5x,label=ubuntu/ws/.repository>
org.apache.maven.plugins:maven-clean-plugin:clean -Dsurefire.version=2.7.3-SNAPSHOT -DtestNgVersion=5.7
-DtestNgClassifier=jdk15 package site
+ Error stacktraces are turned on.
[INFO] Scanning for projects...
[INFO] Reactor build order: 
[INFO]   Unnamed - org.apache.maven.surefire-257-rerunningTests:surefire-257-rerunningTests:pom:0.0.1-SNAPSHOT
[INFO]   Unnamed - org.apache.maven.surefire-257-rerunningTests.module1:module1:jar:0.0.1-SNAPSHOT
[INFO]   Unnamed - org.apache.maven.surefire-257-rerunningTests.module2:module2:jar:0.0.1-SNAPSHOT
[INFO] ------------------------------------------------------------------------
[INFO] Building Unnamed - org.apache.maven.surefire-257-rerunningTests:surefire-257-rerunningTests:pom:0.0.1-SNAPSHOT
[INFO]    task-segment: [org.apache.maven.plugins:maven-clean-plugin:clean, package, site]
[INFO] ------------------------------------------------------------------------
[INFO] [clean:clean {execution: default-cli}]
[INFO] [site:attach-descriptor {execution: default-attach-descriptor}]
[INFO] snapshot org.apache.maven.plugins:maven-surefire-report-plugin:2.7.3-SNAPSHOT: checking
for updates from central
[INFO] snapshot org.apache.maven.plugins:maven-surefire-report-plugin:2.7.3-SNAPSHOT: checking
for updates from central
[INFO] snapshot org.apache.maven.surefire:surefire:2.7.3-SNAPSHOT: checking for updates from
central
[INFO] snapshot org.apache.maven.surefire:surefire:2.7.3-SNAPSHOT: checking for updates from
central
[INFO] Preparing surefire-report:report
[INFO] No goals needed for project - skipping
[INFO] Preparing surefire-report:report-only
[INFO] No goals needed for project - skipping
[INFO] [site:site {execution: default-site}]
[WARNING] No URL defined for the project - decoration links will not be resolved
[INFO] artifact org.apache.maven.skins:maven-default-skin: checking for updates from central
[INFO] Skipped "Surefire Report" report, file "surefire-report.html" already exists for the
English version.
[INFO] Generating "Issue Tracking" report.
[INFO] Generating "Project Summary" report.
[INFO] Generating "Mailing Lists" report.
[INFO] Generating "Source Repository" report.
[INFO] Generating "Plugin Management" report.
[INFO] snapshot org.apache.maven.plugins:maven-surefire-plugin:2.7.3-SNAPSHOT: checking for
updates from central
[INFO] Generating "Continuous Integration" report.
[INFO] Generating "About" report.
[INFO] Generating "Dependencies" report.
[INFO] Generating "Project License" report.
[INFO] Generating "Project Team" report.
[INFO] Generating "Project Plugins" report.
[INFO] Generating "Surefire Report" report.
[WARNING] Deprecated API called - not org.apache.maven.doxia.sink.Sink instance and no SinkFactory
available. Please update this plugin.
[WARNING] Unable to locate Test Source XRef to link to - DISABLED
[FATAL ERROR] org.apache.maven.plugins.site.SiteMojo#execute() caused a linkage error (java.lang.AbstractMethodError)
and may be out-of-date. Check the realms:
[FATAL ERROR] Plugin realm = app0.child-container[org.apache.maven.plugins:maven-site-plugin:2.0-beta-7]
urls[0] = <https://grid.sonatype.org/ci/job/surefire/./jdk=java-5x,label=ubuntu/ws/.repository/org/apache/maven/plugins/maven-site-plugin/2.0-beta-7/maven-site-plugin-2.0-beta-7.jar>
urls[1] = <https://grid.sonatype.org/ci/job/surefire/./jdk=java-5x,label=ubuntu/ws/.repository/org/codehaus/plexus/plexus-utils/1.5.1/plexus-utils-1.5.1.jar>
urls[2] = <https://grid.sonatype.org/ci/job/surefire/./jdk=java-5x,label=ubuntu/ws/.repository/org/apache/maven/doxia/doxia-module-xhtml/1.0-alpha-11/doxia-module-xhtml-1.0-alpha-11.jar>
urls[3] = <https://grid.sonatype.org/ci/job/surefire/./jdk=java-5x,label=ubuntu/ws/.repository/org/apache/maven/doxia/doxia-core/1.0-alpha-11/doxia-core-1.0-alpha-11.jar>
urls[4] = <https://grid.sonatype.org/ci/job/surefire/./jdk=java-5x,label=ubuntu/ws/.repository/org/apache/maven/doxia/doxia-decoration-model/1.0-alpha-11/doxia-decoration-model-1.0-alpha-11.jar>
urls[5] = <https://grid.sonatype.org/ci/job/surefire/./jdk=java-5x,label=ubuntu/ws/.repository/org/apache/maven/doxia/doxia-site-renderer/1.0-alpha-11/doxia-site-renderer-1.0-alpha-11.jar>
urls[6] = <https://grid.sonatype.org/ci/job/surefire/./jdk=java-5x,label=ubuntu/ws/.repository/org/codehaus/plexus/plexus-i18n/1.0-beta-7/plexus-i18n-1.0-beta-7.jar>
urls[7] = <https://grid.sonatype.org/ci/job/surefire/./jdk=java-5x,label=ubuntu/ws/.repository/org/codehaus/plexus/plexus-velocity/1.1.7/plexus-velocity-1.1.7.jar>
urls[8] = <https://grid.sonatype.org/ci/job/surefire/./jdk=java-5x,label=ubuntu/ws/.repository/org/apache/velocity/velocity/1.5/velocity-1.5.jar>
urls[9] = <https://grid.sonatype.org/ci/job/surefire/./jdk=java-5x,label=ubuntu/ws/.repository/commons-collections/commons-collections/3.2/commons-collections-3.2.jar>
urls[10] = <https://grid.sonatype.org/ci/job/surefire/./jdk=java-5x,label=ubuntu/ws/.repository/commons-lang/commons-lang/2.1/commons-lang-2.1.jar>
urls[11] = <https://grid.sonatype.org/ci/job/surefire/./jdk=java-5x,label=ubuntu/ws/.repository/oro/oro/2.0.8/oro-2.0.8.jar>
urls[12] = <https://grid.sonatype.org/ci/job/surefire/./jdk=java-5x,label=ubuntu/ws/.repository/org/apache/maven/doxia/doxia-module-apt/1.0-alpha-11/doxia-module-apt-1.0-alpha-11.jar>
urls[13] = <https://grid.sonatype.org/ci/job/surefire/./jdk=java-5x,label=ubuntu/ws/.repository/org/apache/maven/doxia/doxia-module-fml/1.0-alpha-11/doxia-module-fml-1.0-alpha-11.jar>
urls[14] = <https://grid.sonatype.org/ci/job/surefire/./jdk=java-5x,label=ubuntu/ws/.repository/org/apache/maven/doxia/doxia-module-xdoc/1.0-alpha-11/doxia-module-xdoc-1.0-alpha-11.jar>
urls[15] = <https://grid.sonatype.org/ci/job/surefire/./jdk=java-5x,label=ubuntu/ws/.repository/org/apache/maven/shared/maven-doxia-tools/1.0.1/maven-doxia-tools-1.0.1.jar>
urls[16] = <https://grid.sonatype.org/ci/job/surefire/./jdk=java-5x,label=ubuntu/ws/.repository/commons-io/commons-io/1.4/commons-io-1.4.jar>
urls[17] = <https://grid.sonatype.org/ci/job/surefire/./jdk=java-5x,label=ubuntu/ws/.repository/org/codehaus/plexus/plexus-archiver/1.0-alpha-7/plexus-archiver-1.0-alpha-7.jar>
urls[18] = <https://grid.sonatype.org/ci/job/surefire/./jdk=java-5x,label=ubuntu/ws/.repository/org/mortbay/jetty/jetty/6.1.5/jetty-6.1.5.jar>
urls[19] = <https://grid.sonatype.org/ci/job/surefire/./jdk=java-5x,label=ubuntu/ws/.repository/org/mortbay/jetty/jetty-util/6.1.5/jetty-util-6.1.5.jar>
urls[20] = <https://grid.sonatype.org/ci/job/surefire/./jdk=java-5x,label=ubuntu/ws/.repository/org/mortbay/jetty/servlet-api-2.5/6.1.5/servlet-api-2.5-6.1.5.jar>
[FATAL ERROR] Container realm = plexus.core
urls[0] = file:/home/hudson/slave/tools/maven-2.2x/lib/maven-2.2.1-uber.jar
[INFO] ------------------------------------------------------------------------
[ERROR] FATAL ERROR
[INFO] ------------------------------------------------------------------------
[INFO] org.apache.maven.doxia.siterenderer.sink.SiteRendererSink.unknown(Ljava/lang/String;[Ljava/lang/Object;Lorg/apache/maven/doxia/sink/SinkEventAttributes;)V
[INFO] ------------------------------------------------------------------------
[INFO] Trace
java.lang.AbstractMethodError: org.apache.maven.doxia.siterenderer.sink.SiteRendererSink.unknown(Ljava/lang/String;[Ljava/lang/Object;Lorg/apache/maven/doxia/sink/SinkEventAttributes;)V
	at org.apache.maven.plugins.surefire.report.SurefireReportGenerator.doGenerateReport(SurefireReportGenerator.java:76)
	at org.apache.maven.plugins.surefire.report.SurefireReportMojo.executeReport(SurefireReportMojo.java:200)
	at org.apache.maven.reporting.AbstractMavenReport.generate(AbstractMavenReport.java:190)
	at org.apache.maven.reporting.AbstractMavenReport.generate(AbstractMavenReport.java:144)
	at org.apache.maven.plugins.site.ReportDocumentRenderer.renderDocument(ReportDocumentRenderer.java:139)
	at org.apache.maven.doxia.siterenderer.DefaultSiteRenderer.renderModule(DefaultSiteRenderer.java:269)
	at org.apache.maven.doxia.siterenderer.DefaultSiteRenderer.render(DefaultSiteRenderer.java:101)
	at org.apache.maven.plugins.site.SiteMojo.renderLocale(SiteMojo.java:133)
	at org.apache.maven.plugins.site.SiteMojo.execute(SiteMojo.java:100)
	at org.apache.maven.plugin.DefaultPluginManager.executeMojo(DefaultPluginManager.java:490)
	at org.apache.maven.lifecycle.DefaultLifecycleExecutor.executeGoals(DefaultLifecycleExecutor.java:694)
	at org.apache.maven.lifecycle.DefaultLifecycleExecutor.executeGoalWithLifecycle(DefaultLifecycleExecutor.java:556)
	at org.apache.maven.lifecycle.DefaultLifecycleExecutor.executeGoal(DefaultLifecycleExecutor.java:535)
	at org.apache.maven.lifecycle.DefaultLifecycleExecutor.executeGoalAndHandleFailures(DefaultLifecycleExecutor.java:387)
	at org.apache.maven.lifecycle.DefaultLifecycleExecutor.executeTaskSegments(DefaultLifecycleExecutor.java:348)
	at org.apache.maven.lifecycle.DefaultLifecycleExecutor.execute(DefaultLifecycleExecutor.java:180)
	at org.apache.maven.DefaultMaven.doExecute(DefaultMaven.java:328)
	at org.apache.maven.DefaultMaven.execute(DefaultMaven.java:138)
	at org.apache.maven.cli.MavenCli.main(MavenCli.java:362)
	at org.apache.maven.cli.compat.CompatibleMain.main(CompatibleMain.java:60)
	at sun.reflect.NativeMethodAccessorImpl.invoke0(Native Method)
	at sun.reflect.NativeMethodAccessorImpl.invoke(NativeMethodAccessorImpl.java:39)
	at sun.reflect.DelegatingMethodAccessorImpl.invoke(DelegatingMethodAccessorImpl.java:25)
	at java.lang.reflect.Method.invoke(Method.java:592)
	at org.codehaus.classworlds.Launcher.launchEnhanced(Launcher.java:315)
	at org.codehaus.classworlds.Launcher.launch(Launcher.java:255)
	at org.codehaus.classworlds.Launcher.mainWithExitCode(Launcher.java:430)
	at org.codehaus.classworlds.Launcher.main(Launcher.java:375)
[INFO] ------------------------------------------------------------------------
[INFO] Total time: 14 seconds
[INFO] Finished at: Thu Mar 03 06:10:50 CST 2011
[INFO] Final Memory: 53M/395M
[INFO] ------------------------------------------------------------------------


Tests run: 132, Failures: 0, Errors: 1, Skipped: 0

[INFO] [failsafe:verify {execution: default}]
[INFO] Failsafe report directory: /opt/grid/slave/workspace/surefire/jdk/java-5x/label/ubuntu/trunk/surefire-integration-tests/target/failsafe-reports
[INFO] ------------------------------------------------------------------------
[ERROR] BUILD FAILURE
[INFO] ------------------------------------------------------------------------
[INFO] There are test failures.

Please refer to /opt/grid/slave/workspace/surefire/jdk/java-5x/label/ubuntu/trunk/surefire-integration-tests/target/failsafe-reports
for the individual test results.
[INFO] ------------------------------------------------------------------------
[INFO] Trace
org.apache.maven.BuildFailureException: There are test failures.

Please refer to /opt/grid/slave/workspace/surefire/jdk/java-5x/label/ubuntu/trunk/surefire-integration-tests/target/failsafe-reports
for the individual test results.
	at org.apache.maven.lifecycle.DefaultLifecycleExecutor.executeGoals(DefaultLifecycleExecutor.java:715)
	at org.apache.maven.lifecycle.DefaultLifecycleExecutor.executeGoalWithLifecycle(DefaultLifecycleExecutor.java:556)
	at org.apache.maven.lifecycle.DefaultLifecycleExecutor.executeGoal(DefaultLifecycleExecutor.java:535)
	at org.apache.maven.lifecycle.DefaultLifecycleExecutor.executeGoalAndHandleFailures(DefaultLifecycleExecutor.java:387)
	at org.apache.maven.lifecycle.DefaultLifecycleExecutor.executeTaskSegments(DefaultLifecycleExecutor.java:348)
	at org.apache.maven.lifecycle.DefaultLifecycleExecutor.execute(DefaultLifecycleExecutor.java:180)
	at org.apache.maven.DefaultMaven.doExecute(DefaultMaven.java:328)
	at org.apache.maven.DefaultMaven.execute(DefaultMaven.java:138)
	at org.apache.maven.cli.MavenCli.main(MavenCli.java:362)
	at org.apache.maven.cli.compat.CompatibleMain.main(CompatibleMain.java:60)
	at sun.reflect.NativeMethodAccessorImpl.invoke0(Native Method)
	at sun.reflect.NativeMethodAccessorImpl.invoke(NativeMethodAccessorImpl.java:39)
	at sun.reflect.DelegatingMethodAccessorImpl.invoke(DelegatingMethodAccessorImpl.java:25)
	at java.lang.reflect.Method.invoke(Method.java:592)
	at org.codehaus.classworlds.Launcher.launchEnhanced(Launcher.java:315)
	at org.codehaus.classworlds.Launcher.launch(Launcher.java:255)
	at org.codehaus.classworlds.Launcher.mainWithExitCode(Launcher.java:430)
	at org.codehaus.classworlds.Launcher.main(Launcher.java:375)
Caused by: org.apache.maven.plugin.MojoFailureException: There are test failures.

Please refer to /opt/grid/slave/workspace/surefire/jdk/java-5x/label/ubuntu/trunk/surefire-integration-tests/target/failsafe-reports
for the individual test results.
	at org.apache.maven.plugin.surefire.SurefireHelper.reportExecution(SurefireHelper.java:74)
	at org.apache.maven.plugin.failsafe.VerifyMojo.execute(VerifyMojo.java:205)
	at org.apache.maven.plugin.DefaultPluginManager.executeMojo(DefaultPluginManager.java:490)
	at org.apache.maven.lifecycle.DefaultLifecycleExecutor.executeGoals(DefaultLifecycleExecutor.java:694)
	... 17 more
[INFO] ------------------------------------------------------------------------
[INFO] Total time: 16 minutes 26 seconds
[INFO] Finished at: Thu Mar 03 06:18:46 CST 2011
[INFO] Final Memory: 93M/459M
[INFO] ------------------------------------------------------------------------


Mime
View raw message