maven-notifications mailing list archives

Site index · List index
Message view « Date » · « Thread »
Top « Date » · « Thread »
From "GRiD .ORG" <bui...@lists.sonatype.com>
Subject Build failed in Hudson: surefire » java-5x,windows #249
Date Thu, 03 Mar 2011 17:16:50 GMT
See <https://grid.sonatype.org/ci/job/surefire/./jdk=java-5x,label=windows/249/changes>

Changes:

[Kristian Rosenvold] o Minor cleanups around classpath construction

[Kristian Rosenvold] [SUREFIRE-702] Improve transformation from properties->classpath

Based on patch by Stephan Birkner, modified by me.

[Kristian Rosenvold] [SUREFIRE-692]  Wrong link to API

Patch by Stehpan Birkner

------------------------------------------
[...truncated 933 lines...]
Running org.apache.maven.surefire.its.Junit47concurrencyIT
Tests run: 1, Failures: 0, Errors: 0, Skipped: 0, Time elapsed: 6.687 sec
Running org.apache.maven.surefire.its.JUnit48TestMethodPatternIT
Tests run: 1, Failures: 0, Errors: 0, Skipped: 0, Time elapsed: 7.052 sec
Running org.apache.maven.surefire.its.JUnit48TestSingleMethodIT
Tests run: 1, Failures: 0, Errors: 0, Skipped: 0, Time elapsed: 6.018 sec
Running org.apache.maven.surefire.its.JUnit4ForkAlwaysStaticInitPollutionIT
Tests run: 1, Failures: 0, Errors: 0, Skipped: 0, Time elapsed: 6.195 sec
Running org.apache.maven.surefire.its.Junit4IgnoreIT
Tests run: 1, Failures: 0, Errors: 0, Skipped: 0, Time elapsed: 5.591 sec
Running org.apache.maven.surefire.its.JUnit4RunListenerIT
Tests run: 2, Failures: 0, Errors: 0, Skipped: 0, Time elapsed: 12.342 sec
Running org.apache.maven.surefire.its.Junit4VersionsIT
Tests run: 9, Failures: 0, Errors: 0, Skipped: 0, Time elapsed: 54.093 sec
Running org.apache.maven.surefire.its.JUnitDepIT
Tests run: 3, Failures: 0, Errors: 0, Skipped: 0, Time elapsed: 20.089 sec
Running org.apache.maven.surefire.its.NoRunnableTestsInClassIT
Tests run: 1, Failures: 0, Errors: 0, Skipped: 0, Time elapsed: 6.047 sec
Running org.apache.maven.surefire.its.PlainOldJavaClasspathIT
Tests run: 1, Failures: 0, Errors: 0, Skipped: 0, Time elapsed: 7.16 sec
Running org.apache.maven.surefire.its.PlexusConflictIT
Tests run: 2, Failures: 0, Errors: 0, Skipped: 0, Time elapsed: 10.314 sec
Running org.apache.maven.surefire.its.PojoSimpleIT
Tests run: 1, Failures: 0, Errors: 0, Skipped: 0, Time elapsed: 4.745 sec
Running org.apache.maven.surefire.its.ReportersIT
Tests run: 1, Failures: 0, Errors: 0, Skipped: 0, Time elapsed: 5.867 sec
Running org.apache.maven.surefire.its.ResultCountingIT
Tests run: 3, Failures: 0, Errors: 0, Skipped: 0, Time elapsed: 16.407 sec
Running org.apache.maven.surefire.its.RunOrderIT
Tests run: 3, Failures: 0, Errors: 0, Skipped: 0, Time elapsed: 16.931 sec
Running org.apache.maven.surefire.its.SiblingAggregatorIT
Tests run: 1, Failures: 0, Errors: 0, Skipped: 0, Time elapsed: 4.982 sec
Running org.apache.maven.surefire.its.Surefire141PluggableProvidersIT
Tests run: 1, Failures: 0, Errors: 0, Skipped: 0, Time elapsed: 9.788 sec
Running org.apache.maven.surefire.its.Surefire146ForkPerTestNoSetupIT
Tests run: 1, Failures: 0, Errors: 0, Skipped: 0, Time elapsed: 7.16 sec
Running org.apache.maven.surefire.its.Surefire162CharsetProviderIT
Tests run: 1, Failures: 0, Errors: 0, Skipped: 0, Time elapsed: 5.75 sec
Running org.apache.maven.surefire.its.Surefire224WellFormedXmlFailuresIT
Tests run: 1, Failures: 0, Errors: 0, Skipped: 0, Time elapsed: 6.204 sec
Running org.apache.maven.surefire.its.Surefire257NotRerunningTestsIT
Tests run: 1, Failures: 0, Errors: 1, Skipped: 0, Time elapsed: 9.768 sec <<< FAILURE!
Running org.apache.maven.surefire.its.Surefire260TestWithIdenticalNamesIT
Tests run: 1, Failures: 0, Errors: 0, Skipped: 0, Time elapsed: 17.639 sec
Running org.apache.maven.surefire.its.Surefire377TestNgAndJUnitTogetherIT
Tests run: 1, Failures: 0, Errors: 0, Skipped: 0, Time elapsed: 6.785 sec
Running org.apache.maven.surefire.its.Surefire408ManualProviderSelectionIT
Tests run: 1, Failures: 0, Errors: 0, Skipped: 0, Time elapsed: 5.411 sec
Running org.apache.maven.surefire.its.Surefire42NotExtendingTestCaseIT
Tests run: 1, Failures: 0, Errors: 0, Skipped: 0, Time elapsed: 5.359 sec
Running org.apache.maven.surefire.its.Surefire44InnerClassTestIT
Tests run: 1, Failures: 0, Errors: 0, Skipped: 0, Time elapsed: 5.619 sec
Running org.apache.maven.surefire.its.Surefire500PuzzlingErrorIT
Tests run: 1, Failures: 0, Errors: 0, Skipped: 0, Time elapsed: 5.792 sec
Running org.apache.maven.surefire.its.Surefire510TestClassPathForkModesIT
Tests run: 2, Failures: 0, Errors: 0, Skipped: 0, Time elapsed: 11.372 sec
Running org.apache.maven.surefire.its.Surefire570MultipleReportDirectoriesIT
Tests run: 1, Failures: 0, Errors: 0, Skipped: 0, Time elapsed: 18.912 sec
Running org.apache.maven.surefire.its.Surefire613TestCountInParallelIT
Tests run: 1, Failures: 0, Errors: 0, Skipped: 0, Time elapsed: 6.107 sec
Running org.apache.maven.surefire.its.Surefire621TestCountingJunit3InParallelIT
Tests run: 1, Failures: 0, Errors: 0, Skipped: 0, Time elapsed: 6.592 sec
Running org.apache.maven.surefire.its.Surefire628ConsoleOutputBeforeAndAfterClassIT
Tests run: 1, Failures: 0, Errors: 0, Skipped: 0, Time elapsed: 5.562 sec
Running org.apache.maven.surefire.its.Surefire673MockitoIT
Tests run: 1, Failures: 0, Errors: 0, Skipped: 0, Time elapsed: 6.05 sec
Running org.apache.maven.surefire.its.Surefire674BuildFailingWhenErrorsIT
Tests run: 1, Failures: 0, Errors: 0, Skipped: 0, Time elapsed: 7.992 sec
Running org.apache.maven.surefire.its.Surefire685CommaSeparatedIncludesIT
Tests run: 1, Failures: 0, Errors: 0, Skipped: 0, Time elapsed: 5.847 sec
Running org.apache.maven.surefire.its.Surefire705ParallelForkTimeoutIT
Tests run: 1, Failures: 0, Errors: 0, Skipped: 0, Time elapsed: 7.25 sec
Running org.apache.maven.surefire.its.SystemPropertiesTestIT
Tests run: 2, Failures: 0, Errors: 0, Skipped: 0, Time elapsed: 10.902 sec
Running org.apache.maven.surefire.its.TestNgTestMethodPatternIT
Tests run: 1, Failures: 0, Errors: 0, Skipped: 0, Time elapsed: 6.524 sec
Running org.apache.maven.surefire.its.TestNgTestSingleMethod5149IT
Tests run: 1, Failures: 0, Errors: 0, Skipped: 0, Time elapsed: 6.426 sec
Running org.apache.maven.surefire.its.TestNgTestSingleMethodIT
Tests run: 1, Failures: 0, Errors: 0, Skipped: 0, Time elapsed: 8.085 sec
Running org.apache.maven.surefire.its.TimeoutForkedTestIT
Tests run: 1, Failures: 0, Errors: 0, Skipped: 0, Time elapsed: 3.226 sec
Running org.apache.maven.surefire.its.TwoTestCasesIT
Tests run: 4, Failures: 0, Errors: 0, Skipped: 0, Time elapsed: 19.926 sec
Running org.apache.maven.surefire.its.UmlautDirIT
Tests run: 2, Failures: 0, Errors: 0, Skipped: 0, Time elapsed: 9.306 sec
Running org.apache.maven.surefire.its.UseIsolatedClassLoaderIT
Tests run: 1, Failures: 0, Errors: 0, Skipped: 0, Time elapsed: 5.322 sec
Running org.apache.maven.surefire.its.WorkingDirectoryIT
Tests run: 4, Failures: 0, Errors: 0, Skipped: 0, Time elapsed: 14.921 sec
Running org.apache.maven.surefire.its.WorkingDirectoryMissingIT
Tests run: 1, Failures: 0, Errors: 0, Skipped: 0, Time elapsed: 4.666 sec

Results :

Tests in error: 
  testShouldNotRerun(org.apache.maven.surefire.its.Surefire257NotRerunningTestsIT): Exit code
was non-zero: 1; command line and log = 
x:\slave\tools\maven-2.2x\bin\mvn -e --batch-mode -Dmaven.repo.local=x:\slave\workspace\surefire\jdk\java-5x\label\windows\.repository
org.apache.maven.plugins:maven-clean-plugin:clean -Dsurefire.version=2.7.3-SNAPSHOT -DtestNgVersion=5.7
-DtestNgClassifier=jdk15 package site
+ Error stacktraces are turned on.
[INFO] Scanning for projects...
[INFO] Reactor build order: 
[INFO]   Unnamed - org.apache.maven.surefire-257-rerunningTests:surefire-257-rerunningTests:pom:0.0.1-SNAPSHOT
[INFO]   Unnamed - org.apache.maven.surefire-257-rerunningTests.module1:module1:jar:0.0.1-SNAPSHOT
[INFO]   Unnamed - org.apache.maven.surefire-257-rerunningTests.module2:module2:jar:0.0.1-SNAPSHOT
[INFO] ------------------------------------------------------------------------
[INFO] Building Unnamed - org.apache.maven.surefire-257-rerunningTests:surefire-257-rerunningTests:pom:0.0.1-SNAPSHOT
[INFO]    task-segment: [org.apache.maven.plugins:maven-clean-plugin:clean, package, site]
[INFO] ------------------------------------------------------------------------
[INFO] [clean:clean {execution: default-cli}]
[INFO] [site:attach-descriptor {execution: default-attach-descriptor}]
[INFO] snapshot org.apache.maven.plugins:maven-surefire-report-plugin:2.7.3-SNAPSHOT: checking
for updates from central
[INFO] snapshot org.apache.maven.plugins:maven-surefire-report-plugin:2.7.3-SNAPSHOT: checking
for updates from central
[INFO] snapshot org.apache.maven.surefire:surefire:2.7.3-SNAPSHOT: checking for updates from
central
[INFO] snapshot org.apache.maven.surefire:surefire:2.7.3-SNAPSHOT: checking for updates from
central
[INFO] Preparing surefire-report:report-only
[INFO] No goals needed for project - skipping
[INFO] Preparing surefire-report:report
[INFO] No goals needed for project - skipping
[INFO] [site:site {execution: default-site}]
[WARNING] No URL defined for the project - decoration links will not be resolved
[INFO] Skipped "Surefire Report" report, file "surefire-report.html" already exists for the
English version.
[INFO] Generating "Issue Tracking" report.
[INFO] Generating "Project Summary" report.
[INFO] Generating "Mailing Lists" report.
[INFO] Generating "Source Repository" report.
[INFO] Generating "Plugin Management" report.
[INFO] snapshot org.apache.maven.plugins:maven-surefire-plugin:2.7.3-SNAPSHOT: checking for
updates from central
[INFO] Generating "Continuous Integration" report.
[INFO] Generating "About" report.
[INFO] Generating "Dependencies" report.
[INFO] Generating "Project License" report.
[INFO] Generating "Project Team" report.
[INFO] Generating "Project Plugins" report.
[INFO] Generating "Surefire Report" report.
[WARNING] Deprecated API called - not org.apache.maven.doxia.sink.Sink instance and no SinkFactory
available. Please update this plugin.
[WARNING] Unable to locate Test Source XRef to link to - DISABLED
[FATAL ERROR] org.apache.maven.plugins.site.SiteMojo#execute() caused a linkage error (java.lang.AbstractMethodError)
and may be out-of-date. Check the realms:
[FATAL ERROR] Plugin realm = app0.child-container[org.apache.maven.plugins:maven-site-plugin:2.0-beta-7]
urls[0] = <https://grid.sonatype.org/ci/job/surefire/./jdk=java-5x,label=windows/ws/.repository/org/apache/maven/plugins/maven-site-plugin/2.0-beta-7/maven-site-plugin-2.0-beta-7.jar>
urls[1] = <https://grid.sonatype.org/ci/job/surefire/./jdk=java-5x,label=windows/ws/.repository/org/codehaus/plexus/plexus-utils/1.5.1/plexus-utils-1.5.1.jar>
urls[2] = <https://grid.sonatype.org/ci/job/surefire/./jdk=java-5x,label=windows/ws/.repository/org/apache/maven/doxia/doxia-module-xhtml/1.0-alpha-11/doxia-module-xhtml-1.0-alpha-11.jar>
urls[3] = <https://grid.sonatype.org/ci/job/surefire/./jdk=java-5x,label=windows/ws/.repository/org/apache/maven/doxia/doxia-core/1.0-alpha-11/doxia-core-1.0-alpha-11.jar>
urls[4] = <https://grid.sonatype.org/ci/job/surefire/./jdk=java-5x,label=windows/ws/.repository/org/apache/maven/doxia/doxia-decoration-model/1.0-alpha-11/doxia-decoration-model-1.0-alpha-11.jar>
urls[5] = <https://grid.sonatype.org/ci/job/surefire/./jdk=java-5x,label=windows/ws/.repository/org/apache/maven/doxia/doxia-site-renderer/1.0-alpha-11/doxia-site-renderer-1.0-alpha-11.jar>
urls[6] = <https://grid.sonatype.org/ci/job/surefire/./jdk=java-5x,label=windows/ws/.repository/org/codehaus/plexus/plexus-i18n/1.0-beta-7/plexus-i18n-1.0-beta-7.jar>
urls[7] = <https://grid.sonatype.org/ci/job/surefire/./jdk=java-5x,label=windows/ws/.repository/org/codehaus/plexus/plexus-velocity/1.1.7/plexus-velocity-1.1.7.jar>
urls[8] = <https://grid.sonatype.org/ci/job/surefire/./jdk=java-5x,label=windows/ws/.repository/org/apache/velocity/velocity/1.5/velocity-1.5.jar>
urls[9] = <https://grid.sonatype.org/ci/job/surefire/./jdk=java-5x,label=windows/ws/.repository/commons-collections/commons-collections/3.2/commons-collections-3.2.jar>
urls[10] = <https://grid.sonatype.org/ci/job/surefire/./jdk=java-5x,label=windows/ws/.repository/commons-lang/commons-lang/2.1/commons-lang-2.1.jar>
urls[11] = <https://grid.sonatype.org/ci/job/surefire/./jdk=java-5x,label=windows/ws/.repository/oro/oro/2.0.8/oro-2.0.8.jar>
urls[12] = <https://grid.sonatype.org/ci/job/surefire/./jdk=java-5x,label=windows/ws/.repository/org/apache/maven/doxia/doxia-module-apt/1.0-alpha-11/doxia-module-apt-1.0-alpha-11.jar>
urls[13] = <https://grid.sonatype.org/ci/job/surefire/./jdk=java-5x,label=windows/ws/.repository/org/apache/maven/doxia/doxia-module-fml/1.0-alpha-11/doxia-module-fml-1.0-alpha-11.jar>
urls[14] = <https://grid.sonatype.org/ci/job/surefire/./jdk=java-5x,label=windows/ws/.repository/org/apache/maven/doxia/doxia-module-xdoc/1.0-alpha-11/doxia-module-xdoc-1.0-alpha-11.jar>
urls[15] = <https://grid.sonatype.org/ci/job/surefire/./jdk=java-5x,label=windows/ws/.repository/org/apache/maven/shared/maven-doxia-tools/1.0.1/maven-doxia-tools-1.0.1.jar>
urls[16] = <https://grid.sonatype.org/ci/job/surefire/./jdk=java-5x,label=windows/ws/.repository/commons-io/commons-io/1.4/commons-io-1.4.jar>
urls[17] = <https://grid.sonatype.org/ci/job/surefire/./jdk=java-5x,label=windows/ws/.repository/org/codehaus/plexus/plexus-archiver/1.0-alpha-7/plexus-archiver-1.0-alpha-7.jar>
urls[18] = <https://grid.sonatype.org/ci/job/surefire/./jdk=java-5x,label=windows/ws/.repository/org/mortbay/jetty/jetty/6.1.5/jetty-6.1.5.jar>
urls[19] = <https://grid.sonatype.org/ci/job/surefire/./jdk=java-5x,label=windows/ws/.repository/org/mortbay/jetty/jetty-util/6.1.5/jetty-util-6.1.5.jar>
urls[20] = <https://grid.sonatype.org/ci/job/surefire/./jdk=java-5x,label=windows/ws/.repository/org/mortbay/jetty/servlet-api-2.5/6.1.5/servlet-api-2.5-6.1.5.jar>
[FATAL ERROR] Container realm = plexus.core
urls[0] = file:/x:/slave/tools/maven-2.2x/lib/maven-2.2.1-uber.jar
[INFO] ------------------------------------------------------------------------
[ERROR] FATAL ERROR
[INFO] ------------------------------------------------------------------------
[INFO] org.apache.maven.doxia.siterenderer.sink.SiteRendererSink.unknown(Ljava/lang/String;[Ljava/lang/Object;Lorg/apache/maven/doxia/sink/SinkEventAttributes;)V
[INFO] ------------------------------------------------------------------------
[INFO] Trace
java.lang.AbstractMethodError: org.apache.maven.doxia.siterenderer.sink.SiteRendererSink.unknown(Ljava/lang/String;[Ljava/lang/Object;Lorg/apache/maven/doxia/sink/SinkEventAttributes;)V
	at org.apache.maven.plugins.surefire.report.SurefireReportGenerator.doGenerateReport(SurefireReportGenerator.java:76)
	at org.apache.maven.plugins.surefire.report.SurefireReportMojo.executeReport(SurefireReportMojo.java:200)
	at org.apache.maven.reporting.AbstractMavenReport.generate(AbstractMavenReport.java:190)
	at org.apache.maven.reporting.AbstractMavenReport.generate(AbstractMavenReport.java:144)
	at org.apache.maven.plugins.site.ReportDocumentRenderer.renderDocument(ReportDocumentRenderer.java:139)
	at org.apache.maven.doxia.siterenderer.DefaultSiteRenderer.renderModule(DefaultSiteRenderer.java:269)
	at org.apache.maven.doxia.siterenderer.DefaultSiteRenderer.render(DefaultSiteRenderer.java:101)
	at org.apache.maven.plugins.site.SiteMojo.renderLocale(SiteMojo.java:133)
	at org.apache.maven.plugins.site.SiteMojo.execute(SiteMojo.java:100)
	at org.apache.maven.plugin.DefaultPluginManager.executeMojo(DefaultPluginManager.java:490)
	at org.apache.maven.lifecycle.DefaultLifecycleExecutor.executeGoals(DefaultLifecycleExecutor.java:694)
	at org.apache.maven.lifecycle.DefaultLifecycleExecutor.executeGoalWithLifecycle(DefaultLifecycleExecutor.java:556)
	at org.apache.maven.lifecycle.DefaultLifecycleExecutor.executeGoal(DefaultLifecycleExecutor.java:535)
	at org.apache.maven.lifecycle.DefaultLifecycleExecutor.executeGoalAndHandleFailures(DefaultLifecycleExecutor.java:387)
	at org.apache.maven.lifecycle.DefaultLifecycleExecutor.executeTaskSegments(DefaultLifecycleExecutor.java:348)
	at org.apache.maven.lifecycle.DefaultLifecycleExecutor.execute(DefaultLifecycleExecutor.java:180)
	at org.apache.maven.DefaultMaven.doExecute(DefaultMaven.java:328)
	at org.apache.maven.DefaultMaven.execute(DefaultMaven.java:138)
	at org.apache.maven.cli.MavenCli.main(MavenCli.java:362)
	at org.apache.maven.cli.compat.CompatibleMain.main(CompatibleMain.java:60)
	at sun.reflect.NativeMethodAccessorImpl.invoke0(Native Method)
	at sun.reflect.NativeMethodAccessorImpl.invoke(NativeMethodAccessorImpl.java:39)
	at sun.reflect.DelegatingMethodAccessorImpl.invoke(DelegatingMethodAccessorImpl.java:25)
	at java.lang.reflect.Method.invoke(Method.java:592)
	at org.codehaus.classworlds.Launcher.launchEnhanced(Launcher.java:315)
	at org.codehaus.classworlds.Launcher.launch(Launcher.java:255)
	at org.codehaus.classworlds.Launcher.mainWithExitCode(Launcher.java:430)
	at org.codehaus.classworlds.Launcher.main(Launcher.java:375)
[INFO] ------------------------------------------------------------------------
[INFO] Total time: 8 seconds
[INFO] Finished at: Thu Mar 03 09:13:16 PST 2011
[INFO] Final Memory: 30M/54M
[INFO] ------------------------------------------------------------------------


Tests run: 132, Failures: 0, Errors: 1, Skipped: 0

[INFO] [failsafe:verify {execution: default}]
[INFO] Failsafe report directory: X:\slave\workspace\surefire\jdk\java-5x\label\windows\trunk\surefire-integration-tests\target\failsafe-reports
[INFO] ------------------------------------------------------------------------
[ERROR] BUILD FAILURE
[INFO] ------------------------------------------------------------------------
[INFO] There are test failures.

Please refer to X:\slave\workspace\surefire\jdk\java-5x\label\windows\trunk\surefire-integration-tests\target\failsafe-reports
for the individual test results.
[INFO] ------------------------------------------------------------------------
[INFO] Trace
org.apache.maven.BuildFailureException: There are test failures.

Please refer to X:\slave\workspace\surefire\jdk\java-5x\label\windows\trunk\surefire-integration-tests\target\failsafe-reports
for the individual test results.
	at org.apache.maven.lifecycle.DefaultLifecycleExecutor.executeGoals(DefaultLifecycleExecutor.java:715)
	at org.apache.maven.lifecycle.DefaultLifecycleExecutor.executeGoalWithLifecycle(DefaultLifecycleExecutor.java:556)
	at org.apache.maven.lifecycle.DefaultLifecycleExecutor.executeGoal(DefaultLifecycleExecutor.java:535)
	at org.apache.maven.lifecycle.DefaultLifecycleExecutor.executeGoalAndHandleFailures(DefaultLifecycleExecutor.java:387)
	at org.apache.maven.lifecycle.DefaultLifecycleExecutor.executeTaskSegments(DefaultLifecycleExecutor.java:348)
	at org.apache.maven.lifecycle.DefaultLifecycleExecutor.execute(DefaultLifecycleExecutor.java:180)
	at org.apache.maven.DefaultMaven.doExecute(DefaultMaven.java:328)
	at org.apache.maven.DefaultMaven.execute(DefaultMaven.java:138)
	at org.apache.maven.cli.MavenCli.main(MavenCli.java:362)
	at org.apache.maven.cli.compat.CompatibleMain.main(CompatibleMain.java:60)
	at sun.reflect.NativeMethodAccessorImpl.invoke0(Native Method)
	at sun.reflect.NativeMethodAccessorImpl.invoke(NativeMethodAccessorImpl.java:39)
	at sun.reflect.DelegatingMethodAccessorImpl.invoke(DelegatingMethodAccessorImpl.java:25)
	at java.lang.reflect.Method.invoke(Method.java:592)
	at org.codehaus.classworlds.Launcher.launchEnhanced(Launcher.java:315)
	at org.codehaus.classworlds.Launcher.launch(Launcher.java:255)
	at org.codehaus.classworlds.Launcher.mainWithExitCode(Launcher.java:430)
	at org.codehaus.classworlds.Launcher.main(Launcher.java:375)
Caused by: org.apache.maven.plugin.MojoFailureException: There are test failures.

Please refer to X:\slave\workspace\surefire\jdk\java-5x\label\windows\trunk\surefire-integration-tests\target\failsafe-reports
for the individual test results.
	at org.apache.maven.plugin.surefire.SurefireHelper.reportExecution(SurefireHelper.java:74)
	at org.apache.maven.plugin.failsafe.VerifyMojo.execute(VerifyMojo.java:205)
	at org.apache.maven.plugin.DefaultPluginManager.executeMojo(DefaultPluginManager.java:490)
	at org.apache.maven.lifecycle.DefaultLifecycleExecutor.executeGoals(DefaultLifecycleExecutor.java:694)
	... 17 more
[INFO] ------------------------------------------------------------------------
[INFO] Total time: 14 minutes 33 seconds
[INFO] Finished at: Thu Mar 03 09:16:49 PST 2011
[INFO] Final Memory: 48M/63M
[INFO] ------------------------------------------------------------------------


Mime
View raw message