maven-notifications mailing list archives

Site index · List index
Message view « Date » · « Thread »
Top « Date » · « Thread »
From "GRiD .ORG" <bui...@lists.sonatype.com>
Subject Build failed in Hudson: surefire » java-5x,windows #261
Date Sun, 13 Mar 2011 14:02:14 GMT
See <https://grid.sonatype.org/ci/job/surefire/./jdk=java-5x,label=windows/261/changes>

Changes:

[Kristian Rosenvold] o Changed build to use shaded provider itroduced in SUREFIRE-700.

>From now on we have isolation. Note that I had to change
the integration tests to run with the *current* version
of surefire. This is because the integration test module
uses the 'install' feature of the maven-invoker-plugin,
which requires that the necessary artifacts are on the project
classpath, including the providers. Unfortunately, the
shaded provider does not like the presence of the other
providers. This problem can/should be fixed by extracting
the maven-invoker-plugin into a separate module, so we can
avoid the weird dependencies creeping into the IT-runner.

Given the level of weirdness any surefire developer
has had to cope with, this should be peanuts. Will
fix real soon, anyway ;)

------------------------------------------
Started by upstream project "surefire" build number 261
Node context:
  os.version=6.1
  os.arch=x86
  os.family=windows
  os.name=windows 7
Building remotely on slave-win-1
Updating https://svn.apache.org/repos/asf/maven/surefire/trunk
D         surefire-providers\surefire-junit47\src\test\java\org\apache\maven\surefire\junitcore\MavenSurefireJUnit47RunnerTestCase.java
U         surefire-providers\surefire-junit47\src\test\java\org\apache\maven\surefire\junitcore\ConcurrentReporterManagerTest.java
U         surefire-providers\surefire-junit47\src\test\java\org\apache\maven\surefire\junitcore\JUnitCoreParametersTest.java
AU        surefire-providers\surefire-junit47\src\test\java\org\apache\maven\surefire\junitcore\MavenSurefireJUnit47RunnerTest.java
U         surefire-providers\surefire-junit47\src\test\java\org\apache\maven\surefire\junitcore\JUnitCoreRunListenerTest.java
U         surefire-providers\surefire-junit47\pom.xml
U         surefire-providers\pom.xml
U         maven-surefire-plugin\pom.xml
U         surefire-integration-tests\pom.xml
U         maven-failsafe-plugin\pom.xml
U         pom.xml
U         surefire-api\pom.xml
U         surefire-booter\pom.xml
U         maven-surefire-common\pom.xml
At revision 1081117
[trunk] $ x:\slave\tools\maven-2.2x\bin\mvn.bat -Dlabel=windows -Djdk=java-5x -Dmaven.repo.local=<https://grid.sonatype.org/ci/job/surefire/./jdk=java-5x,label=windows/ws/.repository>
-B -U -e -V clean deploy
+ Error stacktraces are turned on.
Apache Maven 2.2.1 (r801777; 2009-08-06 12:16:01-0700)
Java version: 1.5.0_22
Java home: x:\slave\tools\java-5x\jre
Default locale: en_US, platform encoding: Cp1252
OS name: "windows 7" version: "6.1" arch: "x86" Family: "windows"
[INFO] Scanning for projects...
[INFO] ------------------------------------------------------------------------
[ERROR] BUILD FAILURE
[INFO] ------------------------------------------------------------------------
[INFO] The projects in the reactor contain a cyclic reference: Edge between 'Vertex{label='org.apache.maven.surefire:surefire-api'}'
and 'Vertex{label='org.apache.maven.surefire:surefire-shadefire'}' introduces to cycle in
the graph org.apache.maven.surefire:surefire-shadefire --> org.apache.maven.surefire:surefire-api
--> org.apache.maven.surefire:surefire-shadefire
[INFO] ------------------------------------------------------------------------
[INFO] Trace
org.apache.maven.BuildFailureException: The projects in the reactor contain a cyclic reference:
Edge between 'Vertex{label='org.apache.maven.surefire:surefire-api'}' and 'Vertex{label='org.apache.maven.surefire:surefire-shadefire'}'
introduces to cycle in the graph org.apache.maven.surefire:surefire-shadefire --> org.apache.maven.surefire:surefire-api
--> org.apache.maven.surefire:surefire-shadefire
	at org.apache.maven.DefaultMaven.doExecute(DefaultMaven.java:295)
	at org.apache.maven.DefaultMaven.execute(DefaultMaven.java:138)
	at org.apache.maven.cli.MavenCli.main(MavenCli.java:362)
	at org.apache.maven.cli.compat.CompatibleMain.main(CompatibleMain.java:60)
	at sun.reflect.NativeMethodAccessorImpl.invoke0(Native Method)
	at sun.reflect.NativeMethodAccessorImpl.invoke(NativeMethodAccessorImpl.java:39)
	at sun.reflect.DelegatingMethodAccessorImpl.invoke(DelegatingMethodAccessorImpl.java:25)
	at java.lang.reflect.Method.invoke(Method.java:592)
	at org.codehaus.classworlds.Launcher.launchEnhanced(Launcher.java:315)
	at org.codehaus.classworlds.Launcher.launch(Launcher.java:255)
	at org.codehaus.classworlds.Launcher.mainWithExitCode(Launcher.java:430)
	at org.codehaus.classworlds.Launcher.main(Launcher.java:375)
Caused by: hidden.org.codehaus.plexus.util.dag.CycleDetectedException: Edge between 'Vertex{label='org.apache.maven.surefire:surefire-api'}'
and 'Vertex{label='org.apache.maven.surefire:surefire-shadefire'}' introduces to cycle in
the graph org.apache.maven.surefire:surefire-shadefire --> org.apache.maven.surefire:surefire-api
--> org.apache.maven.surefire:surefire-shadefire
	at hidden.org.codehaus.plexus.util.dag.DAG.addEdge(DAG.java:143)
	at hidden.org.codehaus.plexus.util.dag.DAG.addEdge(DAG.java:123)
	at org.apache.maven.project.ProjectSorter.addEdgeWithParentCheck(ProjectSorter.java:362)
	at org.apache.maven.project.ProjectSorter.<init>(ProjectSorter.java:171)
	at org.apache.maven.execution.ReactorManager.<init>(ReactorManager.java:99)
	at org.apache.maven.DefaultMaven.doExecute(DefaultMaven.java:288)
	... 11 more
[INFO] ------------------------------------------------------------------------
[INFO] Total time: < 1 second
[INFO] Finished at: Sun Mar 13 07:02:13 PDT 2011
[INFO] Final Memory: 2M/5M
[INFO] ------------------------------------------------------------------------


Mime
View raw message