maven-notifications mailing list archives

Site index · List index
Message view « Date » · « Thread »
Top « Date » · « Thread »
From "GRiD .ORG" <bui...@lists.sonatype.com>
Subject Build failed in Hudson: maven-plugins-UTs » java-5x,windows #979
Date Wed, 09 Mar 2011 00:23:45 GMT
See <https://grid.sonatype.org/ci/job/maven-plugins-UTs/./jdk=java-5x,label=windows/979/changes>

Changes:

[Lukas Theussl] fix deploy failure when top parent has no site

[Lukas Theussl] add it

------------------------------------------
[...truncated 3819 lines...]
[INFO] Copying webapp resources [X:\slave\workspace\maven-plugins-UTs\jdk\java-5x\label\windows\trunk\maven-war-plugin\target\test-classes\unit\warexplodedmojo\test-dir\testExplodedWarMergeWarLocalFileOverride-test-data\source]
[INFO] Processing overlay [ id wartests:simple]
[INFO] Webapp assembled in [4 msecs]
[INFO] Exploding webapp
[INFO] Assembling webapp [maven-war-plugin-test] in [X:\slave\workspace\maven-plugins-UTs\jdk\java-5x\label\windows\trunk\maven-war-plugin\target\test-classes\unit\warexplodedmojo\test-dir\ExplodedWar_WithEJB]
[INFO] Processing war project
[INFO] Copying webapp resources [X:\slave\workspace\maven-plugins-UTs\jdk\java-5x\label\windows\trunk\maven-war-plugin\target\test-classes\unit\warexplodedmojo\test-dir\ExplodedWar_WithEJB-test-data\source]
[INFO] Webapp assembled in [10 msecs]
[INFO] Exploding webapp
[INFO] Assembling webapp [maven-war-plugin-test] in [X:\slave\workspace\maven-plugins-UTs\jdk\java-5x\label\windows\trunk\maven-war-plugin\target\test-classes\unit\warexplodedmojo\test-dir\ExplodedWarWithJar]
[INFO] Processing war project
[INFO] Copying webapp resources [X:\slave\workspace\maven-plugins-UTs\jdk\java-5x\label\windows\trunk\maven-war-plugin\target\test-classes\unit\warexplodedmojo\test-dir\ExplodedWarWithJar-test-data\source]
[INFO] Webapp assembled in [11 msecs]
[INFO] Exploding webapp
[INFO] Assembling webapp [maven-war-plugin-test] in [X:\slave\workspace\maven-plugins-UTs\jdk\java-5x\label\windows\trunk\maven-war-plugin\target\test-classes\unit\warexplodedmojo\test-dir\ExplodedWar_WithEJB]
[INFO] Processing war project
[INFO] Copying webapp resources [X:\slave\workspace\maven-plugins-UTs\jdk\java-5x\label\windows\trunk\maven-war-plugin\target\test-classes\unit\warexplodedmojo\test-dir\ExplodedWar_WithEJB-test-data\source]
[INFO] Webapp assembled in [12 msecs]
[INFO] Exploding webapp
[INFO] Assembling webapp [maven-war-plugin-test] in [X:\slave\workspace\maven-plugins-UTs\jdk\java-5x\label\windows\trunk\maven-war-plugin\target\test-classes\unit\warexplodedmojo\test-dir\ExplodedWar_WithTLD]
[INFO] Processing war project
[INFO] Copying webapp resources [X:\slave\workspace\maven-plugins-UTs\jdk\java-5x\label\windows\trunk\maven-war-plugin\target\test-classes\unit\warexplodedmojo\test-dir\ExplodedWar_WithTLD-test-data\source]
[INFO] Webapp assembled in [10 msecs]
[INFO] Exploding webapp
[INFO] Assembling webapp [maven-war-plugin-test] in [X:\slave\workspace\maven-plugins-UTs\jdk\java-5x\label\windows\trunk\maven-war-plugin\target\test-classes\unit\warexplodedmojo\test-dir\ExplodedWar_WithPAR]
[INFO] Processing war project
[INFO] Copying webapp resources [X:\slave\workspace\maven-plugins-UTs\jdk\java-5x\label\windows\trunk\maven-war-plugin\target\test-classes\unit\warexplodedmojo\test-dir\ExplodedWar_WithPAR-test-data\source]
[INFO] Webapp assembled in [10 msecs]
[INFO] Exploding webapp
[INFO] Assembling webapp [maven-war-plugin-test] in [X:\slave\workspace\maven-plugins-UTs\jdk\java-5x\label\windows\trunk\maven-war-plugin\target\test-classes\unit\warexplodedmojo\test-dir\ExplodedWarWithAar]
[INFO] Processing war project
[INFO] Copying webapp resources [X:\slave\workspace\maven-plugins-UTs\jdk\java-5x\label\windows\trunk\maven-war-plugin\target\test-classes\unit\warexplodedmojo\test-dir\ExplodedWarWithAar-test-data\source]
[INFO] Webapp assembled in [14 msecs]
[INFO] Exploding webapp
[INFO] Assembling webapp [maven-war-plugin-test] in [X:\slave\workspace\maven-plugins-UTs\jdk\java-5x\label\windows\trunk\maven-war-plugin\target\test-classes\unit\warexplodedmojo\test-dir\ExplodedWarWithMar]
[INFO] Processing war project
[INFO] Copying webapp resources [X:\slave\workspace\maven-plugins-UTs\jdk\java-5x\label\windows\trunk\maven-war-plugin\target\test-classes\unit\warexplodedmojo\test-dir\ExplodedWarWithMar-test-data\source]
[INFO] Webapp assembled in [8 msecs]
[INFO] Exploding webapp
[INFO] Assembling webapp [maven-war-plugin-test] in [X:\slave\workspace\maven-plugins-UTs\jdk\java-5x\label\windows\trunk\maven-war-plugin\target\test-classes\unit\warexplodedmojo\test-dir\ExplodedWar_WithDuplicateDependencies]
[INFO] Processing war project
[INFO] Copying webapp resources [X:\slave\workspace\maven-plugins-UTs\jdk\java-5x\label\windows\trunk\maven-war-plugin\target\test-classes\unit\warexplodedmojo\test-dir\ExplodedWar_WithDuplicateDependencies-test-data\source]
[INFO] Webapp assembled in [15 msecs]
[INFO] Exploding webapp
[INFO] Assembling webapp [maven-war-plugin-test] in [X:\slave\workspace\maven-plugins-UTs\jdk\java-5x\label\windows\trunk\maven-war-plugin\target\test-classes\unit\warexplodedmojo\test-dir\ExplodedWar_DuplicateWithClassifier]
[INFO] Processing war project
[INFO] Copying webapp resources [X:\slave\workspace\maven-plugins-UTs\jdk\java-5x\label\windows\trunk\maven-war-plugin\target\test-classes\unit\warexplodedmojo\test-dir\ExplodedWar_DuplicateWithClassifier-test-data\source]
[INFO] Webapp assembled in [12 msecs]
[INFO] Exploding webapp
[INFO] Assembling webapp [maven-war-plugin-test] in [X:\slave\workspace\maven-plugins-UTs\jdk\java-5x\label\windows\trunk\maven-war-plugin\target\test-classes\unit\warexplodedmojo\test-dir\ExplodedWar_WithClasses]
[INFO] Processing war project
[INFO] Copying webapp resources [X:\slave\workspace\maven-plugins-UTs\jdk\java-5x\label\windows\trunk\maven-war-plugin\target\test-classes\unit\warexplodedmojo\test-dir\ExplodedWar_WithClasses-test-data\source]
[INFO] Webapp assembled in [10 msecs]
[INFO] Exploding webapp
[INFO] Assembling webapp [maven-war-plugin-test] in [X:\slave\workspace\maven-plugins-UTs\jdk\java-5x\label\windows\trunk\maven-war-plugin\target\test-classes\unit\warexplodedmojo\test-dir\ExplodedWar_WithSourceIncludeExclude]
[INFO] Processing war project
[INFO] Copying webapp resources [X:\slave\workspace\maven-plugins-UTs\jdk\java-5x\label\windows\trunk\maven-war-plugin\target\test-classes\unit\warexplodedmojo\test-dir\ExplodedWar_WithSourceIncludeExclude-test-data\source]
[INFO] Webapp assembled in [5 msecs]
[INFO] Exploding webapp
[INFO] Assembling webapp [maven-war-plugin-test] in [X:\slave\workspace\maven-plugins-UTs\jdk\java-5x\label\windows\trunk\maven-war-plugin\target\test-classes\unit\warexplodedmojo\test-dir\ExplodedWar_WithWarDependencyIncludeExclude]
[INFO] Processing war project
[INFO] Copying webapp resources [X:\slave\workspace\maven-plugins-UTs\jdk\java-5x\label\windows\trunk\maven-war-plugin\target\test-classes\unit\warexplodedmojo\test-dir\ExplodedWar_WithWarDependencyIncludeExclude-test-data\source]
[INFO] Processing overlay [ id wartests:war-include-exclude]
[INFO] Webapp assembled in [30 msecs]
[INFO] Exploding webapp
[INFO] Assembling webapp [maven-war-plugin-test] in [X:\slave\workspace\maven-plugins-UTs\jdk\java-5x\label\windows\trunk\maven-war-plugin\target\test-classes\unit\warexplodedmojo\test-dir\ExplodedWarWithSourceModificationCheck]
[INFO] Processing war project
[INFO] Copying webapp resources [X:\slave\workspace\maven-plugins-UTs\jdk\java-5x\label\windows\trunk\maven-war-plugin\target\test-classes\unit\warexplodedmojo\test-dir\ExplodedWarWithSourceModificationCheck-test-data\source]
[INFO] Webapp assembled in [7 msecs]
[INFO] Exploding webapp
[INFO] Assembling webapp [maven-war-plugin-test] in [X:\slave\workspace\maven-plugins-UTs\jdk\java-5x\label\windows\trunk\maven-war-plugin\target\test-classes\unit\warexplodedmojo\test-dir\ExplodedWarWithFileNameMapping]
[INFO] Processing war project
[INFO] Copying webapp resources [X:\slave\workspace\maven-plugins-UTs\jdk\java-5x\label\windows\trunk\maven-war-plugin\target\test-classes\unit\warexplodedmojo\test-dir\ExplodedWarWithFileNameMapping-test-data\source]
[INFO] Webapp assembled in [11 msecs]
[INFO] Exploding webapp
[INFO] Assembling webapp [maven-war-plugin-test] in [X:\slave\workspace\maven-plugins-UTs\jdk\java-5x\label\windows\trunk\maven-war-plugin\target\test-classes\unit\warexplodedmojo\test-dir\ExplodedWarWithFileNameMappingAndDuplicateDependencies]
[INFO] Processing war project
[INFO] Copying webapp resources [X:\slave\workspace\maven-plugins-UTs\jdk\java-5x\label\windows\trunk\maven-war-plugin\target\test-classes\unit\warexplodedmojo\test-dir\ExplodedWarWithFileNameMappingAndDuplicateDependencies-test-data\source]
[INFO] Webapp assembled in [10 msecs]
Tests run: 21, Failures: 0, Errors: 0, Skipped: 0, Time elapsed: 2.982 sec
Running org.apache.maven.plugin.war.WarInPlaceMojoTest
[INFO] Generating webapp in source directory [X:\slave\workspace\maven-plugins-UTs\jdk\java-5x\label\windows\trunk\maven-war-plugin\target\test-classes\unit\warexplodedinplacemojo\test-dir\SimpleExplodedInplaceWar-test-data\source]
[INFO] Assembling webapp [maven-war-plugin-test] in [X:\slave\workspace\maven-plugins-UTs\jdk\java-5x\label\windows\trunk\maven-war-plugin\target\test-classes\unit\warexplodedinplacemojo\test-dir\SimpleExplodedInplaceWar-test-data\source]
[INFO] Processing war project
[INFO] Copying webapp webResources [X:\slave\workspace\maven-plugins-UTs\jdk\java-5x\label\windows\trunk\maven-war-plugin\target\test-classes\unit\warexplodedinplacemojo\test-dir\resources]
to [X:\slave\workspace\maven-plugins-UTs\jdk\java-5x\label\windows\trunk\maven-war-plugin\target\test-classes\unit\warexplodedinplacemojo\test-dir\SimpleExplodedInplaceWar-test-data\source]
[INFO] Webapp assembled in [4 msecs]
Tests run: 2, Failures: 0, Errors: 0, Skipped: 0, Time elapsed: 0.15 sec
Running org.apache.maven.plugin.war.WarManifestMojoTest
Tests run: 6, Failures: 0, Errors: 0, Skipped: 0, Time elapsed: 0.38 sec
Running org.apache.maven.plugin.war.util.PathSetTest
Tests run: 5, Failures: 0, Errors: 0, Skipped: 0, Time elapsed: 0.011 sec
Running org.apache.maven.plugin.war.util.WarUtilsTest
Tests run: 1, Failures: 0, Errors: 0, Skipped: 0, Time elapsed: 0.003 sec
Running org.apache.maven.plugin.war.overlay.OverlayManagerTest
Tests run: 5, Failures: 0, Errors: 0, Skipped: 0, Time elapsed: 0.34 sec
Running org.apache.maven.plugin.war.WarDependenciesAnalysisTest
[INFO] Exploding webapp
[INFO] Assembling webapp [maven-war-plugin-test] in [X:\slave\workspace\maven-plugins-UTs\jdk\java-5x\label\windows\trunk\maven-war-plugin\target\test-classes\unit\dependenciesanalysis\test-dir\no-change]
[INFO] Processing war project
[INFO] Copying webapp resources [X:\slave\workspace\maven-plugins-UTs\jdk\java-5x\label\windows\trunk\maven-war-plugin\target\test-classes\unit\dependenciesanalysis\test-dir\no-change-test-data\source]
[INFO] Webapp assembled in [14 msecs]
[INFO] Exploding webapp
[INFO] Assembling webapp [maven-war-plugin-test] in [X:\slave\workspace\maven-plugins-UTs\jdk\java-5x\label\windows\trunk\maven-war-plugin\target\test-classes\unit\dependenciesanalysis\test-dir\no-change]
[INFO] Processing war project
[INFO] Copying webapp resources [X:\slave\workspace\maven-plugins-UTs\jdk\java-5x\label\windows\trunk\maven-war-plugin\target\test-classes\unit\dependenciesanalysis\test-dir\no-change-test-data\source]
[INFO] Webapp assembled in [6 msecs]
[INFO] Exploding webapp
[INFO] Assembling webapp [maven-war-plugin-test] in [X:\slave\workspace\maven-plugins-UTs\jdk\java-5x\label\windows\trunk\maven-war-plugin\target\test-classes\unit\dependenciesanalysis\test-dir\remove-dependency]
[INFO] Processing war project
[INFO] Copying webapp resources [X:\slave\workspace\maven-plugins-UTs\jdk\java-5x\label\windows\trunk\maven-war-plugin\target\test-classes\unit\dependenciesanalysis\test-dir\remove-dependency-test-data\source]
[INFO] Webapp assembled in [12 msecs]
[INFO] Exploding webapp
[INFO] Assembling webapp [maven-war-plugin-test] in [X:\slave\workspace\maven-plugins-UTs\jdk\java-5x\label\windows\trunk\maven-war-plugin\target\test-classes\unit\dependenciesanalysis\test-dir\remove-dependency]
[INFO] Dependency [Dependency {groupId=org.sample.jar, artifactId=lib-test, version=1.0, type=jar}]
has been removed from the project.
[INFO] Processing war project
[INFO] Copying webapp resources [X:\slave\workspace\maven-plugins-UTs\jdk\java-5x\label\windows\trunk\maven-war-plugin\target\test-classes\unit\dependenciesanalysis\test-dir\remove-dependency-test-data\source]
[INFO] Webapp assembled in [7 msecs]
[INFO] Exploding webapp
[INFO] Assembling webapp [maven-war-plugin-test] in [X:\slave\workspace\maven-plugins-UTs\jdk\java-5x\label\windows\trunk\maven-war-plugin\target\test-classes\unit\dependenciesanalysis\test-dir\dependency-update-version]
[INFO] Processing war project
[INFO] Copying webapp resources [X:\slave\workspace\maven-plugins-UTs\jdk\java-5x\label\windows\trunk\maven-war-plugin\target\test-classes\unit\dependenciesanalysis\test-dir\dependency-update-version-test-data\source]
[INFO] Webapp assembled in [10 msecs]
[INFO] Exploding webapp
[INFO] Assembling webapp [maven-war-plugin-test] in [X:\slave\workspace\maven-plugins-UTs\jdk\java-5x\label\windows\trunk\maven-war-plugin\target\test-classes\unit\dependenciesanalysis\test-dir\dependency-update-version]
[INFO] Version of dependency [Dependency {groupId=org.sample.jar, artifactId=lib-test, version=2.0,
type=jar}] has changed (1.0 -> 2.0).
[INFO] Processing war project
[INFO] Copying webapp resources [X:\slave\workspace\maven-plugins-UTs\jdk\java-5x\label\windows\trunk\maven-war-plugin\target\test-classes\unit\dependenciesanalysis\test-dir\dependency-update-version-test-data\source]
[INFO] Webapp assembled in [9 msecs]
[INFO] Exploding webapp
[INFO] Assembling webapp [maven-war-plugin-test] in [X:\slave\workspace\maven-plugins-UTs\jdk\java-5x\label\windows\trunk\maven-war-plugin\target\test-classes\unit\dependenciesanalysis\test-dir\dependency-now-provided]
[INFO] Processing war project
[INFO] Copying webapp resources [X:\slave\workspace\maven-plugins-UTs\jdk\java-5x\label\windows\trunk\maven-war-plugin\target\test-classes\unit\dependenciesanalysis\test-dir\dependency-now-provided-test-data\source]
[INFO] Webapp assembled in [11 msecs]
[INFO] Exploding webapp
[INFO] Assembling webapp [maven-war-plugin-test] in [X:\slave\workspace\maven-plugins-UTs\jdk\java-5x\label\windows\trunk\maven-war-plugin\target\test-classes\unit\dependenciesanalysis\test-dir\dependency-now-provided]
[INFO] Scope of dependency [Dependency {groupId=org.sample.jar, artifactId=lib-test, version=1.0,
type=jar}] has changed (runtime -> provided).
[INFO] Processing war project
[INFO] Copying webapp resources [X:\slave\workspace\maven-plugins-UTs\jdk\java-5x\label\windows\trunk\maven-war-plugin\target\test-classes\unit\dependenciesanalysis\test-dir\dependency-now-provided-test-data\source]
[INFO] Webapp assembled in [8 msecs]
Tests run: 4, Failures: 0, Errors: 0, Skipped: 0, Time elapsed: 0.38 sec

Results :

Tests run: 83, Failures: 0, Errors: 0, Skipped: 0

[INFO] [jar:jar {execution: default-jar}]
[INFO] Building jar: X:\slave\workspace\maven-plugins-UTs\jdk\java-5x\label\windows\trunk\maven-war-plugin\target\maven-war-plugin-2.2-SNAPSHOT.jar
[INFO] [plugin:addPluginArtifactMetadata {execution: default-addPluginArtifactMetadata}]
[INFO] [install:install {execution: default-install}]
[INFO] Installing X:\slave\workspace\maven-plugins-UTs\jdk\java-5x\label\windows\trunk\maven-war-plugin\target\maven-war-plugin-2.2-SNAPSHOT.jar
to x:\slave\workspace\maven-plugins-UTs\jdk\java-5x\label\windows\.repository\org\apache\maven\plugins\maven-war-plugin\2.2-SNAPSHOT\maven-war-plugin-2.2-SNAPSHOT.jar
[INFO] ------------------------------------------------------------------------
[INFO] Building Maven Plugins Aggregator
[INFO]    task-segment: [clean, install]
[INFO] ------------------------------------------------------------------------
[INFO] [clean:clean {execution: default-clean}]
[INFO] Deleting x:\slave\workspace\maven-plugins-UTs\jdk\java-5x\label\windows\trunk\target
[INFO] [remote-resources:process {execution: default}]
[INFO] [site:attach-descriptor {execution: default-attach-descriptor}]
[INFO] [install:install {execution: default-install}]
[INFO] Installing x:\slave\workspace\maven-plugins-UTs\jdk\java-5x\label\windows\trunk\pom.xml
to x:\slave\workspace\maven-plugins-UTs\jdk\java-5x\label\windows\.repository\org\apache\maven\plugins\maven-plugins-aggregator\1-SNAPSHOT\maven-plugins-aggregator-1-SNAPSHOT.pom
[INFO] 
[INFO] 
[INFO] ------------------------------------------------------------------------
[INFO] Reactor Summary:
[INFO] ------------------------------------------------------------------------
[INFO] Maven Plugins ......................................... SUCCESS [13.336s]
[INFO] Maven Ant Plugin ...................................... SUCCESS [15.852s]
[INFO] Maven AntRun Plugin ................................... SUCCESS [3.762s]
[INFO] Maven Eclipse Plugin .................................. SUCCESS [28.376s]
[INFO] Maven Changelog Plugin ................................ SUCCESS [9.733s]
[INFO] Maven Changes Report Plugin ........................... SUCCESS [9.301s]
[INFO] Maven Checkstyle Plugin ............................... SUCCESS [18.912s]
[INFO] Maven Clean Plugin .................................... SUCCESS [3.060s]
[INFO] Maven Compiler Plugin ................................. SUCCESS [10.151s]
[INFO] Maven Dependency Plugin ............................... FAILED [56.780s]
[INFO] Maven Deploy Plugin ................................... SUCCESS [5.146s]
[INFO] Maven DOAP Plugin ..................................... SUCCESS [11.054s]
[INFO] Maven Documentation Checker Plugin .................... SUCCESS [1.440s]
[INFO] Maven EAR Plugin ...................................... SUCCESS [6.193s]
[INFO] Maven EJB Plugin ...................................... SUCCESS [5.795s]
[INFO] Maven GPG Plugin ...................................... SUCCESS [1.440s]
[INFO] Maven Help Plugin ..................................... SUCCESS [4.192s]
[INFO] Maven IDEA Plugin ..................................... SUCCESS [15.372s]
[INFO] Maven Install Plugin .................................. SUCCESS [5.469s]
[INFO] Maven Invoker Plugin .................................. SUCCESS [10.918s]
[INFO] Maven JAR Plugin ...................................... SUCCESS [2.975s]
[INFO] Maven Jarsigner Plugin ................................ SUCCESS [1.343s]
[INFO] Maven Shade Plugin .................................... SUCCESS [7.338s]
[INFO] Maven Javadoc Plugin .................................. SUCCESS [5:18.805s]
[INFO] Maven Linkcheck Plugin ................................ SUCCESS [2.816s]
[INFO] Maven One Plugin ...................................... SUCCESS [3.914s]
[INFO] Maven Patch Plugin .................................... SUCCESS [1.452s]
[INFO] Maven PDF Plugin ...................................... SUCCESS [18.449s]
[INFO] Maven PMD Plugin ...................................... SUCCESS [10.583s]
[INFO] Maven RAR Plugin ...................................... SUCCESS [3.408s]
[INFO] Maven Reactor Plugin .................................. SUCCESS [4.179s]
[INFO] Maven Repository Plugin ............................... SUCCESS [6.692s]
[INFO] Maven Resources Plugin ................................ SUCCESS [5.607s]
[INFO] Maven Site Plugin ..................................... SUCCESS [14.518s]
[INFO] Maven Source Plugin ................................... SUCCESS [3.939s]
[INFO] Maven Stage Plugin .................................... SUCCESS [2.860s]
[INFO] Maven Toolchains Plugin ............................... SUCCESS [1.759s]
[INFO] Maven Verifier Plugin ................................. SUCCESS [2.613s]
[INFO] Maven WAR Plugin ...................................... SUCCESS [18.318s]
[INFO] Maven Plugins Aggregator .............................. SUCCESS [0.033s]
[INFO] ------------------------------------------------------------------------
[INFO] Error for project: Maven Dependency Plugin (during install)
[INFO] ------------------------------------------------------------------------
[INFO] There are test failures.

Please refer to X:\slave\workspace\maven-plugins-UTs\jdk\java-5x\label\windows\trunk\maven-dependency-plugin\target\surefire-reports
for the individual test results.
[INFO] ------------------------------------------------------------------------
[INFO] Trace
org.apache.maven.BuildFailureException: There are test failures.

Please refer to X:\slave\workspace\maven-plugins-UTs\jdk\java-5x\label\windows\trunk\maven-dependency-plugin\target\surefire-reports
for the individual test results.
	at org.apache.maven.lifecycle.DefaultLifecycleExecutor.executeGoals(DefaultLifecycleExecutor.java:715)
	at org.apache.maven.lifecycle.DefaultLifecycleExecutor.executeGoalWithLifecycle(DefaultLifecycleExecutor.java:556)
	at org.apache.maven.lifecycle.DefaultLifecycleExecutor.executeGoal(DefaultLifecycleExecutor.java:535)
	at org.apache.maven.lifecycle.DefaultLifecycleExecutor.executeGoalAndHandleFailures(DefaultLifecycleExecutor.java:387)
	at org.apache.maven.lifecycle.DefaultLifecycleExecutor.executeTaskSegments(DefaultLifecycleExecutor.java:348)
	at org.apache.maven.lifecycle.DefaultLifecycleExecutor.execute(DefaultLifecycleExecutor.java:180)
	at org.apache.maven.DefaultMaven.doExecute(DefaultMaven.java:328)
	at org.apache.maven.DefaultMaven.execute(DefaultMaven.java:138)
	at org.apache.maven.cli.MavenCli.main(MavenCli.java:362)
	at org.apache.maven.cli.compat.CompatibleMain.main(CompatibleMain.java:60)
	at sun.reflect.NativeMethodAccessorImpl.invoke0(Native Method)
	at sun.reflect.NativeMethodAccessorImpl.invoke(NativeMethodAccessorImpl.java:39)
	at sun.reflect.DelegatingMethodAccessorImpl.invoke(DelegatingMethodAccessorImpl.java:25)
	at java.lang.reflect.Method.invoke(Method.java:592)
	at org.codehaus.classworlds.Launcher.launchEnhanced(Launcher.java:315)
	at org.codehaus.classworlds.Launcher.launch(Launcher.java:255)
	at org.codehaus.classworlds.Launcher.mainWithExitCode(Launcher.java:430)
	at org.codehaus.classworlds.Launcher.main(Launcher.java:375)
Caused by: org.apache.maven.plugin.MojoFailureException: There are test failures.

Please refer to X:\slave\workspace\maven-plugins-UTs\jdk\java-5x\label\windows\trunk\maven-dependency-plugin\target\surefire-reports
for the individual test results.
	at org.apache.maven.plugin.surefire.SurefireHelper.reportExecution(SurefireHelper.java:74)
	at org.apache.maven.plugin.surefire.SurefirePlugin.execute(SurefirePlugin.java:642)
	at org.apache.maven.plugin.DefaultPluginManager.executeMojo(DefaultPluginManager.java:490)
	at org.apache.maven.lifecycle.DefaultLifecycleExecutor.executeGoals(DefaultLifecycleExecutor.java:694)
	... 17 more
[INFO] ------------------------------------------------------------------------
[INFO] BUILD ERRORS
[INFO] ------------------------------------------------------------------------
[INFO] Total time: 11 minutes 9 seconds
[INFO] Finished at: Tue Mar 08 16:23:43 PST 2011
[INFO] Final Memory: 113M/214M
[INFO] ------------------------------------------------------------------------


Mime
View raw message