maven-notifications mailing list archives

Site index · List index
Message view « Date » · « Thread »
Top « Date » · « Thread »
From Apache Jenkins Server <jenk...@builds.apache.org>
Subject Build failed in Jenkins: maven-plugins-ITs-2.x #280
Date Sun, 31 Jul 2011 18:03:26 GMT
See <https://builds.apache.org/job/maven-plugins-ITs-2.x/280/changes>

Changes:

[hboutemy] [MPIR-228] relaxed algorithm to detect HTML content for license

[hboutemy] o made port used as parameters
o avoid 8080 port, which is too common and causes conflicts

------------------------------------------
[...truncated 6281 lines...]
[INFO] Processing overlay [ id wartests:overlay-full-1]
[INFO] Processing overlay [ id wartests:overlay-full-2]
[INFO] Processing overlay [ id wartests:overlay-full-3]
[INFO] Webapp assembled in [33 msecs]
[INFO] Exploding webapp
[INFO] Assembling webapp [maven-war-plugin-test] in [<https://builds.apache.org/job/maven-plugins-ITs-2.x/ws/maven-war-plugin/target/test-classes/unit/waroverlays/scenario-one-overlay-settings]>
[INFO] Processing war project
[INFO] Copying webapp resources [<https://builds.apache.org/job/maven-plugins-ITs-2.x/ws/maven-war-plugin/target/test-classes/unit/waroverlays/scenario-one-overlay-settings-test-data/source]>
[INFO] Processing overlay [ id wartests:overlay-full-1]
[INFO] Processing overlay [ id wartests:overlay-full-2]
[INFO] Processing overlay [ id wartests:overlay-full-3]
[INFO] Webapp assembled in [33 msecs]
[INFO] Exploding webapp
[INFO] Assembling webapp [maven-war-plugin-test] in [<https://builds.apache.org/job/maven-plugins-ITs-2.x/ws/maven-war-plugin/target/test-classes/unit/waroverlays/scenario-one-full-settings]>
[INFO] Processing war project
[INFO] Copying webapp resources [<https://builds.apache.org/job/maven-plugins-ITs-2.x/ws/maven-war-plugin/target/test-classes/unit/waroverlays/scenario-one-full-settings-test-data/source]>
[INFO] Processing overlay [ id wartests:overlay-full-1]
[INFO] Processing overlay [ id wartests:overlay-full-2]
[INFO] Processing overlay [ id wartests:overlay-full-3]
[INFO] Webapp assembled in [32 msecs]
[INFO] Exploding webapp
[INFO] Assembling webapp [maven-war-plugin-test] in [<https://builds.apache.org/job/maven-plugins-ITs-2.x/ws/maven-war-plugin/target/test-classes/unit/waroverlays/overlays-includes-excludes-multiple-defs]>
[INFO] Processing overlay [ id wartests:overlay-full-3]
[INFO] Processing overlay [ id wartests:overlay-full-1]
[INFO] Processing overlay [ id wartests:overlay-full-3]
[INFO] Processing war project
[INFO] Copying webapp resources [<https://builds.apache.org/job/maven-plugins-ITs-2.x/ws/maven-war-plugin/target/test-classes/unit/waroverlays/overlays-includes-excludes-multiple-defs-test-data/source]>
[INFO] Processing overlay [ id wartests:overlay-full-2]
[INFO] Webapp assembled in [420 msecs]
[INFO] Exploding webapp
[INFO] Assembling webapp [maven-war-plugin-test] in [<https://builds.apache.org/job/maven-plugins-ITs-2.x/ws/maven-war-plugin/target/test-classes/unit/waroverlays/overlays-includes-excludes-multiple-defs2]>
[INFO] Processing overlay [ id wartests:overlay-full-3]
[INFO] Processing overlay [ id wartests:overlay-full-1]
[INFO] Processing overlay [ id wartests:overlay-full-3]
[INFO] Processing war project
[INFO] Copying webapp resources [<https://builds.apache.org/job/maven-plugins-ITs-2.x/ws/maven-war-plugin/target/test-classes/unit/waroverlays/overlays-includes-excludes-multiple-defs2-test-data/source]>
[INFO] Processing overlay [ id wartests:overlay-full-2]
[INFO] Webapp assembled in [979 msecs]
[INFO] Exploding webapp
[INFO] Assembling webapp [maven-war-plugin-test] in [<https://builds.apache.org/job/maven-plugins-ITs-2.x/ws/maven-war-plugin/target/test-classes/unit/waroverlays/cache-updated-overlay]>
[INFO] Processing war project
[INFO] Copying webapp resources [<https://builds.apache.org/job/maven-plugins-ITs-2.x/ws/maven-war-plugin/target/test-classes/unit/waroverlays/cache-updated-overlay-test-data/source]>
[INFO] Processing overlay [ id wartests:overlay-one]
[INFO] Processing overlay [ id wartests:overlay-two]
[INFO] Webapp assembled in [11 msecs]
[INFO] Exploding webapp
[INFO] Assembling webapp [maven-war-plugin-test] in [<https://builds.apache.org/job/maven-plugins-ITs-2.x/ws/maven-war-plugin/target/test-classes/unit/waroverlays/cache-updated-overlay]>
[INFO] Processing war project
[INFO] Copying webapp resources [<https://builds.apache.org/job/maven-plugins-ITs-2.x/ws/maven-war-plugin/target/test-classes/unit/waroverlays/cache-updated-overlay-test-data/source]>
[INFO] Processing overlay [ id wartests:overlay-two]
[INFO] File [index.jsp] belonged to overlay [wartests:overlay-one] so it will be overwritten.
[INFO] File [WEB-INF/web.xml] belonged to overlay [wartests:overlay-one] so it will be overwritten.
[INFO] Processing overlay [ id wartests:overlay-one]
[INFO] Webapp assembled in [6 msecs]
[INFO] Exploding webapp
[INFO] Assembling webapp [maven-war-plugin-test] in [<https://builds.apache.org/job/maven-plugins-ITs-2.x/ws/maven-war-plugin/target/test-classes/unit/waroverlays/cache-removed-overlay]>
[INFO] Processing war project
[INFO] Copying webapp resources [<https://builds.apache.org/job/maven-plugins-ITs-2.x/ws/maven-war-plugin/target/test-classes/unit/waroverlays/cache-removed-overlay-test-data/source]>
[INFO] Processing overlay [ id wartests:overlay-one]
[INFO] Processing overlay [ id wartests:overlay-two]
[INFO] Webapp assembled in [10 msecs]
[INFO] Exploding webapp
[INFO] Assembling webapp [maven-war-plugin-test] in [<https://builds.apache.org/job/maven-plugins-ITs-2.x/ws/maven-war-plugin/target/test-classes/unit/waroverlays/cache-removed-overlay]>
[WARNING] Dependency [Dependency {groupId=wartests, artifactId=overlay-one, version=0.0-Test,
type=war}] has been removed from the project. If it was included in the build as an overlay,
consider cleaning the target directory of the project (mvn clean)
[INFO] Processing war project
[INFO] Copying webapp resources [<https://builds.apache.org/job/maven-plugins-ITs-2.x/ws/maven-war-plugin/target/test-classes/unit/waroverlays/cache-removed-overlay-test-data/source]>
[INFO] Processing overlay [ id wartests:overlay-two]
[WARNING] File [index.jsp] belonged to overlay [wartests:overlay-one] which does not exist
anymore in the current project. It is recommended to invoke clean if the dependencies of the
project changed.
[WARNING] File [WEB-INF/web.xml] belonged to overlay [wartests:overlay-one] which does not
exist anymore in the current project. It is recommended to invoke clean if the dependencies
of the project changed.
[INFO] Webapp assembled in [4 msecs]
Tests run: 11, Failures: 0, Errors: 0, Skipped: 0, Time elapsed: 3.52 sec
Running org.apache.maven.plugin.war.WarManifestMojoTest
Tests run: 6, Failures: 0, Errors: 0, Skipped: 0, Time elapsed: 0.219 sec
Running org.apache.maven.plugin.war.WarExplodedMojoFilteringTest
[INFO] Exploding webapp
[INFO] Assembling webapp [maven-war-plugin-test] in [<https://builds.apache.org/job/maven-plugins-ITs-2.x/ws/maven-war-plugin/target/test-classes/unit/warexplodedmojo/test-dir/ExplodedWar_WithResourceFiltering]>
[INFO] Processing war project
[INFO] Copying webapp webResources [<https://builds.apache.org/job/maven-plugins-ITs-2.x/ws/maven-war-plugin/target/test-classes/unit/warexplodedmojo/test-dir/ExplodedWar_WithResourceFiltering-test-data/resources]>
to [<https://builds.apache.org/job/maven-plugins-ITs-2.x/ws/maven-war-plugin/target/test-classes/unit/warexplodedmojo/test-dir/ExplodedWar_WithResourceFiltering]>
[INFO] Copying webapp resources [<https://builds.apache.org/job/maven-plugins-ITs-2.x/ws/maven-war-plugin/target/test-classes/unit/warexplodedmojo/test-dir/ExplodedWar_WithResourceFiltering-test-data/source]>
[INFO] Webapp assembled in [14 msecs]
 line system_key_1=<https://builds.apache.org/job/maven-plugins-ITs-2.x/ws/maven-war-plugin>
 need <https://builds.apache.org/job/maven-plugins-ITs-2.x/ws/maven-war-plugin>
 line system_key_2=<https://builds.apache.org/job/maven-plugins-ITs-2.x/ws/maven-war-plugin>
[INFO] Exploding webapp
[INFO] Assembling webapp [maven-war-plugin-test] in [<https://builds.apache.org/job/maven-plugins-ITs-2.x/ws/maven-war-plugin/target/test-classes/unit/warexplodedmojo/test-dir/ExplodedWar_WithResourceFiltering]>
[INFO] Processing war project
[INFO] Copying webapp webResources [<https://builds.apache.org/job/maven-plugins-ITs-2.x/ws/maven-war-plugin/target/test-classes/unit/warexplodedmojo/test-dir/ExplodedWar_WithResourceFiltering-test-data/resources]>
to [<https://builds.apache.org/job/maven-plugins-ITs-2.x/ws/maven-war-plugin/target/test-classes/unit/warexplodedmojo/test-dir/ExplodedWar_WithResourceFiltering]>
[INFO] Copying webapp resources [<https://builds.apache.org/job/maven-plugins-ITs-2.x/ws/maven-war-plugin/target/test-classes/unit/warexplodedmojo/test-dir/ExplodedWar_WithResourceFiltering-test-data/source]>
[INFO] Webapp assembled in [4 msecs]
[INFO] Exploding webapp
[INFO] Assembling webapp [maven-war-plugin-test] in [<https://builds.apache.org/job/maven-plugins-ITs-2.x/ws/maven-war-plugin/target/test-classes/unit/warexplodedmojo/test-dir/ExplodedWar_WithResourceFiltering]>
[INFO] Processing war project
[INFO] Copying webapp webResources [<https://builds.apache.org/job/maven-plugins-ITs-2.x/ws/maven-war-plugin/target/test-classes/unit/warexplodedmojo/test-dir/ExplodedWar_WithResourceFiltering-test-data/resources]>
to [<https://builds.apache.org/job/maven-plugins-ITs-2.x/ws/maven-war-plugin/target/test-classes/unit/warexplodedmojo/test-dir/ExplodedWar_WithResourceFiltering]>
[INFO] Copying webapp resources [<https://builds.apache.org/job/maven-plugins-ITs-2.x/ws/maven-war-plugin/target/test-classes/unit/warexplodedmojo/test-dir/ExplodedWar_WithResourceFiltering-test-data/source]>
[INFO] Webapp assembled in [5 msecs]
Tests run: 1, Failures: 0, Errors: 0, Skipped: 0, Time elapsed: 0.058 sec

Results :

Tests run: 83, Failures: 0, Errors: 0, Skipped: 0

[INFO] [jar:jar {execution: default-jar}]
[INFO] Building jar: <https://builds.apache.org/job/maven-plugins-ITs-2.x/ws/maven-war-plugin/target/maven-war-plugin-2.2-SNAPSHOT.jar>
[INFO] [plugin:addPluginArtifactMetadata {execution: default-addPluginArtifactMetadata}]
[INFO] [invoker:install {execution: integration-test}]
[INFO] Installing <https://builds.apache.org/job/maven-plugins-ITs-2.x/ws/maven-war-plugin/pom.xml>
to <https://builds.apache.org/job/maven-plugins-ITs-2.x/ws/maven-war-plugin/target/local-repo/org/apache/maven/plugins/maven-war-plugin/2.2-SNAPSHOT/maven-war-plugin-2.2-SNAPSHOT.pom>
[INFO] Installing <https://builds.apache.org/job/maven-plugins-ITs-2.x/ws/maven-war-plugin/target/maven-war-plugin-2.2-SNAPSHOT.jar>
to <https://builds.apache.org/job/maven-plugins-ITs-2.x/ws/maven-war-plugin/target/local-repo/org/apache/maven/plugins/maven-war-plugin/2.2-SNAPSHOT/maven-war-plugin-2.2-SNAPSHOT.jar>
[INFO] [invoker:run {execution: integration-test}]
[INFO] Building: scoped-dependency-same-artifact/pom.xml
[INFO] ..SUCCESS (5.9 s)
[INFO] Building: MWAR-96/pom.xml
[INFO] ..SUCCESS (3.5 s)
[INFO] Building: simple-war-no-webxml/pom.xml
[INFO] ..SUCCESS (2.9 s)
[INFO] Building: MWAR-131/pom.xml
[INFO] ..SUCCESS (10.1 s)
[INFO] Building: MWAR-133/pom.xml
[INFO] ..SUCCESS (2.2 s)
[INFO] Building: MWAR-129/pom.xml
[INFO] ..SUCCESS (2.3 s)
[INFO] Building: MWAR-62/pom.xml
[INFO] ..SUCCESS (2.5 s)
[INFO] Building: default/pom.xml
[INFO] ..SUCCESS (3.6 s)
[INFO] Building: MWAR-143/pom.xml
[INFO] ..SUCCESS (7.6 s)
[INFO] Building: web-resources-filtering/pom.xml
[INFO] ..SUCCESS (3.8 s)
[INFO] Building: simple-war-project/pom.xml
[INFO] ..SUCCESS (3.3 s)
[INFO] Building: MWAR-139/pom.xml
[INFO] ..SUCCESS (3.0 s)
[INFO] ---------------------------------------
[INFO] Execution Summary:
[INFO]   Builds Passing: 12
[INFO]   Builds Failing: 0
[INFO]   Builds Skipped: 0
[INFO] ---------------------------------------
[INFO] [install:install {execution: default-install}]
[INFO] Installing <https://builds.apache.org/job/maven-plugins-ITs-2.x/ws/maven-war-plugin/target/maven-war-plugin-2.2-SNAPSHOT.jar>
to /home/hudson/.m2/repository/org/apache/maven/plugins/maven-war-plugin/2.2-SNAPSHOT/maven-war-plugin-2.2-SNAPSHOT.jar
[INFO] ------------------------------------------------------------------------
[INFO] Building Maven Plugins Aggregator
[INFO]    task-segment: [clean, install]
[INFO] ------------------------------------------------------------------------
[INFO] [clean:clean {execution: default-clean}]
[INFO] Deleting <https://builds.apache.org/job/maven-plugins-ITs-2.x/ws/target>
[INFO] [remote-resources:process {execution: default}]
[INFO] [site:attach-descriptor {execution: default-attach-descriptor}]
[INFO] [install:install {execution: default-install}]
[INFO] Installing <https://builds.apache.org/job/maven-plugins-ITs-2.x/ws/pom.xml> to
/home/hudson/.m2/repository/org/apache/maven/plugins/maven-plugins-aggregator/1-SNAPSHOT/maven-plugins-aggregator-1-SNAPSHOT.pom
[INFO] 
[INFO] 
[INFO] ------------------------------------------------------------------------
[INFO] Reactor Summary:
[INFO] ------------------------------------------------------------------------
[INFO] Maven Plugins ......................................... SUCCESS [14.093s]
[INFO] Maven ACR Plugin ...................................... SUCCESS [24.969s]
[INFO] Maven Ant Plugin ...................................... SUCCESS [1:29.873s]
[INFO] Maven AntRun Plugin ................................... SUCCESS [1:07.830s]
[INFO] Maven Eclipse Plugin .................................. SUCCESS [13:21.177s]
[INFO] Maven Assembly Plugin ................................. FAILED [12:14.308s]
[INFO] Maven Changelog Plugin ................................ SUCCESS [22.270s]
[INFO] Maven Compiler Plugin ................................. SUCCESS [24.455s]
[INFO] Maven Changes Report Plugin ........................... SUCCESS [48.357s]
[INFO] Maven Checkstyle Plugin ............................... SUCCESS [1:19.028s]
[INFO] Maven Clean Plugin .................................... SUCCESS [12.763s]
[INFO] Maven Dependency Plugin ............................... FAILED [53.896s]
[INFO] Maven Deploy Plugin ................................... SUCCESS [58.942s]
[INFO] Maven DOAP Plugin ..................................... SUCCESS [16.647s]
[INFO] Maven Documentation Checker Plugin .................... SUCCESS [7.648s]
[INFO] Maven EAR Plugin ...................................... SUCCESS [3:12.789s]
[INFO] Maven EJB Plugin ...................................... SUCCESS [23.524s]
[INFO] Maven GPG Plugin ...................................... SUCCESS [16.272s]
[INFO] Maven Help Plugin ..................................... SUCCESS [30.294s]
[INFO] Maven IDEA Plugin ..................................... SUCCESS [6.518s]
[INFO] Maven Install Plugin .................................. SUCCESS [35.468s]
[INFO] Maven JAR Plugin ...................................... SUCCESS [1:03.087s]
[INFO] Maven Jarsigner Plugin ................................ SUCCESS [22.745s]
[INFO] Maven Shade Plugin .................................... SUCCESS [1:45.147s]
[INFO] Maven Javadoc Plugin .................................. SUCCESS [8:36.962s]
[INFO] Maven Linkcheck Plugin ................................ SUCCESS [1.563s]
[INFO] Maven One Plugin ...................................... SUCCESS [1.525s]
[INFO] Maven Patch Plugin .................................... SUCCESS [9.927s]
[INFO] Maven PDF Plugin ...................................... SUCCESS [28.974s]
[INFO] Maven PMD Plugin ...................................... SUCCESS [21.987s]
[INFO] Maven RAR Plugin ...................................... SUCCESS [6.099s]
[INFO] Maven Reactor Plugin .................................. SUCCESS [2.142s]
[INFO] Maven Repository Plugin ............................... SUCCESS [2:15.489s]
[INFO] Maven Resources Plugin ................................ SUCCESS [50.279s]
[INFO] Maven Site Plugin 3 ................................... FAILED [0.890s]
[INFO] Maven Source Plugin ................................... SUCCESS [28.579s]
[INFO] Maven Stage Plugin .................................... SUCCESS [1.472s]
[INFO] Maven Toolchains Plugin ............................... SUCCESS [1.266s]
[INFO] Maven Verifier Plugin ................................. SUCCESS [7.704s]
[INFO] Maven WAR Plugin ...................................... SUCCESS [1:09.402s]
[INFO] Maven Plugins Aggregator .............................. SUCCESS [1.069s]
[INFO] ------------------------------------------------------------------------
[INFO] Error for project: Maven Assembly Plugin (during install)
[INFO] ------------------------------------------------------------------------
[INFO] : org.apache.maven.plugin.invoker.InvokerSession@1763e79
1 build failed.
[INFO] ------------------------------------------------------------------------
[INFO] Error for project: Maven Dependency Plugin (during install)
[INFO] ------------------------------------------------------------------------
[INFO] There are test failures.

Please refer to <https://builds.apache.org/job/maven-plugins-ITs-2.x/ws/maven-dependency-plugin/target/surefire-reports>
for the individual test results.
[INFO] ------------------------------------------------------------------------
[INFO] Error for project: Maven Site Plugin 3 (during install)
[INFO] ------------------------------------------------------------------------
[INFO] Failed to resolve artifact.

Missing:
----------
1) org.apache.maven.reporting:maven-reporting-exec:jar:1.0.1

  Try downloading the file manually from the project website.

  Then, install it using the command: 
      mvn install:install-file -DgroupId=org.apache.maven.reporting -DartifactId=maven-reporting-exec
-Dversion=1.0.1 -Dpackaging=jar -Dfile=/path/to/file

  Alternatively, if you host your own repository you can deploy the file there: 
      mvn deploy:deploy-file -DgroupId=org.apache.maven.reporting -DartifactId=maven-reporting-exec
-Dversion=1.0.1 -Dpackaging=jar -Dfile=/path/to/file -Durl=[url] -DrepositoryId=[id]

  Path to dependency: 
  	1) org.apache.maven.plugins:maven-site-plugin:maven-plugin:3.1-SNAPSHOT
  	2) org.apache.maven.reporting:maven-reporting-exec:jar:1.0.1

----------
1 required artifact is missing.

for artifact: 
  org.apache.maven.plugins:maven-site-plugin:maven-plugin:3.1-SNAPSHOT

from the specified remote repositories:
  central (http://repo1.maven.org/maven2),
  Nexus (http://repository.apache.org/snapshots)



[INFO] ------------------------------------------------------------------------
[INFO] For more information, run Maven with the -e switch
[INFO] ------------------------------------------------------------------------
[INFO] BUILD ERRORS
[INFO] ------------------------------------------------------------------------
[INFO] Total time: 57 minutes 18 seconds
[INFO] Finished at: Sun Jul 31 18:03:25 UTC 2011
[INFO] Final Memory: 86M/417M
[INFO] ------------------------------------------------------------------------


Mime
View raw message