maven-notifications mailing list archives

Site index · List index
Message view « Date » · « Thread »
Top « Date » · « Thread »
From Apache Jenkins Server <jenk...@builds.apache.org>
Subject Build failed in Jenkins: maven-plugins-ITs-3.x #128
Date Sat, 23 Jul 2011 11:29:18 GMT
See <https://builds.apache.org/job/maven-plugins-ITs-3.x/128/changes>

Changes:

[hboutemy] use another artifact than maven-artifact for unknown apidocs link test, because
maven-artifact apidocs is known since r1144973 (ie. added a redirect rule in Maven site)

[hboutemy] upgrade commons-logging artifact used for proxy test to avoid redirect from jakarta
to commons site

------------------------------------------
[...truncated 8195 lines...]
	at org.apache.maven.plugin.internal.DefaultPluginDependenciesResolver.resolve(DefaultPluginDependenciesResolver.java:129)
	at org.apache.maven.plugin.internal.DefaultMavenPluginManager.getPluginDescriptor(DefaultMavenPluginManager.java:142)
	at org.apache.maven.plugin.internal.DefaultMavenPluginManager.getMojoDescriptor(DefaultMavenPluginManager.java:261)
	at org.apache.maven.plugin.DefaultBuildPluginManager.getMojoDescriptor(DefaultBuildPluginManager.java:185)
	at org.apache.maven.lifecycle.internal.DefaultLifecycleExecutionPlanCalculator.calculateLifecycleMappings(DefaultLifecycleExecutionPlanCalculator.java:280)
	at org.apache.maven.lifecycle.internal.DefaultLifecycleExecutionPlanCalculator.calculateMojoExecutions(DefaultLifecycleExecutionPlanCalculator.java:193)
	at org.apache.maven.lifecycle.internal.DefaultLifecycleExecutionPlanCalculator.calculateExecutionPlan(DefaultLifecycleExecutionPlanCalculator.java:112)
	at org.apache.maven.lifecycle.internal.DefaultLifecycleExecutionPlanCalculator.calculateExecutionPlan(DefaultLifecycleExecutionPlanCalculator.java:129)
	at org.apache.maven.lifecycle.internal.BuilderCommon.resolveBuildPlan(BuilderCommon.java:92)
	at org.apache.maven.lifecycle.internal.LifecycleModuleBuilder.buildProject(LifecycleModuleBuilder.java:81)
	at org.apache.maven.lifecycle.internal.LifecycleModuleBuilder.buildProject(LifecycleModuleBuilder.java:59)
	at org.apache.maven.lifecycle.internal.LifecycleStarter.singleThreadedBuild(LifecycleStarter.java:183)
	at org.apache.maven.lifecycle.internal.LifecycleStarter.execute(LifecycleStarter.java:161)
	at org.apache.maven.DefaultMaven.doExecute(DefaultMaven.java:319)
	at org.apache.maven.DefaultMaven.execute(DefaultMaven.java:156)
	at org.apache.maven.cli.MavenCli.execute(MavenCli.java:537)
	at org.apache.maven.cli.MavenCli.doMain(MavenCli.java:196)
	at org.apache.maven.cli.MavenCli.main(MavenCli.java:141)
	at sun.reflect.NativeMethodAccessorImpl.invoke0(Native Method)
	at sun.reflect.NativeMethodAccessorImpl.invoke(NativeMethodAccessorImpl.java:39)
	at sun.reflect.DelegatingMethodAccessorImpl.invoke(DelegatingMethodAccessorImpl.java:25)
	at java.lang.reflect.Method.invoke(Method.java:592)
	at org.codehaus.plexus.classworlds.launcher.Launcher.launchEnhanced(Launcher.java:290)
	at org.codehaus.plexus.classworlds.launcher.Launcher.launch(Launcher.java:230)
	at org.codehaus.plexus.classworlds.launcher.Launcher.mainWithExitCode(Launcher.java:409)
	at org.codehaus.plexus.classworlds.launcher.Launcher.main(Launcher.java:352)
Caused by: org.sonatype.aether.resolution.ArtifactDescriptorException: Failed to read artifact
descriptor for org.apache.maven.plugins:maven-remote-resources-plugin:jar:1.3-SNAPSHOT
	at org.apache.maven.repository.internal.DefaultArtifactDescriptorReader.loadPom(DefaultArtifactDescriptorReader.java:282)
	at org.apache.maven.repository.internal.DefaultArtifactDescriptorReader.readArtifactDescriptor(DefaultArtifactDescriptorReader.java:172)
	at org.sonatype.aether.impl.internal.DefaultRepositorySystem.readArtifactDescriptor(DefaultRepositorySystem.java:316)
	at org.apache.maven.plugin.internal.DefaultPluginDependenciesResolver.resolve(DefaultPluginDependenciesResolver.java:115)
	... 25 more
Caused by: org.sonatype.aether.resolution.ArtifactResolutionException: Could not find artifact
org.apache.maven.plugins:maven-remote-resources-plugin:pom:1.3-SNAPSHOT
	at org.sonatype.aether.impl.internal.DefaultArtifactResolver.resolve(DefaultArtifactResolver.java:541)
	at org.sonatype.aether.impl.internal.DefaultArtifactResolver.resolveArtifacts(DefaultArtifactResolver.java:220)
	at org.sonatype.aether.impl.internal.DefaultArtifactResolver.resolveArtifact(DefaultArtifactResolver.java:197)
	at org.apache.maven.repository.internal.DefaultArtifactDescriptorReader.loadPom(DefaultArtifactDescriptorReader.java:267)
	... 28 more
Caused by: org.sonatype.aether.transfer.ArtifactNotFoundException: Could not find artifact
org.apache.maven.plugins:maven-remote-resources-plugin:pom:1.3-SNAPSHOT
	at org.sonatype.aether.impl.internal.DefaultArtifactResolver.resolve(DefaultArtifactResolver.java:531)
	... 31 more
[ERROR] 
[ERROR] Re-run Maven using the -X switch to enable full debug logging.
[ERROR] 
[ERROR] For more information about the errors and possible solutions, please read the following
articles:
[ERROR] [Help 1] http://cwiki.apache.org/confluence/display/MAVEN/PluginResolutionException


Tests run: 8, Failures: 0, Errors: 8, Skipped: 0

[INFO]                                                                         
[INFO] ------------------------------------------------------------------------
[INFO] Building Maven Plugins Aggregator 1-SNAPSHOT
[INFO] ------------------------------------------------------------------------
[WARNING] *****************************************************************
[WARNING] * Your build is requesting parallel execution, but project      *
[WARNING] * contains the following plugin(s) that are not marked as       *
[WARNING] * @threadSafe to support parallel building.                     *
[WARNING] * While this /may/ work fine, please look for plugin updates    *
[WARNING] * and/or request plugins be made thread-safe.                   *
[WARNING] * If reporting an issue, report it against the plugin in        *
[WARNING] * question, not against maven-core                              *
[WARNING] *****************************************************************
[WARNING] The following plugins are not marked @threadSafe in Maven Plugins Aggregator:
[WARNING] org.apache.maven.plugins:maven-remote-resources-plugin:1.1
[WARNING] *****************************************************************
[INFO] 
[INFO] --- maven-clean-plugin:2.4.1:clean (default-clean) @ maven-plugins-aggregator ---
[INFO] Deleting <https://builds.apache.org/job/maven-plugins-ITs-3.x/ws/target>
[INFO] 
[INFO] --- maven-remote-resources-plugin:1.1:process (default) @ maven-plugins-aggregator
---
[INFO] 
[INFO] --- maven-install-plugin:2.3.1:install (default-install) @ maven-plugins-aggregator
---
[INFO] Installing <https://builds.apache.org/job/maven-plugins-ITs-3.x/ws/pom.xml> to
<https://builds.apache.org/job/maven-plugins-ITs-3.x/ws/.repository/org/apache/maven/plugins/maven-plugins-aggregator/1-SNAPSHOT/maven-plugins-aggregator-1-SNAPSHOT.pom>
[INFO] ..SUCCESS (16.2 s)
[INFO] Building: fail-build/pom.xml
[INFO] ..SUCCESS (4.0 s)
[INFO] Building: skip-install/pom.xml
[INFO] ..SUCCESS (3.6 s)
[INFO] Building: script-classpath-duplicates/pom.xml
[INFO] ..SUCCESS (6.5 s)
[INFO] Building: selector-conditions/pom.xml
[INFO] ..SUCCESS (7.0 s)
[INFO] Building: script-class-loading/pom.xml
[INFO] ..SUCCESS (7.4 s)
[INFO] Building: script-interpreter-detection/pom.xml
[INFO] ..SUCCESS (6.6 s)
[INFO] Building: fail-ignore-with-verify/pom.xml
[INFO] ..SUCCESS (4.1 s)
[INFO] Building: selector-scripts/pom.xml
[INFO] ..SUCCESS (5.5 s)
[INFO] Building: fail-postbuild/pom.xml
[INFO] ..SUCCESS (4.2 s)
[INFO] Building: invocation-project/pom.xml
[INFO] ..SUCCESS (5.9 s)
[INFO] Building: staging-dependencies/pom.xml
[INFO] ..SUCCESS (5.6 s)
[INFO] Building: local-repo-url/pom.xml
[INFO] ..SUCCESS (4.4 s)
[INFO] Building: fail-build-with-verify/pom.xml
[INFO] ..SUCCESS (85.6 s)
[INFO] Building: minimal-pom/pom.xml
[INFO] ..SUCCESS (4.2 s)
[INFO] Building: fail-prebuild/pom.xml
[INFO] ..SUCCESS (2.7 s)
[INFO] Building: pom-filtering-encoding/pom.xml
[INFO] ..SUCCESS (5.9 s)
[INFO] Building: install-extra-artifacts/pom.xml
[INFO] ..SUCCESS (7.2 s)
[INFO] Building: local-repo-default/pom.xml
[INFO] ..SUCCESS (25.3 s)
[INFO] -------------------------------------------------
[INFO] Build Summary:
[INFO]   Passed: 2, Failed: 0, Errors: 0, Skipped: 0
[INFO] -------------------------------------------------
[INFO] 
[INFO] --- maven-jarsigner-plugin:1.2:verify (verify) @ maven-project-info-reports-plugin
---
[INFO] 1 archive(s) processed
[INFO] 
[INFO] --- maven-install-plugin:2.3.1:install (default-install) @ maven-project-info-reports-plugin
---
[INFO] Installing <https://builds.apache.org/job/maven-plugins-ITs-3.x/ws/maven-project-info-reports-plugin/target/maven-project-info-reports-plugin-2.4.1-SNAPSHOT.jar>
to <https://builds.apache.org/job/maven-plugins-ITs-3.x/ws/.repository/org/apache/maven/plugins/maven-project-info-reports-plugin/2.4.1-SNAPSHOT/maven-project-info-reports-plugin-2.4.1-SNAPSHOT.jar>
[INFO] Installing <https://builds.apache.org/job/maven-plugins-ITs-3.x/ws/maven-project-info-reports-plugin/pom.xml>
to <https://builds.apache.org/job/maven-plugins-ITs-3.x/ws/.repository/org/apache/maven/plugins/maven-project-info-reports-plugin/2.4.1-SNAPSHOT/maven-project-info-reports-plugin-2.4.1-SNAPSHOT.pom>
[INFO] ..SUCCESS (12.3 s)
[INFO] Building: fail-ignore/pom.xml
[INFO] ..SUCCESS (4.0 s)
[INFO] Building: project-cloning-reactor/pom.xml
[INFO] ..SUCCESS (4.1 s)
[INFO] Building: project-setup/pom.xml
[INFO] ..SUCCESS (9.0 s)
[INFO] Building: clone-clean/pom.xml
[INFO] ..SUCCESS (4.0 s)
[INFO] Building: script-errors/pom.xml
[INFO] ..SUCCESS (3.7 s)
[INFO] Building: script-context/pom.xml
[INFO] ..SUCCESS (6.7 s)
[INFO] Building: invocation-spaces/pom.xml
[INFO] ..SUCCESS (12.2 s)
[INFO] Building: skip-run/pom.xml
[INFO] ..SUCCESS (2.8 s)
[INFO] Building: pom-filtering-reactor/pom.xml
[INFO] ..SUCCESS (5.1 s)
[INFO] Building: local-repo-isolated/pom.xml
[INFO] ..SUCCESS (5.0 s)
[INFO] Building: invocation-multiple/pom.xml
[INFO] ..SUCCESS (19.3 s)
[INFO] Building: staging-pom/pom.xml
[INFO] ..SUCCESS (2.8 s)
[INFO] Building: script-global-vars/pom.xml
[INFO] ..SUCCESS (6.5 s)
[INFO] Building: integration-test-never-fails/pom.xml
[INFO] ..SUCCESS (4.2 s)
[INFO] Building: project-cloning/pom.xml
[INFO] ..SUCCESS (6.6 s)
[INFO] Building: pom-less-invocation/pom.xml
[INFO] ..SUCCESS (3.1 s)
[INFO] Building: local-repo-path/pom.xml
[INFO] ..SUCCESS (6.2 s)
[INFO] Building: invocation-offline/pom.xml
[INFO] ..SUCCESS (5.6 s)
[INFO] Building: settings-auto-exclude/pom.xml
[INFO] ..SUCCESS (4.1 s)
[INFO] Building: staging-reactor/pom.xml
[INFO] ..SUCCESS (4.9 s)
[INFO] Building: script-accessibility/pom.xml
[INFO] ..SUCCESS (6.8 s)
[INFO] -------------------------------------------------
[INFO] Build Summary:
[INFO]   Passed: 40, Failed: 0, Errors: 0, Skipped: 0
[INFO] -------------------------------------------------
[INFO] 
[INFO] --- maven-install-plugin:2.3.1:install (default-install) @ maven-invoker-plugin ---
[INFO] Installing <https://builds.apache.org/job/maven-plugins-ITs-3.x/ws/maven-invoker-plugin/target/maven-invoker-plugin-1.6-SNAPSHOT.jar>
to <https://builds.apache.org/job/maven-plugins-ITs-3.x/ws/.repository/org/apache/maven/plugins/maven-invoker-plugin/1.6-SNAPSHOT/maven-invoker-plugin-1.6-SNAPSHOT.jar>
[INFO] Installing <https://builds.apache.org/job/maven-plugins-ITs-3.x/ws/maven-invoker-plugin/pom.xml>
to <https://builds.apache.org/job/maven-plugins-ITs-3.x/ws/.repository/org/apache/maven/plugins/maven-invoker-plugin/1.6-SNAPSHOT/maven-invoker-plugin-1.6-SNAPSHOT.pom>
[INFO] ------------------------------------------------------------------------
[INFO] Reactor Summary:
[INFO] 
[INFO] Maven Plugins ..................................... SUCCESS [38.225s]
[INFO] Maven ACR Plugin .................................. SUCCESS [1:07.905s]
[INFO] Maven Ant Plugin .................................. SUCCESS [2:24.545s]
[INFO] Maven AntRun Plugin ............................... SUCCESS [1:09.327s]
[INFO] Maven Eclipse Plugin .............................. SUCCESS [13:45.479s]
[INFO] Maven Assembly Plugin ............................. SUCCESS [16:58.973s]
[INFO] Maven Changelog Plugin ............................ SUCCESS [52.304s]
[INFO] Maven Changes Report Plugin ....................... SUCCESS [1:51.100s]
[INFO] Maven Checkstyle Plugin ........................... SUCCESS [1:32.358s]
[INFO] Maven Clean Plugin ................................ SUCCESS [21.478s]
[INFO] Maven Compiler Plugin ............................. SUCCESS [31.913s]
[INFO] Maven Dependency Plugin ........................... SUCCESS [2:56.586s]
[INFO] Maven Deploy Plugin ............................... SUCCESS [1:52.955s]
[INFO] Maven DOAP Plugin ................................. SUCCESS [25.061s]
[INFO] Maven Documentation Checker Plugin ................ SUCCESS [6.531s]
[INFO] Maven EAR Plugin .................................. SUCCESS [4:03.959s]
[INFO] Maven EJB Plugin .................................. SUCCESS [31.957s]
[INFO] Maven GPG Plugin .................................. SUCCESS [42.082s]
[INFO] Maven Help Plugin ................................. SUCCESS [1:03.761s]
[INFO] Maven IDEA Plugin ................................. SUCCESS [8.381s]
[INFO] Maven Install Plugin .............................. SUCCESS [1:12.501s]
[INFO] Maven JAR Plugin .................................. SUCCESS [1:36.706s]
[INFO] Maven Jarsigner Plugin ............................ SUCCESS [47.554s]
[INFO] Maven Javadoc Plugin .............................. FAILURE [6:51.598s]
[INFO] Maven Linkcheck Plugin ............................ SUCCESS [2.623s]
[INFO] Maven One Plugin .................................. SUCCESS [2.853s]
[INFO] Maven Patch Plugin ................................ SUCCESS [15.386s]
[INFO] Maven PDF Plugin .................................. SUCCESS [32.389s]
[INFO] Maven PMD Plugin .................................. SUCCESS [1:12.321s]
[INFO] Maven RAR Plugin .................................. SUCCESS [11.795s]
[INFO] Maven Reactor Plugin .............................. SUCCESS [2.890s]
[INFO] Maven Repository Plugin ........................... FAILURE [21.653s]
[INFO] Maven Resources Plugin ............................ SUCCESS [1:11.543s]
[INFO] Maven Shade Plugin ................................ SUCCESS [2:43.092s]
[INFO] Maven Site Plugin 2 ............................... SUCCESS [3:52.264s]
[INFO] Maven Source Plugin ............................... SUCCESS [36.953s]
[INFO] Maven Stage Plugin ................................ SUCCESS [2.197s]
[INFO] Maven Toolchains Plugin ........................... SUCCESS [1.393s]
[INFO] Maven Verifier Plugin ............................. SUCCESS [9.277s]
[INFO] Maven WAR Plugin .................................. SUCCESS [1:31.393s]
[INFO] Maven Invoker Plugin .............................. SUCCESS [4:47.719s]
[INFO] Maven Project Info Reports Plugin ................. SUCCESS [2:31.867s]
[INFO] Maven Remote Resources Plugin ..................... FAILURE [40.186s]
[INFO] Maven Plugins Aggregator .......................... SUCCESS [0.148s]
[INFO] ------------------------------------------------------------------------
[INFO] BUILD FAILURE
[INFO] ------------------------------------------------------------------------
[INFO] Total time: 30:11.052s (Wall Clock)
[INFO] Finished at: Sat Jul 23 11:29:17 UTC 2011
[INFO] Final Memory: 62M/1005M
[INFO] ------------------------------------------------------------------------
[WARNING] The requested profile "apache.snapshots" could not be activated because it does
not exist.
[ERROR] Failed to execute goal org.apache.maven.plugins:maven-surefire-plugin:2.7.2:test (integration-tests)
on project maven-repository-plugin: There are test failures.
[ERROR] 
[ERROR] Please refer to <https://builds.apache.org/job/maven-plugins-ITs-3.x/ws/maven-repository-plugin/target/surefire-reports>
for the individual test results.
[ERROR] -> [Help 1]
[ERROR] Failed to execute goal org.apache.maven.plugins:maven-surefire-plugin:2.7.2:test (default-test)
on project maven-javadoc-plugin: There are test failures.
[ERROR] 
[ERROR] Please refer to <https://builds.apache.org/job/maven-plugins-ITs-3.x/ws/maven-javadoc-plugin/target/surefire-reports>
for the individual test results.
[ERROR] -> [Help 1]
[ERROR] Failed to execute goal org.apache.maven.plugins:maven-surefire-plugin:2.7.2:test (integration-tests)
on project maven-remote-resources-plugin: There are test failures.
[ERROR] 
[ERROR] Please refer to <https://builds.apache.org/job/maven-plugins-ITs-3.x/ws/maven-remote-resources-plugin/target/surefire-reports>
for the individual test results.
[ERROR] -> [Help 1]
[ERROR] 
[ERROR] To see the full stack trace of the errors, re-run Maven with the -e switch.
[ERROR] Re-run Maven using the -X switch to enable full debug logging.
[ERROR] 
[ERROR] For more information about the errors and possible solutions, please read the following
articles:
[ERROR] [Help 1] http://cwiki.apache.org/confluence/display/MAVEN/MojoFailureException
[ERROR] 
[ERROR] After correcting the problems, you can resume the build with the command
[ERROR]   mvn <goals> -rf :maven-repository-plugin


Mime
View raw message