maven-notifications mailing list archives

Site index · List index
Message view « Date » · « Thread »
Top « Date » · « Thread »
From Apache Jenkins Server <jenk...@builds.apache.org>
Subject Build failed in Jenkins: maven-plugins-ITs-3.x #146
Date Fri, 29 Jul 2011 17:03:01 GMT
See <https://builds.apache.org/job/maven-plugins-ITs-3.x/146/changes>

Changes:

[struberg] fix broken unit test by disabling a false check.

The test never did use the proxy anyway, so it always did fail
to resolve commons-logging. The test only succeed by accident 
in previous versions because other tests left a specific version
of commons-logging in target/local-repo.

------------------------------------------
[...truncated 9220 lines...]
	at sun.reflect.NativeMethodAccessorImpl.invoke0(Native Method)
	at sun.reflect.NativeMethodAccessorImpl.invoke(NativeMethodAccessorImpl.java:39)
	at sun.reflect.DelegatingMethodAccessorImpl.invoke(DelegatingMethodAccessorImpl.java:25)
	at java.lang.reflect.Method.invoke(Method.java:592)
	at org.codehaus.plexus.classworlds.launcher.Launcher.launchEnhanced(Launcher.java:290)
	at org.codehaus.plexus.classworlds.launcher.Launcher.launch(Launcher.java:230)
	at org.codehaus.plexus.classworlds.launcher.Launcher.mainWithExitCode(Launcher.java:409)
	at org.codehaus.plexus.classworlds.launcher.Launcher.main(Launcher.java:352)
Caused by: org.sonatype.aether.resolution.ArtifactDescriptorException: Failed to read artifact
descriptor for org.apache.maven.plugins:maven-remote-resources-plugin:jar:1.3-SNAPSHOT
	at org.apache.maven.repository.internal.DefaultArtifactDescriptorReader.loadPom(DefaultArtifactDescriptorReader.java:282)
	at org.apache.maven.repository.internal.DefaultArtifactDescriptorReader.readArtifactDescriptor(DefaultArtifactDescriptorReader.java:172)
	at org.sonatype.aether.impl.internal.DefaultRepositorySystem.readArtifactDescriptor(DefaultRepositorySystem.java:316)
	at org.apache.maven.plugin.internal.DefaultPluginDependenciesResolver.resolve(DefaultPluginDependenciesResolver.java:115)
	... 25 more
Caused by: org.sonatype.aether.resolution.ArtifactResolutionException: Could not find artifact
org.apache.maven.plugins:maven-remote-resources-plugin:pom:1.3-SNAPSHOT
	at org.sonatype.aether.impl.internal.DefaultArtifactResolver.resolve(DefaultArtifactResolver.java:541)
	at org.sonatype.aether.impl.internal.DefaultArtifactResolver.resolveArtifacts(DefaultArtifactResolver.java:220)
	at org.sonatype.aether.impl.internal.DefaultArtifactResolver.resolveArtifact(DefaultArtifactResolver.java:197)
	at org.apache.maven.repository.internal.DefaultArtifactDescriptorReader.loadPom(DefaultArtifactDescriptorReader.java:267)
	... 28 more
Caused by: org.sonatype.aether.transfer.ArtifactNotFoundException: Could not find artifact
org.apache.maven.plugins:maven-remote-resources-plugin:pom:1.3-SNAPSHOT
	at org.sonatype.aether.impl.internal.DefaultArtifactResolver.resolve(DefaultArtifactResolver.java:531)
	... 31 more
[ERROR] 
[ERROR] Re-run Maven using the -X switch to enable full debug logging.
[ERROR] 
[ERROR] For more information about the errors and possible solutions, please read the following
articles:
[ERROR] [Help 1] http://cwiki.apache.org/confluence/display/MAVEN/PluginResolutionException

  test(org.apache.maven.plugin.resources.remote.it.IT_BadDependencyPoms): Exit code was non-zero:
1; command line and log = 
/home/hudson/hudson-slave/tools/Maven_3.0.3/bin/mvn -e --batch-mode -Dit.dir=<https://builds.apache.org/job/maven-plugins-ITs-3.x/ws/maven-remote-resources-plugin/target/test-classes/bad-dependency-poms>
-Dmaven.repo.local=<https://builds.apache.org/job/maven-plugins-ITs-3.x/ws/.repository>
org.apache.maven.plugins:maven-clean-plugin:clean generate-resources
[INFO] Error stacktraces are turned on.
[INFO] Scanning for projects...
[INFO]                                                                         
[INFO] ------------------------------------------------------------------------
[INFO] Building test 1.0
[INFO] ------------------------------------------------------------------------
[WARNING] The POM for org.apache.maven.plugins:maven-remote-resources-plugin:jar:1.3-SNAPSHOT
is missing, no dependency information available
[INFO] ------------------------------------------------------------------------
[INFO] BUILD FAILURE
[INFO] ------------------------------------------------------------------------
[INFO] Total time: 0.209s
[INFO] Finished at: Fri Jul 29 17:02:40 UTC 2011
[INFO] Final Memory: 2M/133M
[INFO] ------------------------------------------------------------------------
[ERROR] Plugin org.apache.maven.plugins:maven-remote-resources-plugin:1.3-SNAPSHOT or one
of its dependencies could not be resolved: Failed to read artifact descriptor for org.apache.maven.plugins:maven-remote-resources-plugin:jar:1.3-SNAPSHOT:
Could not find artifact org.apache.maven.plugins:maven-remote-resources-plugin:pom:1.3-SNAPSHOT
-> [Help 1]
org.apache.maven.plugin.PluginResolutionException: Plugin org.apache.maven.plugins:maven-remote-resources-plugin:1.3-SNAPSHOT
or one of its dependencies could not be resolved: Failed to read artifact descriptor for org.apache.maven.plugins:maven-remote-resources-plugin:jar:1.3-SNAPSHOT
	at org.apache.maven.plugin.internal.DefaultPluginDependenciesResolver.resolve(DefaultPluginDependenciesResolver.java:129)
	at org.apache.maven.plugin.internal.DefaultMavenPluginManager.getPluginDescriptor(DefaultMavenPluginManager.java:142)
	at org.apache.maven.plugin.internal.DefaultMavenPluginManager.getMojoDescriptor(DefaultMavenPluginManager.java:261)
	at org.apache.maven.plugin.DefaultBuildPluginManager.getMojoDescriptor(DefaultBuildPluginManager.java:185)
	at org.apache.maven.lifecycle.internal.DefaultLifecycleExecutionPlanCalculator.calculateLifecycleMappings(DefaultLifecycleExecutionPlanCalculator.java:280)
	at org.apache.maven.lifecycle.internal.DefaultLifecycleExecutionPlanCalculator.calculateMojoExecutions(DefaultLifecycleExecutionPlanCalculator.java:193)
	at org.apache.maven.lifecycle.internal.DefaultLifecycleExecutionPlanCalculator.calculateExecutionPlan(DefaultLifecycleExecutionPlanCalculator.java:112)
	at org.apache.maven.lifecycle.internal.DefaultLifecycleExecutionPlanCalculator.calculateExecutionPlan(DefaultLifecycleExecutionPlanCalculator.java:129)
	at org.apache.maven.lifecycle.internal.BuilderCommon.resolveBuildPlan(BuilderCommon.java:92)
	at org.apache.maven.lifecycle.internal.LifecycleModuleBuilder.buildProject(LifecycleModuleBuilder.java:81)
	at org.apache.maven.lifecycle.internal.LifecycleModuleBuilder.buildProject(LifecycleModuleBuilder.java:59)
	at org.apache.maven.lifecycle.internal.LifecycleStarter.singleThreadedBuild(LifecycleStarter.java:183)
	at org.apache.maven.lifecycle.internal.LifecycleStarter.execute(LifecycleStarter.java:161)
	at org.apache.maven.DefaultMaven.doExecute(DefaultMaven.java:319)
	at org.apache.maven.DefaultMaven.execute(DefaultMaven.java:156)
	at org.apache.maven.cli.MavenCli.execute(MavenCli.java:537)
	at org.apache.maven.cli.MavenCli.doMain(MavenCli.java:196)
	at org.apache.maven.cli.MavenCli.main(MavenCli.java:141)
	at sun.reflect.NativeMethodAccessorImpl.invoke0(Native Method)
	at sun.reflect.NativeMethodAccessorImpl.invoke(NativeMethodAccessorImpl.java:39)
	at sun.reflect.DelegatingMethodAccessorImpl.invoke(DelegatingMethodAccessorImpl.java:25)
	at java.lang.reflect.Method.invoke(Method.java:592)
	at org.codehaus.plexus.classworlds.launcher.Launcher.launchEnhanced(Launcher.java:290)
	at org.codehaus.plexus.classworlds.launcher.Launcher.launch(Launcher.java:230)
	at org.codehaus.plexus.classworlds.launcher.Launcher.mainWithExitCode(Launcher.java:409)
	at org.codehaus.plexus.classworlds.launcher.Launcher.main(Launcher.java:352)
Caused by: org.sonatype.aether.resolution.ArtifactDescriptorException: Failed to read artifact
descriptor for org.apache.maven.plugins:maven-remote-resources-plugin:jar:1.3-SNAPSHOT
	at org.apache.maven.repository.internal.DefaultArtifactDescriptorReader.loadPom(DefaultArtifactDescriptorReader.java:282)
	at org.apache.maven.repository.internal.DefaultArtifactDescriptorReader.readArtifactDescriptor(DefaultArtifactDescriptorReader.java:172)
	at org.sonatype.aether.impl.internal.DefaultRepositorySystem.readArtifactDescriptor(DefaultRepositorySystem.java:316)
	at org.apache.maven.plugin.internal.DefaultPluginDependenciesResolver.resolve(DefaultPluginDependenciesResolver.java:115)
	... 25 more
Caused by: org.sonatype.aether.resolution.ArtifactResolutionException: Could not find artifact
org.apache.maven.plugins:maven-remote-resources-plugin:pom:1.3-SNAPSHOT
	at org.sonatype.aether.impl.internal.DefaultArtifactResolver.resolve(DefaultArtifactResolver.java:541)
	at org.sonatype.aether.impl.internal.DefaultArtifactResolver.resolveArtifacts(DefaultArtifactResolver.java:220)
	at org.sonatype.aether.impl.internal.DefaultArtifactResolver.resolveArtifact(DefaultArtifactResolver.java:197)
	at org.apache.maven.repository.internal.DefaultArtifactDescriptorReader.loadPom(DefaultArtifactDescriptorReader.java:267)
	... 28 more
Caused by: org.sonatype.aether.transfer.ArtifactNotFoundException: Could not find artifact
org.apache.maven.plugins:maven-remote-resources-plugin:pom:1.3-SNAPSHOT
	at org.sonatype.aether.impl.internal.DefaultArtifactResolver.resolve(DefaultArtifactResolver.java:531)
	... 31 more
[ERROR] 
[ERROR] Re-run Maven using the -X switch to enable full debug logging.
[ERROR] 
[ERROR] For more information about the errors and possible solutions, please read the following
articles:
[ERROR] [Help 1] http://cwiki.apache.org/confluence/display/MAVEN/PluginResolutionException

  test(org.apache.maven.plugin.resources.remote.it.IT_GenerateFromBundle): Exit code was non-zero:
1; command line and log = 
/home/hudson/hudson-slave/tools/Maven_3.0.3/bin/mvn -e --batch-mode -Dmaven.repo.local=<https://builds.apache.org/job/maven-plugins-ITs-3.x/ws/.repository>
org.apache.maven.plugins:maven-clean-plugin:clean generate-resources
[INFO] Error stacktraces are turned on.
[INFO] Scanning for projects...
[INFO]                                                                         
[INFO] ------------------------------------------------------------------------
[INFO] Building generate-from-bundle 1.3-SNAPSHOT
[INFO] ------------------------------------------------------------------------
[WARNING] The POM for org.apache.maven.plugins:maven-remote-resources-plugin:jar:1.3-SNAPSHOT
is missing, no dependency information available
[INFO] ------------------------------------------------------------------------
[INFO] BUILD FAILURE
[INFO] ------------------------------------------------------------------------
[INFO] Total time: 0.207s
[INFO] Finished at: Fri Jul 29 17:02:42 UTC 2011
[INFO] Final Memory: 2M/154M
[INFO] ------------------------------------------------------------------------
[ERROR] Plugin org.apache.maven.plugins:maven-remote-resources-plugin:1.3-SNAPSHOT or one
of its dependencies could not be resolved: Failed to read artifact descriptor for org.apache.maven.plugins:maven-remote-resources-plugin:jar:1.3-SNAPSHOT:
Could not find artifact org.apache.maven.plugins:maven-remote-resources-plugin:pom:1.3-SNAPSHOT
-> [Help 1]
org.apache.maven.plugin.PluginResolutionException: Plugin org.apache.maven.plugins:maven-remote-resources-plugin:1.3-SNAPSHOT
or one of its dependencies could not be resolved: Failed to read artifact descriptor for org.apache.maven.plugins:maven-remote-resources-plugin:jar:1.3-SNAPSHOT
	at org.apache.maven.plugin.internal.DefaultPluginDependenciesResolver.resolve(DefaultPluginDependenciesResolver.java:129)
	at org.apache.maven.plugin.internal.DefaultMavenPluginManager.getPluginDescriptor(DefaultMavenPluginManager.java:142)
	at org.apache.maven.plugin.internal.DefaultMavenPluginManager.getMojoDescriptor(DefaultMavenPluginManager.java:261)
	at org.apache.maven.plugin.DefaultBuildPluginManager.getMojoDescriptor(DefaultBuildPluginManager.java:185)
	at org.apache.maven.lifecycle.internal.DefaultLifecycleExecutionPlanCalculator.calculateLifecycleMappings(DefaultLifecycleExecutionPlanCalculator.java:280)
	at org.apache.maven.lifecycle.internal.DefaultLifecycleExecutionPlanCalculator.calculateMojoExecutions(DefaultLifecycleExecutionPlanCalculator.java:193)
	at org.apache.maven.lifecycle.internal.DefaultLifecycleExecutionPlanCalculator.calculateExecutionPlan(DefaultLifecycleExecutionPlanCalculator.java:112)
	at org.apache.maven.lifecycle.internal.DefaultLifecycleExecutionPlanCalculator.calculateExecutionPlan(DefaultLifecycleExecutionPlanCalculator.java:129)
	at org.apache.maven.lifecycle.internal.BuilderCommon.resolveBuildPlan(BuilderCommon.java:92)
	at org.apache.maven.lifecycle.internal.LifecycleModuleBuilder.buildProject(LifecycleModuleBuilder.java:81)
	at org.apache.maven.lifecycle.internal.LifecycleModuleBuilder.buildProject(LifecycleModuleBuilder.java:59)
	at org.apache.maven.lifecycle.internal.LifecycleStarter.singleThreadedBuild(LifecycleStarter.java:183)
	at org.apache.maven.lifecycle.internal.LifecycleStarter.execute(LifecycleStarter.java:161)
	at org.apache.maven.DefaultMaven.doExecute(DefaultMaven.java:319)
	at org.apache.maven.DefaultMaven.execute(DefaultMaven.java:156)
	at org.apache.maven.cli.MavenCli.execute(MavenCli.java:537)
	at org.apache.maven.cli.MavenCli.doMain(MavenCli.java:196)
	at org.apache.maven.cli.MavenCli.main(MavenCli.java:141)
	at sun.reflect.NativeMethodAccessorImpl.invoke0(Native Method)
	at sun.reflect.NativeMethodAccessorImpl.invoke(NativeMethodAccessorImpl.java:39)
	at sun.reflect.DelegatingMethodAccessorImpl.invoke(DelegatingMethodAccessorImpl.java:25)
	at java.lang.reflect.Method.invoke(Method.java:592)
	at org.codehaus.plexus.classworlds.launcher.Launcher.launchEnhanced(Launcher.java:290)
	at org.codehaus.plexus.classworlds.launcher.Launcher.launch(Launcher.java:230)
	at org.codehaus.plexus.classworlds.launcher.Launcher.mainWithExitCode(Launcher.java:409)
	at org.codehaus.plexus.classworlds.launcher.Launcher.main(Launcher.java:352)
Caused by: org.sonatype.aether.resolution.ArtifactDescriptorException: Failed to read artifact
descriptor for org.apache.maven.plugins:maven-remote-resources-plugin:jar:1.3-SNAPSHOT
	at org.apache.maven.repository.internal.DefaultArtifactDescriptorReader.loadPom(DefaultArtifactDescriptorReader.java:282)
	at org.apache.maven.repository.internal.DefaultArtifactDescriptorReader.readArtifactDescriptor(DefaultArtifactDescriptorReader.java:172)
	at org.sonatype.aether.impl.internal.DefaultRepositorySystem.readArtifactDescriptor(DefaultRepositorySystem.java:316)
	at org.apache.maven.plugin.internal.DefaultPluginDependenciesResolver.resolve(DefaultPluginDependenciesResolver.java:115)
	... 25 more
Caused by: org.sonatype.aether.resolution.ArtifactResolutionException: Could not find artifact
org.apache.maven.plugins:maven-remote-resources-plugin:pom:1.3-SNAPSHOT
	at org.sonatype.aether.impl.internal.DefaultArtifactResolver.resolve(DefaultArtifactResolver.java:541)
	at org.sonatype.aether.impl.internal.DefaultArtifactResolver.resolveArtifacts(DefaultArtifactResolver.java:220)
	at org.sonatype.aether.impl.internal.DefaultArtifactResolver.resolveArtifact(DefaultArtifactResolver.java:197)
	at org.apache.maven.repository.internal.DefaultArtifactDescriptorReader.loadPom(DefaultArtifactDescriptorReader.java:267)
	... 28 more
Caused by: org.sonatype.aether.transfer.ArtifactNotFoundException: Could not find artifact
org.apache.maven.plugins:maven-remote-resources-plugin:pom:1.3-SNAPSHOT
	at org.sonatype.aether.impl.internal.DefaultArtifactResolver.resolve(DefaultArtifactResolver.java:531)
	... 31 more
[ERROR] 
[ERROR] Re-run Maven using the -X switch to enable full debug logging.
[ERROR] 
[ERROR] For more information about the errors and possible solutions, please read the following
articles:
[ERROR] [Help 1] http://cwiki.apache.org/confluence/display/MAVEN/PluginResolutionException


Tests run: 8, Failures: 0, Errors: 8, Skipped: 0

[INFO] ..SUCCESS (30.3 s)
[INFO] Building: site-jar/pom.xml
[INFO] ..SUCCESS (4.6 s)
[INFO] -------------------------------------------------
[INFO] Build Summary:
[INFO]   Passed: 35, Failed: 0, Errors: 0, Skipped: 1
[INFO] -------------------------------------------------
[INFO] 
[INFO] --- maven-install-plugin:2.3.1:install (default-install) @ maven-site-plugin ---
[INFO] Installing <https://builds.apache.org/job/maven-plugins-ITs-3.x/ws/maven-site-plugin/target/maven-site-plugin-3.0-SNAPSHOT.jar>
to <https://builds.apache.org/job/maven-plugins-ITs-3.x/ws/.repository/org/apache/maven/plugins/maven-site-plugin/3.0-SNAPSHOT/maven-site-plugin-3.0-SNAPSHOT.jar>
[INFO] Installing <https://builds.apache.org/job/maven-plugins-ITs-3.x/ws/maven-site-plugin/dependency-reduced-pom.xml>
to <https://builds.apache.org/job/maven-plugins-ITs-3.x/ws/.repository/org/apache/maven/plugins/maven-site-plugin/3.0-SNAPSHOT/maven-site-plugin-3.0-SNAPSHOT.pom>
[INFO] ------------------------------------------------------------------------
[INFO] Reactor Summary:
[INFO] 
[INFO] Maven Plugins ..................................... SUCCESS [10.140s]
[INFO] Maven ACR Plugin .................................. SUCCESS [59.974s]
[INFO] Maven Ant Plugin .................................. SUCCESS [2:41.076s]
[INFO] Maven AntRun Plugin ............................... SUCCESS [1:33.391s]
[INFO] Maven Eclipse Plugin .............................. SUCCESS [14:01.469s]
[INFO] Maven Assembly Plugin ............................. SUCCESS [16:37.339s]
[INFO] Maven Changelog Plugin ............................ SUCCESS [1:29.838s]
[INFO] Maven Changes Report Plugin ....................... SUCCESS [1:33.099s]
[INFO] Maven Checkstyle Plugin ........................... SUCCESS [1:32.741s]
[INFO] Maven Clean Plugin ................................ SUCCESS [22.278s]
[INFO] Maven Compiler Plugin ............................. SUCCESS [26.863s]
[INFO] Maven Dependency Plugin ........................... FAILURE [54.788s]
[INFO] Maven Deploy Plugin ............................... SUCCESS [1:58.501s]
[INFO] Maven DOAP Plugin ................................. SUCCESS [25.228s]
[INFO] Maven Documentation Checker Plugin ................ SUCCESS [7.309s]
[INFO] Maven EAR Plugin .................................. SUCCESS [4:00.684s]
[INFO] Maven EJB Plugin .................................. SUCCESS [35.157s]
[INFO] Maven GPG Plugin .................................. SUCCESS [57.385s]
[INFO] Maven Help Plugin ................................. SUCCESS [1:08.152s]
[INFO] Maven IDEA Plugin ................................. SUCCESS [8.534s]
[INFO] Maven Install Plugin .............................. SUCCESS [1:10.794s]
[INFO] Maven JAR Plugin .................................. SUCCESS [1:32.367s]
[INFO] Maven Jarsigner Plugin ............................ SUCCESS [43.616s]
[INFO] Maven Javadoc Plugin .............................. SUCCESS [8:51.518s]
[INFO] Maven Linkcheck Plugin ............................ SUCCESS [2.953s]
[INFO] Maven One Plugin .................................. SUCCESS [3.383s]
[INFO] Maven Patch Plugin ................................ SUCCESS [20.702s]
[INFO] Maven PDF Plugin .................................. SUCCESS [32.793s]
[INFO] Maven PMD Plugin .................................. SUCCESS [59.770s]
[INFO] Maven RAR Plugin .................................. SUCCESS [12.254s]
[INFO] Maven Reactor Plugin .............................. SUCCESS [2.911s]
[INFO] Maven Repository Plugin ........................... FAILURE [19.413s]
[INFO] Maven Resources Plugin ............................ SUCCESS [1:11.868s]
[INFO] Maven Shade Plugin ................................ SUCCESS [2:46.604s]
[INFO] Maven Site Plugin 3 ............................... SUCCESS [9:55.719s]
[INFO] Maven Source Plugin ............................... SUCCESS [36.780s]
[INFO] Maven Stage Plugin ................................ SUCCESS [2.074s]
[INFO] Maven Toolchains Plugin ........................... SUCCESS [1.497s]
[INFO] Maven Verifier Plugin ............................. SUCCESS [11.332s]
[INFO] Maven WAR Plugin .................................. SUCCESS [1:41.344s]
[INFO] Maven Invoker Plugin .............................. SUCCESS [5:13.857s]
[INFO] Maven Project Info Reports Plugin ................. SUCCESS [2:47.013s]
[INFO] Maven Remote Resources Plugin ..................... FAILURE [34.593s]
[INFO] Maven Plugins Aggregator .......................... SUCCESS [0.058s]
[INFO] ------------------------------------------------------------------------
[INFO] BUILD FAILURE
[INFO] ------------------------------------------------------------------------
[INFO] Total time: 30:55.033s (Wall Clock)
[INFO] Finished at: Fri Jul 29 17:03:00 UTC 2011
[INFO] Final Memory: 66M/1001M
[INFO] ------------------------------------------------------------------------
[WARNING] The requested profile "apache.snapshots" could not be activated because it does
not exist.
[ERROR] Failed to execute goal org.apache.maven.plugins:maven-surefire-plugin:2.9:test (default-test)
on project maven-dependency-plugin: There are test failures.
[ERROR] 
[ERROR] Please refer to <https://builds.apache.org/job/maven-plugins-ITs-3.x/ws/maven-dependency-plugin/target/surefire-reports>
for the individual test results.
[ERROR] -> [Help 1]
[ERROR] Failed to execute goal org.apache.maven.plugins:maven-surefire-plugin:2.7.2:test (integration-tests)
on project maven-repository-plugin: There are test failures.
[ERROR] 
[ERROR] Please refer to <https://builds.apache.org/job/maven-plugins-ITs-3.x/ws/maven-repository-plugin/target/surefire-reports>
for the individual test results.
[ERROR] -> [Help 1]
[ERROR] Failed to execute goal org.apache.maven.plugins:maven-surefire-plugin:2.7.2:test (integration-tests)
on project maven-remote-resources-plugin: There are test failures.
[ERROR] 
[ERROR] Please refer to <https://builds.apache.org/job/maven-plugins-ITs-3.x/ws/maven-remote-resources-plugin/target/surefire-reports>
for the individual test results.
[ERROR] -> [Help 1]
[ERROR] 
[ERROR] To see the full stack trace of the errors, re-run Maven with the -e switch.
[ERROR] Re-run Maven using the -X switch to enable full debug logging.
[ERROR] 
[ERROR] For more information about the errors and possible solutions, please read the following
articles:
[ERROR] [Help 1] http://cwiki.apache.org/confluence/display/MAVEN/MojoFailureException
[ERROR] 
[ERROR] After correcting the problems, you can resume the build with the command
[ERROR]   mvn <goals> -rf :maven-dependency-plugin


Mime
View raw message