maven-notifications mailing list archives

Site index · List index
Message view « Date » · « Thread »
Top « Date » · « Thread »
From Apache Jenkins Server <jenk...@builds.apache.org>
Subject Build failed in Jenkins: maven-plugins-ITs-3.x #149
Date Fri, 29 Jul 2011 23:41:58 GMT
See <https://builds.apache.org/job/maven-plugins-ITs-3.x/149/changes>

Changes:

[rfscholte] add verify goal for m-failsafe-p

[rfscholte] Replace m-surefire-p bound to integration-test phase with m-failsafe-p

------------------------------------------
[...truncated 3934 lines...]
[INFO] ..SUCCESS (2.8 s)
[INFO] Building: system/pom.xml
[INFO] Building jar: <https://builds.apache.org/job/maven-plugins-ITs-3.x/ws/maven-install-plugin/target/maven-install-plugin-2.4-SNAPSHOT.jar>
[INFO] 
[INFO] --- maven-plugin-plugin:2.7:addPluginArtifactMetadata (default-addPluginArtifactMetadata)
@ maven-install-plugin ---
[INFO] 
[INFO] --- maven-invoker-plugin:1.5:install (integration-test) @ maven-install-plugin ---
[INFO] Installing <https://builds.apache.org/job/maven-plugins-ITs-3.x/ws/maven-install-plugin/pom.xml>
to <https://builds.apache.org/job/maven-plugins-ITs-3.x/ws/maven-install-plugin/target/local-repo/org/apache/maven/plugins/maven-install-plugin/2.4-SNAPSHOT/maven-install-plugin-2.4-SNAPSHOT.pom>
[INFO] Installing <https://builds.apache.org/job/maven-plugins-ITs-3.x/ws/maven-install-plugin/target/maven-install-plugin-2.4-SNAPSHOT.jar>
to <https://builds.apache.org/job/maven-plugins-ITs-3.x/ws/maven-install-plugin/target/local-repo/org/apache/maven/plugins/maven-install-plugin/2.4-SNAPSHOT/maven-install-plugin-2.4-SNAPSHOT.jar>
[INFO] 
[INFO] --- maven-invoker-plugin:1.5:run (integration-test) @ maven-install-plugin ---
[INFO] Building: minstall-55/pom.xml
[INFO] ..SUCCESS (6.9 s)
[INFO] Building: dependency-sets/dependencySet-unpacked/pom.xml
[INFO] ..SUCCESS (2.4 s)
[INFO] Building: active-profiles/pom.xml
[INFO] ..SUCCESS (2.3 s)
[INFO] Building: pom-checksum/pom.xml
[INFO] ..SUCCESS (2.4 s)
[INFO] Building: describe-gav/pom.xml
[INFO] ..SUCCESS (2.5 s)
[INFO] Building: generate-pom-auto-1/pom.xml
[INFO] ..SUCCESS (2.4 s)
[INFO] Building: release-pom/pom.xml
[INFO] ..SUCCESS (3.6 s)
[INFO] Building: describe-prefix-and-invalid-mojo/pom.xml
[INFO] ..SUCCESS (6.9 s)
[INFO] Building: dependency-sets/depSet-enum-vs-wildcard/pom.xml
[INFO] ..SUCCESS (2.2 s)
[INFO] Building: attach-jar-checksum/pom.xml
[INFO] ..SUCCESS (2.7 s)
[INFO] -------------------------------------------------
[INFO] Build Summary:
[INFO]   Passed: 14, Failed: 0, Errors: 0, Skipped: 0
[INFO] -------------------------------------------------
[INFO] 
[INFO] --- maven-install-plugin:2.3.1:install (default-install) @ maven-help-plugin ---
[INFO] Installing <https://builds.apache.org/job/maven-plugins-ITs-3.x/ws/maven-help-plugin/target/maven-help-plugin-2.2-SNAPSHOT.jar>
to <https://builds.apache.org/job/maven-plugins-ITs-3.x/ws/.repository/org/apache/maven/plugins/maven-help-plugin/2.2-SNAPSHOT/maven-help-plugin-2.2-SNAPSHOT.jar>
[INFO] Installing <https://builds.apache.org/job/maven-plugins-ITs-3.x/ws/maven-help-plugin/pom.xml>
to <https://builds.apache.org/job/maven-plugins-ITs-3.x/ws/.repository/org/apache/maven/plugins/maven-help-plugin/2.2-SNAPSHOT/maven-help-plugin-2.2-SNAPSHOT.pom>
[INFO]                                                                         
[INFO] ------------------------------------------------------------------------
[INFO] Building Maven JAR Plugin 2.4-SNAPSHOT
[INFO] ------------------------------------------------------------------------
[WARNING] *****************************************************************
[WARNING] * Your build is requesting parallel execution, but project      *
[WARNING] * contains the following plugin(s) that are not marked as       *
[WARNING] * @threadSafe to support parallel building.                     *
[WARNING] * While this /may/ work fine, please look for plugin updates    *
[WARNING] * and/or request plugins be made thread-safe.                   *
[WARNING] * If reporting an issue, report it against the plugin in        *
[WARNING] * question, not against maven-core                              *
[WARNING] *****************************************************************
[WARNING] The following plugins are not marked @threadSafe in Maven JAR Plugin:
[WARNING] org.apache.maven.plugins:maven-invoker-plugin:1.4
[WARNING] org.apache.maven.plugins:maven-remote-resources-plugin:1.1
[WARNING] org.apache.maven.plugins:maven-enforcer-plugin:1.0
[WARNING] *****************************************************************
[INFO] 
[INFO] --- maven-clean-plugin:2.4.1:clean (default-clean) @ maven-jar-plugin ---
[INFO] Deleting <https://builds.apache.org/job/maven-plugins-ITs-3.x/ws/maven-jar-plugin/target>
[INFO] 
[INFO] --- maven-enforcer-plugin:1.0:enforce (ensure-no-container-api) @ maven-jar-plugin
---
[INFO] 
[INFO] --- maven-plugin-plugin:2.7:helpmojo (generated-helpmojo) @ maven-jar-plugin ---
[INFO] Using 'UTF-8' encoding to read mojo metadata.
[INFO] Applying mojo extractor for language: java
[INFO] Mojo extractor for language: java found 4 mojo descriptors.
[INFO] Applying mojo extractor for language: bsh
[INFO] Mojo extractor for language: bsh found 0 mojo descriptors.
[INFO] 
[INFO] --- maven-plugin-plugin:2.7:descriptor (default-descriptor) @ maven-jar-plugin ---
[INFO] Using 'UTF-8' encoding to read mojo metadata.
[INFO] Applying mojo extractor for language: java
[INFO] Mojo extractor for language: java found 5 mojo descriptors.
[INFO] Applying mojo extractor for language: bsh
[INFO] Mojo extractor for language: bsh found 0 mojo descriptors.
[INFO] 
[INFO] --- maven-remote-resources-plugin:1.1:process (default) @ maven-jar-plugin ---
[INFO] 
[INFO] --- maven-resources-plugin:2.4.3:resources (default-resources) @ maven-jar-plugin ---
[INFO] Using 'UTF-8' encoding to copy filtered resources.
[INFO] skip non existing resourceDirectory <https://builds.apache.org/job/maven-plugins-ITs-3.x/ws/maven-jar-plugin/src/main/resources>
[INFO] Copying 3 resources
[INFO] 
[INFO] --- maven-compiler-plugin:2.3.2:compile (default-compile) @ maven-jar-plugin ---
[INFO] Compiling 6 source files to <https://builds.apache.org/job/maven-plugins-ITs-3.x/ws/maven-jar-plugin/target/classes>
[INFO] 
[INFO] --- maven-resources-plugin:2.4.3:testResources (default-testResources) @ maven-jar-plugin
---
[INFO] Using 'UTF-8' encoding to copy filtered resources.
[INFO] Copying 4 resources
[INFO] Copying 3 resources
[INFO] 
[INFO] --- maven-compiler-plugin:2.3.2:testCompile (default-testCompile) @ maven-jar-plugin
---
[INFO] Compiling 4 source files to <https://builds.apache.org/job/maven-plugins-ITs-3.x/ws/maven-jar-plugin/target/test-classes>
[INFO] 
[INFO] --- maven-surefire-plugin:2.7.2:test (default-test) @ maven-jar-plugin ---
[INFO] Surefire report directory: <https://builds.apache.org/job/maven-plugins-ITs-3.x/ws/maven-jar-plugin/target/surefire-reports>

-------------------------------------------------------
 T E S T S
-------------------------------------------------------
Running org.apache.maven.plugin.jar.JarSignVerifyMojoTest
[debug] jarsigner executable=[/home/hudson/tools/java/jdk1.5.0_22-32/jre/../bin/jarsigner]
[debug] Executing: /bin/sh -c cd /tmp && /home/hudson/tools/java/jdk1.5.0_22-32/jre/../bin/jarsigner
-verify /tmp/signed/file-version.jar
[info] jar verified.
[debug] jarsigner executable=[/home/hudson/tools/java/jdk1.5.0_22-32/jre/../bin/jarsigner]
[debug] Executing: /bin/sh -c cd /tmp && /home/hudson/tools/java/jdk1.5.0_22-32/jre/../bin/jarsigner
-verify -verbose -certs /tmp/signed/file-version.jar
[info] jar verified.
[debug] jarsigner executable=[/home/hudson/tools/java/jdk1.5.0_22-32/jre/../bin/jarsigner]
[debug] Executing: /bin/sh -c cd /tmp && /home/hudson/tools/java/jdk1.5.0_22-32/jre/../bin/jarsigner
-verify /tmp/signed/file-version.jar
[debug] jarsigner executable=[/home/hudson/tools/java/jdk1.5.0_22-32/jre/../bin/jarsigner]
[debug] Executing: /bin/sh -c cd /tmp && /home/hudson/tools/java/jdk1.5.0_22-32/jre/../bin/jarsigner
-verify /tmp/signed/file-version.jar
[info] jar is unsigned.
[debug] jarsigner executable=[/home/hudson/tools/java/jdk1.5.0_22-32/jre/../bin/jarsigner]
[debug] Executing: /bin/sh -c cd /tmp && /home/hudson/tools/java/jdk1.5.0_22-32/jre/../bin/jarsigner
-verify /tmp/signed/file-version.jar
Tests run: 6, Failures: 0, Errors: 0, Skipped: 0, Time elapsed: 0.041 sec
Running org.apache.maven.plugin.jar.JarSignMojoTest
[debug] jarsigner executable=[/home/hudson/tools/java/jdk1.5.0_22-32/jre/../bin/jarsigner]
[debug] mdkirs: false /tmp
[debug] jarsigner executable=[/home/hudson/tools/java/jdk1.5.0_22-32/jre/../bin/jarsigner]
[debug] mdkirs: false /tmp
[debug] jarsigner executable=[/home/hudson/tools/java/jdk1.5.0_22-32/jre/../bin/jarsigner]
[debug] mdkirs: false /tmp
[debug] jarsigner executable=[/home/hudson/tools/java/jdk1.5.0_22-32/jre/../bin/jarsigner]
[debug] Executing: /bin/sh -c cd /tmp && /home/hudson/tools/java/jdk1.5.0_22-32/jre/../bin/jarsigner
-verify /tmp/signed.jar
[info] jar verified.
[debug] jarsigner executable=[/home/hudson/tools/java/jdk1.5.0_22-32/jre/../bin/jarsigner]
[debug] Signing JAR in-place (overwritting original JAR).
[debug] jarsigner executable=[/home/hudson/tools/java/jdk1.5.0_22-32/jre/../bin/jarsigner]
[debug] Executing: /bin/sh -c cd /tmp && /home/hudson/tools/java/jdk1.5.0_22-32/jre/../bin/jarsigner
-verify /tmp/null.jar
[info] jar verified.
[debug] jarsigner executable=[/home/hudson/tools/java/jdk1.5.0_22-32/jre/../bin/jarsigner]
[debug] mdkirs: false /tmp
[info] JAR /tmp/signed.jar is already signed. Skipping.
[debug] jarsigner executable=[/home/hudson/tools/java/jdk1.5.0_22-32/jre/../bin/jarsigner]
[debug] mdkirs: false /tmp
Tests run: 6, Failures: 0, Errors: 0, Skipped: 0, Time elapsed: 0.024 sec
Running org.apache.maven.plugin.jar.JarMojoTest
Tests run: 1, Failures: 0, Errors: 0, Skipped: 0, Time elapsed: 0.333 sec

Results :

Tests run: 13, Failures: 0, Errors: 0, Skipped: 0

[INFO] 
[INFO] --- maven-jar-plugin:2.3.1:jar (default-jar) @ maven-jar-plugin ---
[INFO] Building jar: <https://builds.apache.org/job/maven-plugins-ITs-3.x/ws/maven-jar-plugin/target/maven-jar-plugin-2.4-SNAPSHOT.jar>
[INFO] 
[INFO] --- maven-plugin-plugin:2.7:addPluginArtifactMetadata (default-addPluginArtifactMetadata)
@ maven-jar-plugin ---
[INFO] 
[INFO] --- maven-invoker-plugin:1.4:install (integration-test) @ maven-jar-plugin ---
[INFO] Installing <https://builds.apache.org/job/maven-plugins-ITs-3.x/ws/maven-jar-plugin/pom.xml>
to <https://builds.apache.org/job/maven-plugins-ITs-3.x/ws/maven-jar-plugin/target/local-repo/org/apache/maven/plugins/maven-jar-plugin/2.4-SNAPSHOT/maven-jar-plugin-2.4-SNAPSHOT.pom>
[INFO] Installing <https://builds.apache.org/job/maven-plugins-ITs-3.x/ws/maven-jar-plugin/target/maven-jar-plugin-2.4-SNAPSHOT.jar>
to <https://builds.apache.org/job/maven-plugins-ITs-3.x/ws/maven-jar-plugin/target/local-repo/org/apache/maven/plugins/maven-jar-plugin/2.4-SNAPSHOT/maven-jar-plugin-2.4-SNAPSHOT.jar>
[INFO] 
[INFO] --- maven-invoker-plugin:1.4:run (integration-test) @ maven-jar-plugin ---
[INFO] Building: MJAR-80-fullcontent/pom.xml
[INFO] ..SUCCESS (20.5 s)
[INFO] Building: generate-pom-auto-2/pom.xml
[INFO] ..SUCCESS (17.3 s)
[INFO] Building: MJAR-80-exclude/pom.xml
[INFO] ..SUCCESS (2.0 s)
[INFO] Building: no-main-artifact-1/pom.xml
[INFO] ..SUCCESS (3.8 s)
[INFO] Building: MJAR-30-excludes/pom.xml
[INFO] ..SUCCESS (3.5 s)
[INFO] Building: mjar-90/pom.xml
[INFO] ..SUCCESS (3.9 s)
[INFO] Building: MJAR-82/pom.xml
[INFO] ..SUCCESS (11.9 s)
[INFO] Building: attach-release-jar/pom.xml
Downloading: http://repository.apache.org/snapshots/org/apache/maven/shared/maven-model-converter/2.3-SNAPSHOT/maven-metadata.xml
Downloaded: http://repository.apache.org/snapshots/org/apache/maven/shared/maven-model-converter/2.3-SNAPSHOT/maven-metadata.xml
(791 B at 5.5 KB/sec)
Downloading: http://repository.apache.org/snapshots/org/apache/maven/shared/maven-model-converter/2.3-SNAPSHOT/maven-metadata.xml
Downloaded: http://repository.apache.org/snapshots/org/apache/maven/shared/maven-model-converter/2.3-SNAPSHOT/maven-metadata.xml
(791 B at 8.8 KB/sec)
Downloading: file://<https://builds.apache.org/job/maven-plugins-ITs-3.x/ws/.repository/org/codehaus/plexus/plexus-utils/1.4.1/plexus-utils-1.4.1.pom>
Downloaded: file://<https://builds.apache.org/job/maven-plugins-ITs-3.x/ws/.repository/org/codehaus/plexus/plexus-utils/1.4.1/plexus-utils-1.4.1.pom>
(2 KB at 932.1 KB/sec)
Downloading: file://<https://builds.apache.org/job/maven-plugins-ITs-3.x/ws/.repository/org/codehaus/plexus/plexus-utils/1.4.1/plexus-utils-1.4.1.jar>
Downloaded: file://<https://builds.apache.org/job/maven-plugins-ITs-3.x/ws/.repository/org/codehaus/plexus/plexus-utils/1.4.1/plexus-utils-1.4.1.jar>
(185 KB at 6823.2 KB/sec)
Downloading: file://<https://builds.apache.org/job/maven-plugins-ITs-3.x/ws/.repository/junit/junit/4.5/junit-4.5.pom>
Downloaded: file://<https://builds.apache.org/job/maven-plugins-ITs-3.x/ws/.repository/junit/junit/4.5/junit-4.5.pom>
(2 KB at 1192.4 KB/sec)
Downloading: file://<https://builds.apache.org/job/maven-plugins-ITs-3.x/ws/.repository/org/codehaus/plexus/plexus-utils/1.0.4/plexus-utils-1.0.4.pom>
Downloaded: file://<https://builds.apache.org/job/maven-plugins-ITs-3.x/ws/.repository/org/codehaus/plexus/plexus-utils/1.0.4/plexus-utils-1.0.4.pom>
(7 KB at 6695.3 KB/sec)
Downloading: file://<https://builds.apache.org/job/maven-plugins-ITs-3.x/ws/.repository/org/apache/maven/maven-artifact-manager/2.0.6/maven-artifact-manager-2.0.6.pom>
Downloaded: file://<https://builds.apache.org/job/maven-plugins-ITs-3.x/ws/.repository/org/apache/maven/maven-artifact-manager/2.0.6/maven-artifact-manager-2.0.6.pom>
(3 KB at 2560.5 KB/sec)
Downloading: file://<https://builds.apache.org/job/maven-plugins-ITs-3.x/ws/.repository/org/apache/maven/maven-repository-metadata/2.0.6/maven-repository-metadata-2.0.6.pom>
Downloaded: file://<https://builds.apache.org/job/maven-plugins-ITs-3.x/ws/.repository/org/apache/maven/maven-repository-metadata/2.0.6/maven-repository-metadata-2.0.6.pom>
(2 KB at 1806.6 KB/sec)
Downloading: file://<https://builds.apache.org/job/maven-plugins-ITs-3.x/ws/.repository/org/apache/maven/wagon/wagon-provider-api/1.0-beta-2/wagon-provider-api-1.0-beta-2.pom>
Downloaded: file://<https://builds.apache.org/job/maven-plugins-ITs-3.x/ws/.repository/org/apache/maven/wagon/wagon-provider-api/1.0-beta-2/wagon-provider-api-1.0-beta-2.pom>
(680 B at 664.1 KB/sec)
Downloading: file://<https://builds.apache.org/job/maven-plugins-ITs-3.x/ws/.repository/org/apache/maven/wagon/wagon/1.0-beta-2/wagon-1.0-beta-2.pom>
Downloaded: file://<https://builds.apache.org/job/maven-plugins-ITs-3.x/ws/.repository/org/apache/maven/wagon/wagon/1.0-beta-2/wagon-1.0-beta-2.pom>
(6 KB at 5744.1 KB/sec)
Downloading: file://<https://builds.apache.org/job/maven-plugins-ITs-3.x/ws/.repository/org/apache/maven/maven-parent/4/maven-parent-4.pom>
Downloaded: file://<https://builds.apache.org/job/maven-plugins-ITs-3.x/ws/.repository/org/apache/maven/maven-parent/4/maven-parent-4.pom>
(10 KB at 9761.7 KB/sec)
Downloading: file://<https://builds.apache.org/job/maven-plugins-ITs-3.x/ws/.repository/junit/junit/4.5/junit-4.5.jar>
Downloading: file://<https://builds.apache.org/job/maven-plugins-ITs-3.x/ws/.repository/org/apache/maven/maven-artifact-manager/2.0.6/maven-artifact-manager-2.0.6.jar>
Downloading: file://<https://builds.apache.org/job/maven-plugins-ITs-3.x/ws/.repository/org/apache/maven/maven-repository-metadata/2.0.6/maven-repository-metadata-2.0.6.jar>
Downloading: file://<https://builds.apache.org/job/maven-plugins-ITs-3.x/ws/.repository/org/apache/maven/wagon/wagon-provider-api/1.0-beta-2/wagon-provider-api-1.0-beta-2.jar>
Downloaded: file://<https://builds.apache.org/job/maven-plugins-ITs-3.x/ws/.repository/org/apache/maven/maven-repository-metadata/2.0.6/maven-repository-metadata-2.0.6.jar>
(24 KB at 7967.1 KB/sec)
Downloaded: file://<https://builds.apache.org/job/maven-plugins-ITs-3.x/ws/.repository/org/apache/maven/maven-artifact-manager/2.0.6/maven-artifact-manager-2.0.6.jar>
(56 KB at 13795.9 KB/sec)
Downloaded: file://<https://builds.apache.org/job/maven-plugins-ITs-3.x/ws/.repository/org/apache/maven/wagon/wagon-provider-api/1.0-beta-2/wagon-provider-api-1.0-beta-2.jar>
(46 KB at 15080.1 KB/sec)
Downloaded: file://<https://builds.apache.org/job/maven-plugins-ITs-3.x/ws/.repository/junit/junit/4.5/junit-4.5.jar>
(195 KB at 24285.3 KB/sec)
Downloading: file://<https://builds.apache.org/job/maven-plugins-ITs-3.x/ws/.repository/org/codehaus/plexus/plexus-container-default/1.0-alpha-15/plexus-container-default-1.0-alpha-15.pom>
Downloaded: file://<https://builds.apache.org/job/maven-plugins-ITs-3.x/ws/.repository/org/codehaus/plexus/plexus-container-default/1.0-alpha-15/plexus-container-default-1.0-alpha-15.pom>
(2 KB at 1668.0 KB/sec)
Downloading: file://<https://builds.apache.org/job/maven-plugins-ITs-3.x/ws/.repository/org/codehaus/plexus/plexus-containers/1.0-alpha-15/plexus-containers-1.0-alpha-15.pom>
Downloaded: file://<https://builds.apache.org/job/maven-plugins-ITs-3.x/ws/.repository/org/codehaus/plexus/plexus-containers/1.0-alpha-15/plexus-containers-1.0-alpha-15.pom>
(2 KB at 1846.7 KB/sec)
Downloading: file://<https://builds.apache.org/job/maven-plugins-ITs-3.x/ws/.repository/org/codehaus/plexus/plexus/1.0.9/plexus-1.0.9.pom>
Downloaded: file://<https://builds.apache.org/job/maven-plugins-ITs-3.x/ws/.repository/org/codehaus/plexus/plexus/1.0.9/plexus-1.0.9.pom>
(8 KB)
Downloading: file://<https://builds.apache.org/job/maven-plugins-ITs-3.x/ws/.repository/org/codehaus/plexus/plexus-utils/1.3/plexus-utils-1.3.pom>
Downloaded: file://<https://builds.apache.org/job/maven-plugins-ITs-3.x/ws/.repository/org/codehaus/plexus/plexus-utils/1.3/plexus-utils-1.3.pom>
(2 KB at 1009.8 KB/sec)
Downloading: file://<https://builds.apache.org/job/maven-plugins-ITs-3.x/ws/.repository/org/codehaus/plexus/plexus/1.0.8/plexus-1.0.8.pom>
Downloaded: file://<https://builds.apache.org/job/maven-plugins-ITs-3.x/ws/.repository/org/codehaus/plexus/plexus/1.0.8/plexus-1.0.8.pom>
(8 KB at 7060.5 KB/sec)
Downloading: file://<https://builds.apache.org/job/maven-plugins-ITs-3.x/ws/.repository/org/codehaus/plexus/plexus-classworlds/1.2-alpha-6/plexus-classworlds-1.2-alpha-6.pom>
Downloaded: file://<https://builds.apache.org/job/maven-plugins-ITs-3.x/ws/.repository/org/codehaus/plexus/plexus-classworlds/1.2-alpha-6/plexus-classworlds-1.2-alpha-6.pom>
(3 KB at 2316.4 KB/sec)
Downloading: file://<https://builds.apache.org/job/maven-plugins-ITs-3.x/ws/.repository/org/codehaus/plexus/plexus-utils/1.2/plexus-utils-1.2.pom>
Downloaded: file://<https://builds.apache.org/job/maven-plugins-ITs-3.x/ws/.repository/org/codehaus/plexus/plexus-utils/1.2/plexus-utils-1.2.pom>
(767 B at 749.0 KB/sec)
Downloading: file://<https://builds.apache.org/job/maven-plugins-ITs-3.x/ws/.repository/org/codehaus/plexus/plexus/1.0.5/plexus-1.0.5.pom>
Downloaded: file://<https://builds.apache.org/job/maven-plugins-ITs-3.x/ws/.repository/org/codehaus/plexus/plexus/1.0.5/plexus-1.0.5.pom>
(6 KB at 5802.7 KB/sec)
Downloading: file://<https://builds.apache.org/job/maven-plugins-ITs-3.x/ws/.repository/org/codehaus/plexus/plexus-container-default/1.0-alpha-15/plexus-container-default-1.0-alpha-15.jar>
Downloading: file://<https://builds.apache.org/job/maven-plugins-ITs-3.x/ws/.repository/org/codehaus/plexus/plexus-classworlds/1.2-alpha-6/plexus-classworlds-1.2-alpha-6.jar>
Downloading: http://repo1.maven.org/maven2/org/codehaus/plexus/plexus-classworlds/1.2-alpha-6/plexus-classworlds-1.2-alpha-6.jar
Downloading: http://repo1.maven.org/maven2/org/codehaus/plexus/plexus-container-default/1.0-alpha-15/plexus-container-default-1.0-alpha-15.jar
Downloaded: http://repo1.maven.org/maven2/org/codehaus/plexus/plexus-container-default/1.0-alpha-15/plexus-container-default-1.0-alpha-15.jar
(196 KB at 84.8 KB/sec)
Downloaded: http://repo1.maven.org/maven2/org/codehaus/plexus/plexus-classworlds/1.2-alpha-6/plexus-classworlds-1.2-alpha-6.jar
(42 KB at 16.7 KB/sec)
Downloading: file://<https://builds.apache.org/job/maven-plugins-ITs-3.x/ws/.repository/org/codehaus/plexus/plexus-utils/1.0.4/plexus-utils-1.0.4.jar>
Downloaded: file://<https://builds.apache.org/job/maven-plugins-ITs-3.x/ws/.repository/org/codehaus/plexus/plexus-utils/1.0.4/plexus-utils-1.0.4.jar>
(160 KB at 31992.8 KB/sec)
Downloading: file://<https://builds.apache.org/job/maven-plugins-ITs-3.x/ws/.repository/org/codehaus/plexus/plexus-utils/1.4/plexus-utils-1.4.pom>
Downloaded: file://<https://builds.apache.org/job/maven-plugins-ITs-3.x/ws/.repository/org/codehaus/plexus/plexus-utils/1.4/plexus-utils-1.4.pom>
(2 KB at 1124.0 KB/sec)
Downloading: file://<https://builds.apache.org/job/maven-plugins-ITs-3.x/ws/.repository/org/codehaus/plexus/plexus-utils/1.4/plexus-utils-1.4.jar>
Downloading: http://repo1.maven.org/maven2/org/codehaus/plexus/plexus-utils/1.4/plexus-utils-1.4.jar
Downloaded: http://repo1.maven.org/maven2/org/codehaus/plexus/plexus-utils/1.4/plexus-utils-1.4.jar
(178 KB at 79.3 KB/sec)
Downloading: http://repository.apache.org/snapshots/org/apache/maven/reporting/maven-reporting-exec/1.0.1-SNAPSHOT/maven-metadata.xml
Downloaded: http://repository.apache.org/snapshots/org/apache/maven/reporting/maven-reporting-exec/1.0.1-SNAPSHOT/maven-metadata.xml
(796 B at 6.5 KB/sec)
Downloading: http://repository.apache.org/snapshots/org/apache/maven/reporting/maven-reporting-exec/1.0.1-SNAPSHOT/maven-metadata.xml
Downloaded: http://repository.apache.org/snapshots/org/apache/maven/reporting/maven-reporting-exec/1.0.1-SNAPSHOT/maven-metadata.xml
(796 B at 2.4 KB/sec)
Running org.apache.maven.plugin.resources.remote.it.IT_RunOnlyAtExecutionRoot
Tests run: 1, Failures: 0, Errors: 1, Skipped: 0, Time elapsed: 10.541 sec <<< FAILURE!
Running org.apache.maven.plugin.resources.remote.it.IT_GenerateFromOverride
Tests run: 1, Failures: 0, Errors: 1, Skipped: 0, Time elapsed: 1.415 sec <<< FAILURE!
Running org.apache.maven.plugin.resources.remote.it.IT_GetDependencyProjects
Tests run: 1, Failures: 0, Errors: 1, Skipped: 0, Time elapsed: 5.01 sec <<< FAILURE!
Running org.apache.maven.plugin.resources.remote.it.IT_SupplementalArtifact
Tests run: 1, Failures: 0, Errors: 1, Skipped: 0, Time elapsed: 5.402 sec <<< FAILURE!
Running org.apache.maven.plugin.resources.remote.it.IT_CustomFilterDelimiter
Tests run: 1, Failures: 0, Errors: 1, Skipped: 0, Time elapsed: 1.422 sec <<< FAILURE!
Running org.apache.maven.plugin.resources.remote.it.IT_FilterLocalOverride
Tests run: 1, Failures: 0, Errors: 1, Skipped: 0, Time elapsed: 1.423 sec <<< FAILURE!
Running org.apache.maven.plugin.resources.remote.it.IT_BadDependencyPoms
Tests run: 1, Failures: 0, Errors: 1, Skipped: 0, Time elapsed: 1.42 sec <<< FAILURE!
Running org.apache.maven.plugin.resources.remote.it.IT_GenerateFromBundle
Tests run: 1, Failures: 0, Errors: 1, Skipped: 0, Time elapsed: 1.47 sec <<< FAILURE!


Mime
View raw message