maven-notifications mailing list archives

Site index · List index
Message view « Date » · « Thread »
Top « Date » · « Thread »
From Apache Jenkins Server <jenk...@builds.apache.org>
Subject Build failed in Jenkins: maven-plugins #362
Date Sun, 31 Jul 2011 23:10:10 GMT
See <https://builds.apache.org/job/maven-plugins/362/changes>

Changes:

[olamy] upgrade parent version

------------------------------------------
[...truncated 5613 lines...]
2011-07-31 23:09:51.999::INFO:  Started SocketConnector@minerva.apache.org:38079
2011-07-31 23:09:52.284::INFO:  jetty-6.1.19
2011-07-31 23:09:52.285::INFO:  Started SocketConnector@minerva.apache.org:54221
[ INFO] basic authentication scheme selected
[ INFO] No credentials available for BASIC 'Jetty Proxy Authorization'@minerva.apache.org:54221
2011-07-31 23:09:52.452::INFO:  jetty-6.1.19
2011-07-31 23:09:52.453::INFO:  Started SocketConnector@minerva.apache.org:60794
[ INFO] basic authentication scheme selected
[ INFO] basic authentication scheme selected
2011-07-31 23:09:52.751::INFO:  jetty-6.1.19
2011-07-31 23:09:52.751::INFO:  Started SocketConnector@minerva.apache.org:50087
[ INFO] basic authentication scheme selected
2011-07-31 23:09:55.857::WARN:  EXCEPTION on HttpExchange@14740287=GET//maven.apache.org:80/plugins/maven-javadoc-plugin/apidocs/package-list#6
org.mortbay.jetty.EofException
	at org.mortbay.jetty.HttpGenerator.flush(HttpGenerator.java:787)
	at org.mortbay.jetty.AbstractGenerator$Output.flush(AbstractGenerator.java:568)
	at org.mortbay.jetty.HttpConnection$Output.flush(HttpConnection.java:946)
	at org.mortbay.jetty.AbstractGenerator$Output.write(AbstractGenerator.java:652)
	at org.mortbay.jetty.AbstractGenerator$Output.write(AbstractGenerator.java:579)
	at org.mortbay.proxy.AsyncProxyServlet$1.onResponseContent(AsyncProxyServlet.java:183)
	at org.mortbay.jetty.client.HttpExchange$Listener.onResponseContent(HttpExchange.java:590)
	at org.mortbay.jetty.client.HttpConnection$Handler.content(HttpConnection.java:535)
	at org.mortbay.jetty.HttpParser.parseNext(HttpParser.java:747)
	at org.mortbay.jetty.HttpParser.parseAvailable(HttpParser.java:218)
	at org.mortbay.jetty.client.HttpConnection.handle(HttpConnection.java:269)
	at org.mortbay.io.nio.SelectChannelEndPoint.run(SelectChannelEndPoint.java:409)
	at org.mortbay.thread.QueuedThreadPool$PoolThread.run(QueuedThreadPool.java:520)
Caused by: java.net.SocketException: Broken pipe
	at java.net.SocketOutputStream.socketWrite0(Native Method)
	at java.net.SocketOutputStream.socketWrite(SocketOutputStream.java:92)
	at java.net.SocketOutputStream.write(SocketOutputStream.java:136)
	at org.mortbay.io.ByteArrayBuffer.writeTo(ByteArrayBuffer.java:368)
	at org.mortbay.io.bio.StreamEndPoint.flush(StreamEndPoint.java:122)
	at org.mortbay.io.bio.StreamEndPoint.flush(StreamEndPoint.java:154)
	at org.mortbay.jetty.HttpGenerator.flush(HttpGenerator.java:710)
	... 12 more
2011-07-31 23:09:56.760::WARN:  CONNECTION FAILED on HttpExchange@17769531=GET//maven.apache.org:80/plugins/maven-javadoc-plugin/apidocs/package-list#1
java.nio.channels.ClosedByInterruptException
	at java.nio.channels.spi.AbstractInterruptibleChannel.end(AbstractInterruptibleChannel.java:184)
	at sun.nio.ch.SocketChannelImpl.connect(SocketChannelImpl.java:476)
	at org.mortbay.jetty.client.SelectConnector.startConnection(SelectConnector.java:70)
	at org.mortbay.jetty.client.HttpDestination.startNewConnection(HttpDestination.java:243)
	at org.mortbay.jetty.client.HttpDestination.doSend(HttpDestination.java:474)
	at org.mortbay.jetty.client.HttpDestination.send(HttpDestination.java:420)
	at org.mortbay.jetty.client.HttpClient.send(HttpClient.java:142)
	at org.mortbay.proxy.AsyncProxyServlet.service(AsyncProxyServlet.java:266)
	at org.apache.maven.plugin.javadoc.ProxyServer$AuthAsyncProxyServlet.service(ProxyServer.java:228)
	at org.mortbay.jetty.servlet.ServletHolder.handle(ServletHolder.java:502)
	at org.mortbay.jetty.servlet.ServletHandler.handle(ServletHandler.java:389)
	at org.mortbay.jetty.handler.ContextHandler.handle(ContextHandler.java:765)
	at org.mortbay.jetty.handler.HandlerWrapper.handle(HandlerWrapper.java:152)
	at org.mortbay.jetty.Server.handle(Server.java:326)
	at org.mortbay.jetty.HttpConnection.handleRequest(HttpConnection.java:534)
	at org.mortbay.jetty.HttpConnection$RequestHandler.headerComplete(HttpConnection.java:864)
	at org.mortbay.jetty.HttpParser.parseNext(HttpParser.java:539)
	at org.mortbay.jetty.HttpParser.parseAvailable(HttpParser.java:212)
	at org.mortbay.jetty.HttpConnection.handle(HttpConnection.java:404)
	at org.mortbay.jetty.bio.SocketConnector$Connection.run(SocketConnector.java:228)
	at org.mortbay.thread.QueuedThreadPool$PoolThread.run(QueuedThreadPool.java:520)
2011-07-31 23:09:57.060::INFO:  jetty-6.1.19
2011-07-31 23:09:57.060::INFO:  Started SocketConnector@minerva.apache.org:35255
Tests run: 8, Failures: 0, Errors: 0, Skipped: 0, Time elapsed: 6.912 sec
Running org.apache.maven.plugin.javadoc.JavadocJarTest
[INFO] Building jar: <https://builds.apache.org/job/maven-plugins/ws/maven-javadoc-plugin/target/test/unit/javadocjar-default/target/javadocjar-default-javadoc.jar>
Tests run: 2, Failures: 0, Errors: 0, Skipped: 0, Time elapsed: 2.074 sec

Results :

Tests run: 53, Failures: 0, Errors: 0, Skipped: 0

[JENKINS] Recording test results
[INFO] 
[INFO] --- maven-jar-plugin:2.3.1:jar (default-jar) @ maven-javadoc-plugin ---
[INFO] Building jar: <https://builds.apache.org/job/maven-plugins/ws/maven-javadoc-plugin/target/maven-javadoc-plugin-2.8.1-SNAPSHOT.jar>
[INFO] 
[INFO] --- maven-plugin-plugin:2.7:addPluginArtifactMetadata (default-addPluginArtifactMetadata)
@ maven-javadoc-plugin ---
[INFO] 
[INFO] --- maven-shade-plugin:1.2.1:shade (default) @ maven-javadoc-plugin ---
[INFO] Excluding org.apache.maven:maven-core:jar:2.0.9 from the shaded jar.
[INFO] Excluding org.apache.maven.wagon:wagon-file:jar:1.0-beta-2 from the shaded jar.
[INFO] Excluding org.apache.maven:maven-plugin-parameter-documenter:jar:2.0.9 from the shaded
jar.
[INFO] Excluding org.apache.maven.wagon:wagon-webdav:jar:1.0-beta-2 from the shaded jar.
[INFO] Excluding slide:slide-webdavlib:jar:2.1 from the shaded jar.
[INFO] Excluding jdom:jdom:jar:1.0 from the shaded jar.
[INFO] Excluding de.zeigermann.xml:xml-im-exporter:jar:1.1 from the shaded jar.
[INFO] Excluding org.apache.maven.wagon:wagon-http-lightweight:jar:1.0-beta-2 from the shaded
jar.
[INFO] Excluding org.apache.maven.wagon:wagon-http-shared:jar:1.0-beta-2 from the shaded jar.
[INFO] Excluding jtidy:jtidy:jar:4aug2000r7-dev from the shaded jar.
[INFO] Excluding xml-apis:xml-apis:jar:1.0.b2 from the shaded jar.
[INFO] Excluding org.apache.maven:maven-profile:jar:2.0.9 from the shaded jar.
[INFO] Excluding org.apache.maven:maven-repository-metadata:jar:2.0.9 from the shaded jar.
[INFO] Excluding org.apache.maven:maven-error-diagnostics:jar:2.0.9 from the shaded jar.
[INFO] Excluding commons-cli:commons-cli:jar:1.0 from the shaded jar.
[INFO] Excluding org.apache.maven.wagon:wagon-ssh-external:jar:1.0-beta-2 from the shaded
jar.
[INFO] Excluding org.apache.maven.wagon:wagon-ssh-common:jar:1.0-beta-2 from the shaded jar.
[INFO] Excluding org.apache.maven:maven-plugin-descriptor:jar:2.0.9 from the shaded jar.
[INFO] Excluding org.codehaus.plexus:plexus-interactivity-api:jar:1.0-alpha-4 from the shaded
jar.
[INFO] Excluding org.apache.maven:maven-monitor:jar:2.0.9 from the shaded jar.
[INFO] Excluding org.apache.maven.wagon:wagon-ssh:jar:1.0-beta-2 from the shaded jar.
[INFO] Excluding com.jcraft:jsch:jar:0.1.27 from the shaded jar.
[INFO] Excluding classworlds:classworlds:jar:1.1 from the shaded jar.
[INFO] Excluding org.apache.maven:maven-project:jar:2.0.9 from the shaded jar.
[INFO] Excluding org.apache.maven:maven-plugin-registry:jar:2.0.9 from the shaded jar.
[INFO] Excluding org.apache.maven:maven-model:jar:2.0.9 from the shaded jar.
[INFO] Excluding org.apache.maven:maven-settings:jar:2.0.9 from the shaded jar.
[INFO] Excluding org.apache.maven:maven-plugin-api:jar:2.0.9 from the shaded jar.
[INFO] Excluding org.apache.maven:maven-artifact:jar:2.0.9 from the shaded jar.
[INFO] Excluding org.apache.maven:maven-artifact-manager:jar:2.0.9 from the shaded jar.
[INFO] Excluding org.apache.maven.reporting:maven-reporting-api:jar:3.0 from the shaded jar.
[INFO] Excluding org.apache.maven:maven-archiver:jar:2.3 from the shaded jar.
[INFO] Excluding org.apache.maven.shared:maven-invoker:jar:2.0.9 from the shaded jar.
[INFO] Excluding org.apache.maven.shared:maven-common-artifact-filters:jar:1.3 from the shaded
jar.
[INFO] Excluding org.apache.maven.doxia:doxia-sink-api:jar:1.0 from the shaded jar.
[INFO] Excluding org.apache.maven.doxia:doxia-site-renderer:jar:1.0 from the shaded jar.
[INFO] Excluding org.apache.maven.doxia:doxia-core:jar:1.0 from the shaded jar.
[INFO] Excluding org.codehaus.plexus:plexus-i18n:jar:1.0-beta-7 from the shaded jar.
[INFO] Excluding org.codehaus.plexus:plexus-velocity:jar:1.1.7 from the shaded jar.
[INFO] Excluding org.apache.velocity:velocity:jar:1.5 from the shaded jar.
[INFO] Excluding oro:oro:jar:2.0.8 from the shaded jar.
[INFO] Excluding org.apache.maven.doxia:doxia-decoration-model:jar:1.0 from the shaded jar.
[INFO] Excluding commons-collections:commons-collections:jar:3.2 from the shaded jar.
[INFO] Excluding org.apache.maven.doxia:doxia-module-apt:jar:1.0 from the shaded jar.
[INFO] Excluding org.apache.maven.doxia:doxia-module-fml:jar:1.0 from the shaded jar.
[INFO] Excluding org.apache.maven.doxia:doxia-module-xdoc:jar:1.0 from the shaded jar.
[INFO] Excluding org.apache.maven.doxia:doxia-module-xhtml:jar:1.0 from the shaded jar.
[INFO] Including org.apache.maven.wagon:wagon-provider-api:jar:1.0-beta-6 in the shaded jar.
[INFO] Excluding commons-lang:commons-lang:jar:2.4 from the shaded jar.
[INFO] Excluding commons-httpclient:commons-httpclient:jar:3.1 from the shaded jar.
[INFO] Excluding commons-codec:commons-codec:jar:1.2 from the shaded jar.
[INFO] Excluding commons-logging:commons-logging:jar:1.1.1 from the shaded jar.
[INFO] Excluding log4j:log4j:jar:1.2.14 from the shaded jar.
[INFO] Excluding com.thoughtworks.qdox:qdox:jar:1.12 from the shaded jar.
[INFO] Excluding org.codehaus.plexus:plexus-container-default:jar:1.0-alpha-9 from the shaded
jar.
[INFO] Excluding org.codehaus.plexus:plexus-archiver:jar:1.0-alpha-9 from the shaded jar.
[INFO] Excluding org.codehaus.plexus:plexus-io:jar:1.0-alpha-1 from the shaded jar.
[INFO] Excluding org.apache.maven:maven-toolchain:jar:1.0 from the shaded jar.
[INFO] Excluding org.codehaus.plexus:plexus-utils:jar:1.5.8 from the shaded jar.
[INFO] Excluding org.mockito:mockito-core:jar:1.8.5 from the shaded jar.
[INFO] Excluding org.hamcrest:hamcrest-core:jar:1.1 from the shaded jar.
[INFO] Excluding org.objenesis:objenesis:jar:1.0 from the shaded jar.
[INFO] Replacing original artifact with shaded artifact.
[INFO] Replacing <https://builds.apache.org/job/maven-plugins/ws/maven-javadoc-plugin/target/maven-javadoc-plugin-2.8.1-SNAPSHOT.jar>
with <https://builds.apache.org/job/maven-plugins/ws/maven-javadoc-plugin/target/maven-javadoc-plugin-2.8.1-SNAPSHOT-shaded.jar>
[INFO] Installing <https://builds.apache.org/job/maven-plugins/ws/maven-javadoc-plugin/target/maven-javadoc-plugin-2.8.1-SNAPSHOT.jar>
to /home/jenkins/.m2/repository/org/apache/maven/plugins/maven-javadoc-plugin/2.8.1-SNAPSHOT/maven-javadoc-plugin-2.8.1-SNAPSHOT.jar
[INFO] [INFO] Installing <https://builds.apache.org/job/maven-plugins/ws/maven-javadoc-plugin/pom.xml>
to /home/jenkins/.m2/repository/org/apache/maven/plugins/maven-javadoc-plugin/2.8.1-SNAPSHOT/maven-javadoc-plugin-2.8.1-SNAPSHOT.pom

[INFO] --- maven-install-plugin:2.3.1:install (default-install) @ maven-javadoc-plugin ---
projectSucceeded org.apache.maven.plugins:maven-javadoc-plugin:2.8.1-SNAPSHOT
[JENKINS] Archiving <https://builds.apache.org/job/maven-plugins/ws/maven-javadoc-plugin/pom.xml>
to /home/hudson/hudson/jobs/maven-plugins/modules/org.apache.maven.plugins$maven-javadoc-plugin/builds/2011-07-31_23-02-06/archive/org.apache.maven.plugins/maven-javadoc-plugin/2.8.1-SNAPSHOT/maven-javadoc-plugin-2.8.1-SNAPSHOT.pom
[JENKINS] Archiving <https://builds.apache.org/job/maven-plugins/ws/maven-javadoc-plugin/target/maven-javadoc-plugin-2.8.1-SNAPSHOT.jar>
to /home/hudson/hudson/jobs/maven-plugins/modules/org.apache.maven.plugins$maven-javadoc-plugin/builds/2011-07-31_23-02-06/archive/org.apache.maven.plugins/maven-javadoc-plugin/2.8.1-SNAPSHOT/maven-javadoc-plugin-2.8.1-SNAPSHOT.jar
sessionEnded
[INFO] ------------------------------------------------------------------------
[INFO] Reactor Summary:
[INFO] 
[INFO] Maven Plugins ..................................... SUCCESS [10.854s]
[INFO] Maven ACR Plugin .................................. SUCCESS [14.447s]
[INFO] Maven Ant Plugin .................................. SUCCESS [29.187s]
[INFO] Maven AntRun Plugin ............................... SUCCESS [3.474s]
[INFO] Maven Eclipse Plugin .............................. SUCCESS [31.102s]
[INFO] Maven Assembly Plugin ............................. SUCCESS [19.902s]
[INFO] Maven Changelog Plugin ............................ SUCCESS [12.019s]
[INFO] Maven Changes Report Plugin ....................... SUCCESS [16.056s]
[INFO] Maven Checkstyle Plugin ........................... SUCCESS [19.766s]
[INFO] Maven Clean Plugin ................................ SUCCESS [6.394s]
[INFO] Maven Compiler Plugin ............................. SUCCESS [14.651s]
[INFO] Maven Dependency Plugin ........................... SUCCESS [1:01.024s]
[INFO] Maven Deploy Plugin ............................... SUCCESS [7.609s]
[INFO] Maven DOAP Plugin ................................. SUCCESS [17.196s]
[INFO] Maven Documentation Checker Plugin ................ SUCCESS [5.175s]
[INFO] Maven EAR Plugin .................................. SUCCESS [8.923s]
[INFO] Maven EJB Plugin .................................. SUCCESS [12.023s]
[INFO] Maven GPG Plugin .................................. SUCCESS [5.504s]
[INFO] Maven Help Plugin ................................. SUCCESS [9.550s]
[INFO] Maven IDEA Plugin ................................. SUCCESS [11.788s]
[INFO] Maven Install Plugin .............................. SUCCESS [8.919s]
[INFO] Maven JAR Plugin .................................. SUCCESS [11.729s]
[INFO] Maven Jarsigner Plugin ............................ SUCCESS [12.037s]
[INFO] Maven Javadoc Plugin .............................. SUCCESS [5:35.192s]
[INFO] Maven Linkcheck Plugin ............................ SUCCESS [7.849s]
[INFO] Maven One Plugin .................................. SUCCESS [8.378s]
[INFO] Maven Patch Plugin ................................ SUCCESS [7.821s]
[INFO] Maven PDF Plugin .................................. SUCCESS [20.467s]
[INFO] Maven PMD Plugin .................................. SUCCESS [11.403s]
[INFO] Maven RAR Plugin .................................. SUCCESS [10.686s]
[INFO] Maven Reactor Plugin .............................. SUCCESS [6.912s]
[INFO] Maven Repository Plugin ........................... SUCCESS [10.971s]
[INFO] Maven Resources Plugin ............................ SUCCESS [8.101s]
[INFO] Maven Shade Plugin ................................ SUCCESS [16.039s]
[INFO] Maven Site Plugin 3 ............................... FAILURE [4.291s]
[INFO] Maven Source Plugin ............................... SUCCESS [8.505s]
[INFO] Maven Stage Plugin ................................ SUCCESS [10.177s]
[INFO] Maven Toolchains Plugin ........................... SUCCESS [6.637s]
[INFO] Maven Verifier Plugin ............................. SUCCESS [10.044s]
[INFO] Maven WAR Plugin .................................. SUCCESS [23.510s]
[INFO] Maven Invoker Plugin .............................. SUCCESS [10.257s]
[INFO] Maven Project Info Reports Plugin ................. SUCCESS [35.042s]
[INFO] Maven Remote Resources Plugin ..................... SUCCESS [10.788s]
[INFO] Maven Plugins Aggregator .......................... SUCCESS [3.650s]
[INFO] ------------------------------------------------------------------------
[INFO] BUILD FAILURE
[INFO] ------------------------------------------------------------------------
[INFO] Total time: 7:44.944s (Wall Clock)
[INFO] Finished at: Sun Jul 31 23:10:04 UTC 2011
[INFO] Final Memory: 59M/677M
[INFO] ------------------------------------------------------------------------
maven builder waiting
mavenExecutionResult exceptions not empty
message : Failed to execute goal on project maven-site-plugin: Could not resolve dependencies
for project org.apache.maven.plugins:maven-site-plugin:maven-plugin:3.1-SNAPSHOT: Could not
find artifact org.apache.maven.reporting:maven-reporting-exec:jar:1.0.1 in central (http://repo1.maven.org/maven2)
cause : Could not resolve dependencies for project org.apache.maven.plugins:maven-site-plugin:maven-plugin:3.1-SNAPSHOT:
Could not find artifact org.apache.maven.reporting:maven-reporting-exec:jar:1.0.1 in central
(http://repo1.maven.org/maven2)
Stack trace : 
org.apache.maven.lifecycle.LifecycleExecutionException: Failed to execute goal on project
maven-site-plugin: Could not resolve dependencies for project org.apache.maven.plugins:maven-site-plugin:maven-plugin:3.1-SNAPSHOT:
Could not find artifact org.apache.maven.reporting:maven-reporting-exec:jar:1.0.1 in central
(http://repo1.maven.org/maven2)
	at org.apache.maven.lifecycle.internal.LifecycleDependencyResolver.getDependencies(LifecycleDependencyResolver.java:196)
	at org.apache.maven.lifecycle.internal.LifecycleDependencyResolver.resolveProjectDependencies(LifecycleDependencyResolver.java:108)
	at org.apache.maven.lifecycle.internal.MojoExecutor.ensureDependenciesAreResolved(MojoExecutor.java:258)
	at org.apache.maven.lifecycle.internal.MojoExecutor.execute(MojoExecutor.java:201)
	at org.apache.maven.lifecycle.internal.MojoExecutor.execute(MojoExecutor.java:153)
	at org.apache.maven.lifecycle.internal.MojoExecutor.execute(MojoExecutor.java:145)
	at org.apache.maven.lifecycle.internal.LifecycleModuleBuilder.buildProject(LifecycleModuleBuilder.java:84)
	at org.apache.maven.lifecycle.internal.LifecycleThreadedBuilder$1.call(LifecycleThreadedBuilder.java:167)
	at org.apache.maven.lifecycle.internal.LifecycleThreadedBuilder$1.call(LifecycleThreadedBuilder.java:164)
	at java.util.concurrent.FutureTask$Sync.innerRun(FutureTask.java:269)
	at java.util.concurrent.FutureTask.run(FutureTask.java:123)
	at java.util.concurrent.ThreadPoolExecutor$Worker.runTask(ThreadPoolExecutor.java:651)
	at java.util.concurrent.ThreadPoolExecutor$Worker.run(ThreadPoolExecutor.java:676)
	at java.lang.Thread.run(Thread.java:595)
Caused by: org.apache.maven.project.DependencyResolutionException: Could not resolve dependencies
for project org.apache.maven.plugins:maven-site-plugin:maven-plugin:3.1-SNAPSHOT: Could not
find artifact org.apache.maven.reporting:maven-reporting-exec:jar:1.0.1 in central (http://repo1.maven.org/maven2)
	at org.apache.maven.project.DefaultProjectDependenciesResolver.resolve(DefaultProjectDependenciesResolver.java:170)
	at org.apache.maven.lifecycle.internal.LifecycleDependencyResolver.getDependencies(LifecycleDependencyResolver.java:171)
	... 13 more
Caused by: org.sonatype.aether.resolution.DependencyResolutionException: Could not find artifact
org.apache.maven.reporting:maven-reporting-exec:jar:1.0.1 in central (http://repo1.maven.org/maven2)
	at org.sonatype.aether.impl.internal.DefaultRepositorySystem.resolveDependencies(DefaultRepositorySystem.java:412)
	at org.apache.maven.project.DefaultProjectDependenciesResolver.resolve(DefaultProjectDependenciesResolver.java:164)
	... 14 more
Caused by: org.sonatype.aether.resolution.ArtifactResolutionException: Could not find artifact
org.apache.maven.reporting:maven-reporting-exec:jar:1.0.1 in central (http://repo1.maven.org/maven2)
	at org.sonatype.aether.impl.internal.DefaultArtifactResolver.resolve(DefaultArtifactResolver.java:541)
	at org.sonatype.aether.impl.internal.DefaultArtifactResolver.resolveArtifacts(DefaultArtifactResolver.java:220)
	at org.sonatype.aether.impl.internal.DefaultRepositorySystem.resolveDependencies(DefaultRepositorySystem.java:395)
	... 15 more
Caused by: org.sonatype.aether.transfer.ArtifactNotFoundException: Could not find artifact
org.apache.maven.reporting:maven-reporting-exec:jar:1.0.1 in central (http://repo1.maven.org/maven2)
	at org.sonatype.aether.connector.wagon.WagonRepositoryConnector$4.wrap(WagonRepositoryConnector.java:945)
	at org.sonatype.aether.connector.wagon.WagonRepositoryConnector$4.wrap(WagonRepositoryConnector.java:940)
	at org.sonatype.aether.connector.wagon.WagonRepositoryConnector$GetTask.flush(WagonRepositoryConnector.java:695)
	at org.sonatype.aether.connector.wagon.WagonRepositoryConnector$GetTask.flush(WagonRepositoryConnector.java:689)
	at org.sonatype.aether.connector.wagon.WagonRepositoryConnector.get(WagonRepositoryConnector.java:445)
	at org.sonatype.aether.impl.internal.DefaultArtifactResolver.resolve(DefaultArtifactResolver.java:460)
	... 17 more
Maven failed with error.
Sending e-mails to: notifications@maven.apache.org
Sending e-mails to: notifications@maven.apache.org
channel stopped


Mime
View raw message