maven-notifications mailing list archives

Site index · List index
Message view « Date » · « Thread »
Top « Date » · « Thread »
From Apache Jenkins Server <jenk...@builds.apache.org>
Subject Build failed in Jenkins: maven-plugins-ITs-2.x #261
Date Tue, 26 Jul 2011 00:22:25 GMT
See <https://builds.apache.org/job/maven-plugins-ITs-2.x/261/changes>

Changes:

[hboutemy] [MSITE-402] ensure order of reports like defined in POM (works with Maven 3 but
not with Maven 2.2 for the moment)

------------------------------------------
[...truncated 7169 lines...]
[INFO] Webapp assembled in [3 msecs]
[INFO] Exploding webapp
[INFO] Assembling webapp [maven-war-plugin-test] in [<https://builds.apache.org/job/maven-plugins-ITs-2.x/ws/maven-war-plugin/target/test-classes/unit/warexplodedmojo/test-dir/SimpleExplodedWar]>
[INFO] Processing war project
[INFO] Copying webapp webResources [<https://builds.apache.org/job/maven-plugins-ITs-2.x/ws/maven-war-plugin/target/test-classes/unit/warexplodedmojo/test-dir/resources]>
to [<https://builds.apache.org/job/maven-plugins-ITs-2.x/ws/maven-war-plugin/target/test-classes/unit/warexplodedmojo/test-dir/SimpleExplodedWar]>
[INFO] Copying webapp resources [<https://builds.apache.org/job/maven-plugins-ITs-2.x/ws/maven-war-plugin/target/test-classes/unit/warexplodedmojo/test-dir/SimpleExplodedWar-test-data/source]>
[INFO] Webapp assembled in [3 msecs]
[INFO] Exploding webapp
[INFO] Assembling webapp [maven-war-plugin-test] in [<https://builds.apache.org/job/maven-plugins-ITs-2.x/ws/maven-war-plugin/target/test-classes/unit/warexplodedmojo/test-dir/ExplodedWar_WithCustomWebXML]>
[INFO] Processing war project
[INFO] Copying webapp resources [<https://builds.apache.org/job/maven-plugins-ITs-2.x/ws/maven-war-plugin/target/test-classes/unit/warexplodedmojo/test-dir/ExplodedWar_WithCustomWebXML-test-data/source]>
[INFO] Webapp assembled in [2 msecs]
[INFO] Exploding webapp
[INFO] Assembling webapp [maven-war-plugin-test] in [<https://builds.apache.org/job/maven-plugins-ITs-2.x/ws/maven-war-plugin/target/test-classes/unit/warexplodedmojo/test-dir/ExplodedWar_WithContainerConfigXML]>
[INFO] Processing war project
[INFO] Copying webapp resources [<https://builds.apache.org/job/maven-plugins-ITs-2.x/ws/maven-war-plugin/target/test-classes/unit/warexplodedmojo/test-dir/ExplodedWar_WithContainerConfigXML-test-data/source]>
[INFO] Webapp assembled in [2 msecs]
[INFO] Exploding webapp
[INFO] Assembling webapp [maven-war-plugin-test] in [<https://builds.apache.org/job/maven-plugins-ITs-2.x/ws/maven-war-plugin/target/test-classes/unit/warexplodedmojo/test-dir/ExplodedWar_WithSimpleExternalWARFile]>
[INFO] Processing war project
[INFO] Copying webapp resources [<https://builds.apache.org/job/maven-plugins-ITs-2.x/ws/maven-war-plugin/target/test-classes/unit/warexplodedmojo/test-dir/ExplodedWar_WithSimpleExternalWARFile-test-data/source]>
[INFO] Processing overlay [ id wartests:simple]
[INFO] Webapp assembled in [7 msecs]
[INFO] Exploding webapp
[INFO] Assembling webapp [maven-war-plugin-test] in [<https://builds.apache.org/job/maven-plugins-ITs-2.x/ws/maven-war-plugin/target/test-classes/unit/warexplodedmojo/test-dir/testExplodedWarMergeWarLocalFileOverride]>
[INFO] Processing war project
[INFO] Copying webapp resources [<https://builds.apache.org/job/maven-plugins-ITs-2.x/ws/maven-war-plugin/target/test-classes/unit/warexplodedmojo/test-dir/testExplodedWarMergeWarLocalFileOverride-test-data/source]>
[INFO] Processing overlay [ id wartests:simple]
[INFO] Webapp assembled in [6 msecs]
[INFO] Exploding webapp
[INFO] Assembling webapp [maven-war-plugin-test] in [<https://builds.apache.org/job/maven-plugins-ITs-2.x/ws/maven-war-plugin/target/test-classes/unit/warexplodedmojo/test-dir/testExplodedWarMergeWarLocalFileOverride]>
[INFO] Processing war project
[INFO] Copying webapp resources [<https://builds.apache.org/job/maven-plugins-ITs-2.x/ws/maven-war-plugin/target/test-classes/unit/warexplodedmojo/test-dir/testExplodedWarMergeWarLocalFileOverride-test-data/source]>
[INFO] Processing overlay [ id wartests:simple]
[INFO] Webapp assembled in [2 msecs]
[INFO] Exploding webapp
[INFO] Assembling webapp [maven-war-plugin-test] in [<https://builds.apache.org/job/maven-plugins-ITs-2.x/ws/maven-war-plugin/target/test-classes/unit/warexplodedmojo/test-dir/ExplodedWar_WithEJB]>
[INFO] Processing war project
[INFO] Copying webapp resources [<https://builds.apache.org/job/maven-plugins-ITs-2.x/ws/maven-war-plugin/target/test-classes/unit/warexplodedmojo/test-dir/ExplodedWar_WithEJB-test-data/source]>
[INFO] Webapp assembled in [4 msecs]
[INFO] Exploding webapp
[INFO] Assembling webapp [maven-war-plugin-test] in [<https://builds.apache.org/job/maven-plugins-ITs-2.x/ws/maven-war-plugin/target/test-classes/unit/warexplodedmojo/test-dir/ExplodedWarWithJar]>
[INFO] Processing war project
[INFO] Copying webapp resources [<https://builds.apache.org/job/maven-plugins-ITs-2.x/ws/maven-war-plugin/target/test-classes/unit/warexplodedmojo/test-dir/ExplodedWarWithJar-test-data/source]>
[INFO] Webapp assembled in [5 msecs]
[INFO] Exploding webapp
[INFO] Assembling webapp [maven-war-plugin-test] in [<https://builds.apache.org/job/maven-plugins-ITs-2.x/ws/maven-war-plugin/target/test-classes/unit/warexplodedmojo/test-dir/ExplodedWar_WithEJB]>
[INFO] Processing war project
[INFO] Copying webapp resources [<https://builds.apache.org/job/maven-plugins-ITs-2.x/ws/maven-war-plugin/target/test-classes/unit/warexplodedmojo/test-dir/ExplodedWar_WithEJB-test-data/source]>
[INFO] Webapp assembled in [3 msecs]
[INFO] Exploding webapp
[INFO] Assembling webapp [maven-war-plugin-test] in [<https://builds.apache.org/job/maven-plugins-ITs-2.x/ws/maven-war-plugin/target/test-classes/unit/warexplodedmojo/test-dir/ExplodedWar_WithTLD]>
[INFO] Processing war project
[INFO] Copying webapp resources [<https://builds.apache.org/job/maven-plugins-ITs-2.x/ws/maven-war-plugin/target/test-classes/unit/warexplodedmojo/test-dir/ExplodedWar_WithTLD-test-data/source]>
[INFO] Webapp assembled in [3 msecs]
[INFO] Exploding webapp
[INFO] Assembling webapp [maven-war-plugin-test] in [<https://builds.apache.org/job/maven-plugins-ITs-2.x/ws/maven-war-plugin/target/test-classes/unit/warexplodedmojo/test-dir/ExplodedWar_WithPAR]>
[INFO] Processing war project
[INFO] Copying webapp resources [<https://builds.apache.org/job/maven-plugins-ITs-2.x/ws/maven-war-plugin/target/test-classes/unit/warexplodedmojo/test-dir/ExplodedWar_WithPAR-test-data/source]>
[INFO] Webapp assembled in [3 msecs]
[INFO] Exploding webapp
[INFO] Assembling webapp [maven-war-plugin-test] in [<https://builds.apache.org/job/maven-plugins-ITs-2.x/ws/maven-war-plugin/target/test-classes/unit/warexplodedmojo/test-dir/ExplodedWarWithAar]>
[INFO] Processing war project
[INFO] Copying webapp resources [<https://builds.apache.org/job/maven-plugins-ITs-2.x/ws/maven-war-plugin/target/test-classes/unit/warexplodedmojo/test-dir/ExplodedWarWithAar-test-data/source]>
[INFO] Webapp assembled in [3 msecs]
[INFO] Exploding webapp
[INFO] Assembling webapp [maven-war-plugin-test] in [<https://builds.apache.org/job/maven-plugins-ITs-2.x/ws/maven-war-plugin/target/test-classes/unit/warexplodedmojo/test-dir/ExplodedWarWithMar]>
[INFO] Processing war project
[INFO] Copying webapp resources [<https://builds.apache.org/job/maven-plugins-ITs-2.x/ws/maven-war-plugin/target/test-classes/unit/warexplodedmojo/test-dir/ExplodedWarWithMar-test-data/source]>
[INFO] Webapp assembled in [3 msecs]
[INFO] Exploding webapp
[INFO] Assembling webapp [maven-war-plugin-test] in [<https://builds.apache.org/job/maven-plugins-ITs-2.x/ws/maven-war-plugin/target/test-classes/unit/warexplodedmojo/test-dir/ExplodedWar_WithDuplicateDependencies]>
[INFO] Processing war project
[INFO] Copying webapp resources [<https://builds.apache.org/job/maven-plugins-ITs-2.x/ws/maven-war-plugin/target/test-classes/unit/warexplodedmojo/test-dir/ExplodedWar_WithDuplicateDependencies-test-data/source]>
[INFO] Webapp assembled in [3 msecs]
[INFO] Exploding webapp
[INFO] Assembling webapp [maven-war-plugin-test] in [<https://builds.apache.org/job/maven-plugins-ITs-2.x/ws/maven-war-plugin/target/test-classes/unit/warexplodedmojo/test-dir/ExplodedWar_DuplicateWithClassifier]>
[INFO] Processing war project
[INFO] Copying webapp resources [<https://builds.apache.org/job/maven-plugins-ITs-2.x/ws/maven-war-plugin/target/test-classes/unit/warexplodedmojo/test-dir/ExplodedWar_DuplicateWithClassifier-test-data/source]>
[INFO] Webapp assembled in [4 msecs]
[INFO] Exploding webapp
[INFO] Assembling webapp [maven-war-plugin-test] in [<https://builds.apache.org/job/maven-plugins-ITs-2.x/ws/maven-war-plugin/target/test-classes/unit/warexplodedmojo/test-dir/ExplodedWar_WithClasses]>
[INFO] Processing war project
[INFO] Copying webapp resources [<https://builds.apache.org/job/maven-plugins-ITs-2.x/ws/maven-war-plugin/target/test-classes/unit/warexplodedmojo/test-dir/ExplodedWar_WithClasses-test-data/source]>
[INFO] Webapp assembled in [2 msecs]
[INFO] Exploding webapp
[INFO] Assembling webapp [maven-war-plugin-test] in [<https://builds.apache.org/job/maven-plugins-ITs-2.x/ws/maven-war-plugin/target/test-classes/unit/warexplodedmojo/test-dir/ExplodedWar_WithSourceIncludeExclude]>
[INFO] Processing war project
[INFO] Copying webapp resources [<https://builds.apache.org/job/maven-plugins-ITs-2.x/ws/maven-war-plugin/target/test-classes/unit/warexplodedmojo/test-dir/ExplodedWar_WithSourceIncludeExclude-test-data/source]>
[INFO] Webapp assembled in [1 msecs]
[INFO] Exploding webapp
[INFO] Assembling webapp [maven-war-plugin-test] in [<https://builds.apache.org/job/maven-plugins-ITs-2.x/ws/maven-war-plugin/target/test-classes/unit/warexplodedmojo/test-dir/ExplodedWar_WithWarDependencyIncludeExclude]>
[INFO] Processing war project
[INFO] Copying webapp resources [<https://builds.apache.org/job/maven-plugins-ITs-2.x/ws/maven-war-plugin/target/test-classes/unit/warexplodedmojo/test-dir/ExplodedWar_WithWarDependencyIncludeExclude-test-data/source]>
[INFO] Processing overlay [ id wartests:war-include-exclude]
[INFO] Webapp assembled in [7 msecs]
[INFO] Exploding webapp
[INFO] Assembling webapp [maven-war-plugin-test] in [<https://builds.apache.org/job/maven-plugins-ITs-2.x/ws/maven-war-plugin/target/test-classes/unit/warexplodedmojo/test-dir/ExplodedWarWithSourceModificationCheck]>
[INFO] Processing war project
[INFO] Copying webapp resources [<https://builds.apache.org/job/maven-plugins-ITs-2.x/ws/maven-war-plugin/target/test-classes/unit/warexplodedmojo/test-dir/ExplodedWarWithSourceModificationCheck-test-data/source]>
[INFO] Webapp assembled in [2 msecs]
[INFO] Exploding webapp
[INFO] Assembling webapp [maven-war-plugin-test] in [<https://builds.apache.org/job/maven-plugins-ITs-2.x/ws/maven-war-plugin/target/test-classes/unit/warexplodedmojo/test-dir/ExplodedWarWithFileNameMapping]>
[INFO] Processing war project
[INFO] Copying webapp resources [<https://builds.apache.org/job/maven-plugins-ITs-2.x/ws/maven-war-plugin/target/test-classes/unit/warexplodedmojo/test-dir/ExplodedWarWithFileNameMapping-test-data/source]>
[INFO] Webapp assembled in [3 msecs]
[INFO] Exploding webapp
[INFO] Assembling webapp [maven-war-plugin-test] in [<https://builds.apache.org/job/maven-plugins-ITs-2.x/ws/maven-war-plugin/target/test-classes/unit/warexplodedmojo/test-dir/ExplodedWarWithFileNameMappingAndDuplicateDependencies]>
[INFO] Processing war project
[INFO] Copying webapp resources [<https://builds.apache.org/job/maven-plugins-ITs-2.x/ws/maven-war-plugin/target/test-classes/unit/warexplodedmojo/test-dir/ExplodedWarWithFileNameMappingAndDuplicateDependencies-test-data/source]>
[INFO] Webapp assembled in [3 msecs]
Tests run: 21, Failures: 0, Errors: 0, Skipped: 0, Time elapsed: 0.882 sec
Running org.apache.maven.plugin.war.WarInPlaceMojoTest
[INFO] Generating webapp in source directory [<https://builds.apache.org/job/maven-plugins-ITs-2.x/ws/maven-war-plugin/target/test-classes/unit/warexplodedinplacemojo/test-dir/SimpleExplodedInplaceWar-test-data/source]>
[INFO] Assembling webapp [maven-war-plugin-test] in [<https://builds.apache.org/job/maven-plugins-ITs-2.x/ws/maven-war-plugin/target/test-classes/unit/warexplodedinplacemojo/test-dir/SimpleExplodedInplaceWar-test-data/source]>
[INFO] Processing war project
[INFO] Copying webapp webResources [<https://builds.apache.org/job/maven-plugins-ITs-2.x/ws/maven-war-plugin/target/test-classes/unit/warexplodedinplacemojo/test-dir/resources]>
to [<https://builds.apache.org/job/maven-plugins-ITs-2.x/ws/maven-war-plugin/target/test-classes/unit/warexplodedinplacemojo/test-dir/SimpleExplodedInplaceWar-test-data/source]>
[INFO] Webapp assembled in [3 msecs]
Tests run: 2, Failures: 0, Errors: 0, Skipped: 0, Time elapsed: 0.072 sec

Results :

Tests run: 83, Failures: 0, Errors: 0, Skipped: 0

[INFO] [jar:jar {execution: default-jar}]
[INFO] Building jar: <https://builds.apache.org/job/maven-plugins-ITs-2.x/ws/maven-war-plugin/target/maven-war-plugin-2.2-SNAPSHOT.jar>
[INFO] [plugin:addPluginArtifactMetadata {execution: default-addPluginArtifactMetadata}]
[INFO] [invoker:install {execution: integration-test}]
[INFO] Installing <https://builds.apache.org/job/maven-plugins-ITs-2.x/ws/maven-war-plugin/pom.xml>
to <https://builds.apache.org/job/maven-plugins-ITs-2.x/ws/maven-war-plugin/target/local-repo/org/apache/maven/plugins/maven-war-plugin/2.2-SNAPSHOT/maven-war-plugin-2.2-SNAPSHOT.pom>
[INFO] Installing <https://builds.apache.org/job/maven-plugins-ITs-2.x/ws/maven-war-plugin/target/maven-war-plugin-2.2-SNAPSHOT.jar>
to <https://builds.apache.org/job/maven-plugins-ITs-2.x/ws/maven-war-plugin/target/local-repo/org/apache/maven/plugins/maven-war-plugin/2.2-SNAPSHOT/maven-war-plugin-2.2-SNAPSHOT.jar>
[INFO] [invoker:run {execution: integration-test}]
[INFO] Building: simple-war-project/pom.xml
[INFO] ..SUCCESS (3.1 s)
[INFO] Building: MWAR-143/pom.xml
[INFO] ..SUCCESS (7.7 s)
[INFO] Building: MWAR-139/pom.xml
[INFO] ..SUCCESS (2.8 s)
[INFO] Building: MWAR-133/pom.xml
[INFO] ..SUCCESS (2.3 s)
[INFO] Building: scoped-dependency-same-artifact/pom.xml
[INFO] ..SUCCESS (3.5 s)
[INFO] Building: simple-war-no-webxml/pom.xml
[INFO] ..SUCCESS (2.9 s)
[INFO] Building: MWAR-62/pom.xml
[INFO] ..SUCCESS (2.2 s)
[INFO] Building: web-resources-filtering/pom.xml
[INFO] ..SUCCESS (3.7 s)
[INFO] Building: MWAR-96/pom.xml
[INFO] ..SUCCESS (2.8 s)
[INFO] Building: MWAR-131/pom.xml
[INFO] ..SUCCESS (8.7 s)
[INFO] Building: default/pom.xml
[INFO] ..SUCCESS (3.6 s)
[INFO] Building: MWAR-129/pom.xml
[INFO] ..SUCCESS (2.3 s)
[INFO] ---------------------------------------
[INFO] Execution Summary:
[INFO]   Builds Passing: 12
[INFO]   Builds Failing: 0
[INFO]   Builds Skipped: 0
[INFO] ---------------------------------------
[INFO] [install:install {execution: default-install}]
[INFO] Installing <https://builds.apache.org/job/maven-plugins-ITs-2.x/ws/maven-war-plugin/target/maven-war-plugin-2.2-SNAPSHOT.jar>
to /home/jenkins/.m2/repository/org/apache/maven/plugins/maven-war-plugin/2.2-SNAPSHOT/maven-war-plugin-2.2-SNAPSHOT.jar
[INFO] ------------------------------------------------------------------------
[INFO] Building Maven Plugins Aggregator
[INFO]    task-segment: [clean, install]
[INFO] ------------------------------------------------------------------------
[INFO] [clean:clean {execution: default-clean}]
[INFO] Deleting <https://builds.apache.org/job/maven-plugins-ITs-2.x/ws/target>
[INFO] [remote-resources:process {execution: default}]
[INFO] [site:attach-descriptor {execution: default-attach-descriptor}]
[INFO] [install:install {execution: default-install}]
[INFO] Installing <https://builds.apache.org/job/maven-plugins-ITs-2.x/ws/pom.xml> to
/home/jenkins/.m2/repository/org/apache/maven/plugins/maven-plugins-aggregator/1-SNAPSHOT/maven-plugins-aggregator-1-SNAPSHOT.pom
[INFO] 
[INFO] 
[INFO] ------------------------------------------------------------------------
[INFO] Reactor Summary:
[INFO] ------------------------------------------------------------------------
[INFO] Maven Plugins ......................................... SUCCESS [5.066s]
[INFO] Maven ACR Plugin ...................................... SUCCESS [22.403s]
[INFO] Maven Ant Plugin ...................................... SUCCESS [1:18.716s]
[INFO] Maven AntRun Plugin ................................... SUCCESS [46.450s]
[INFO] Maven Eclipse Plugin .................................. SUCCESS [8:36.828s]
[INFO] Maven Assembly Plugin ................................. FAILED [12:28.385s]
[INFO] Maven Changelog Plugin ................................ SUCCESS [21.169s]
[INFO] Maven Compiler Plugin ................................. SUCCESS [19.013s]
[INFO] Maven Changes Report Plugin ........................... FAILED [27.578s]
[INFO] Maven Checkstyle Plugin ............................... SUCCESS [1:24.488s]
[INFO] Maven Clean Plugin .................................... SUCCESS [12.990s]
[INFO] Maven Dependency Plugin ............................... SUCCESS [2:14.306s]
[INFO] Maven Deploy Plugin ................................... SUCCESS [1:09.278s]
[INFO] Maven DOAP Plugin ..................................... SUCCESS [16.538s]
[INFO] Maven Documentation Checker Plugin .................... SUCCESS [10.576s]
[INFO] Maven EAR Plugin ...................................... SUCCESS [3:09.233s]
[INFO] Maven EJB Plugin ...................................... SUCCESS [23.811s]
[INFO] Maven GPG Plugin ...................................... SUCCESS [23.208s]
[INFO] Maven Help Plugin ..................................... SUCCESS [29.770s]
[INFO] Maven IDEA Plugin ..................................... SUCCESS [6.691s]
[INFO] Maven Install Plugin .................................. SUCCESS [48.421s]
[INFO] Maven JAR Plugin ...................................... SUCCESS [1:07.791s]
[INFO] Maven Jarsigner Plugin ................................ SUCCESS [31.429s]
[INFO] Maven Shade Plugin .................................... SUCCESS [1:54.642s]
[INFO] Maven Javadoc Plugin .................................. FAILED [3:40.359s]
[INFO] Maven Linkcheck Plugin ................................ SUCCESS [1.487s]
[INFO] Maven One Plugin ...................................... SUCCESS [9.018s]
[INFO] Maven Patch Plugin .................................... FAILED [10.082s]
[INFO] Maven PDF Plugin ...................................... SUCCESS [45.081s]
[INFO] Maven PMD Plugin ...................................... SUCCESS [21.265s]
[INFO] Maven RAR Plugin ...................................... SUCCESS [6.239s]
[INFO] Maven Reactor Plugin .................................. SUCCESS [2.220s]
[INFO] Maven Repository Plugin ............................... SUCCESS [1:55.195s]
[INFO] Maven Resources Plugin ................................ SUCCESS [47.478s]
[INFO] Maven Site Plugin 3 ................................... SUCCESS [8:20.674s]
[INFO] Maven Source Plugin ................................... SUCCESS [28.985s]
[INFO] Maven Stage Plugin .................................... SUCCESS [1.716s]
[INFO] Maven Toolchains Plugin ............................... SUCCESS [1.252s]
[INFO] Maven Verifier Plugin ................................. SUCCESS [8.252s]
[INFO] Maven WAR Plugin ...................................... SUCCESS [57.780s]
[INFO] Maven Plugins Aggregator .............................. SUCCESS [1.049s]
[INFO] ------------------------------------------------------------------------
[INFO] Error for project: Maven Assembly Plugin (during install)
[INFO] ------------------------------------------------------------------------
[INFO] : org.apache.maven.plugin.invoker.InvokerSession@168e091
1 build failed.
[INFO] ------------------------------------------------------------------------
[INFO] Error for project: Maven Changes Report Plugin (during install)
[INFO] ------------------------------------------------------------------------
[INFO] : org.apache.maven.plugin.invoker.InvokerSession@1a15631
4 builds failed.
[INFO] ------------------------------------------------------------------------
[INFO] Error for project: Maven Javadoc Plugin (during install)
[INFO] ------------------------------------------------------------------------
[INFO] There are test failures.

Please refer to <https://builds.apache.org/job/maven-plugins-ITs-2.x/ws/maven-javadoc-plugin/target/surefire-reports>
for the individual test results.
[INFO] ------------------------------------------------------------------------
[INFO] Error for project: Maven Patch Plugin (during install)
[INFO] ------------------------------------------------------------------------
[INFO] : org.apache.maven.plugin.invoker.InvokerSession@36a277
4 builds failed.
[INFO] ------------------------------------------------------------------------
[INFO] For more information, run Maven with the -e switch
[INFO] ------------------------------------------------------------------------
[INFO] BUILD ERRORS
[INFO] ------------------------------------------------------------------------
[INFO] Total time: 57 minutes 8 seconds
[INFO] Finished at: Tue Jul 26 00:22:24 UTC 2011
[INFO] Final Memory: 85M/400M
[INFO] ------------------------------------------------------------------------


Mime
View raw message