maven-notifications mailing list archives

Site index · List index
Message view « Date » · « Thread »
Top « Date » · « Thread »
From Apache Jenkins Server <jenk...@builds.apache.org>
Subject Build failed in Jenkins: maven-plugins-ITs-2.x #262
Date Tue, 26 Jul 2011 09:35:32 GMT
See <https://builds.apache.org/job/maven-plugins-ITs-2.x/262/changes>

Changes:

[ltheussl] move detailed error message to logger and preserve stacktrace

------------------------------------------
[...truncated 7142 lines...]
[INFO] Webapp assembled in [3 msecs]
[INFO] Exploding webapp
[INFO] Assembling webapp [maven-war-plugin-test] in [<https://builds.apache.org/job/maven-plugins-ITs-2.x/ws/maven-war-plugin/target/test-classes/unit/warexplodedmojo/test-dir/SimpleExplodedWar]>
[INFO] Processing war project
[INFO] Copying webapp webResources [<https://builds.apache.org/job/maven-plugins-ITs-2.x/ws/maven-war-plugin/target/test-classes/unit/warexplodedmojo/test-dir/resources]>
to [<https://builds.apache.org/job/maven-plugins-ITs-2.x/ws/maven-war-plugin/target/test-classes/unit/warexplodedmojo/test-dir/SimpleExplodedWar]>
[INFO] Copying webapp resources [<https://builds.apache.org/job/maven-plugins-ITs-2.x/ws/maven-war-plugin/target/test-classes/unit/warexplodedmojo/test-dir/SimpleExplodedWar-test-data/source]>
[INFO] Webapp assembled in [3 msecs]
[INFO] Exploding webapp
[INFO] Assembling webapp [maven-war-plugin-test] in [<https://builds.apache.org/job/maven-plugins-ITs-2.x/ws/maven-war-plugin/target/test-classes/unit/warexplodedmojo/test-dir/ExplodedWar_WithCustomWebXML]>
[INFO] Processing war project
[INFO] Copying webapp resources [<https://builds.apache.org/job/maven-plugins-ITs-2.x/ws/maven-war-plugin/target/test-classes/unit/warexplodedmojo/test-dir/ExplodedWar_WithCustomWebXML-test-data/source]>
[INFO] Webapp assembled in [2 msecs]
[INFO] Exploding webapp
[INFO] Assembling webapp [maven-war-plugin-test] in [<https://builds.apache.org/job/maven-plugins-ITs-2.x/ws/maven-war-plugin/target/test-classes/unit/warexplodedmojo/test-dir/ExplodedWar_WithContainerConfigXML]>
[INFO] Processing war project
[INFO] Copying webapp resources [<https://builds.apache.org/job/maven-plugins-ITs-2.x/ws/maven-war-plugin/target/test-classes/unit/warexplodedmojo/test-dir/ExplodedWar_WithContainerConfigXML-test-data/source]>
[INFO] Webapp assembled in [3 msecs]
[INFO] Exploding webapp
[INFO] Assembling webapp [maven-war-plugin-test] in [<https://builds.apache.org/job/maven-plugins-ITs-2.x/ws/maven-war-plugin/target/test-classes/unit/warexplodedmojo/test-dir/ExplodedWar_WithSimpleExternalWARFile]>
[INFO] Processing war project
[INFO] Copying webapp resources [<https://builds.apache.org/job/maven-plugins-ITs-2.x/ws/maven-war-plugin/target/test-classes/unit/warexplodedmojo/test-dir/ExplodedWar_WithSimpleExternalWARFile-test-data/source]>
[INFO] Processing overlay [ id wartests:simple]
[INFO] Webapp assembled in [7 msecs]
[INFO] Exploding webapp
[INFO] Assembling webapp [maven-war-plugin-test] in [<https://builds.apache.org/job/maven-plugins-ITs-2.x/ws/maven-war-plugin/target/test-classes/unit/warexplodedmojo/test-dir/testExplodedWarMergeWarLocalFileOverride]>
[INFO] Processing war project
[INFO] Copying webapp resources [<https://builds.apache.org/job/maven-plugins-ITs-2.x/ws/maven-war-plugin/target/test-classes/unit/warexplodedmojo/test-dir/testExplodedWarMergeWarLocalFileOverride-test-data/source]>
[INFO] Processing overlay [ id wartests:simple]
[INFO] Webapp assembled in [6 msecs]
[INFO] Exploding webapp
[INFO] Assembling webapp [maven-war-plugin-test] in [<https://builds.apache.org/job/maven-plugins-ITs-2.x/ws/maven-war-plugin/target/test-classes/unit/warexplodedmojo/test-dir/testExplodedWarMergeWarLocalFileOverride]>
[INFO] Processing war project
[INFO] Copying webapp resources [<https://builds.apache.org/job/maven-plugins-ITs-2.x/ws/maven-war-plugin/target/test-classes/unit/warexplodedmojo/test-dir/testExplodedWarMergeWarLocalFileOverride-test-data/source]>
[INFO] Processing overlay [ id wartests:simple]
[INFO] Webapp assembled in [3 msecs]
[INFO] Exploding webapp
[INFO] Assembling webapp [maven-war-plugin-test] in [<https://builds.apache.org/job/maven-plugins-ITs-2.x/ws/maven-war-plugin/target/test-classes/unit/warexplodedmojo/test-dir/ExplodedWar_WithEJB]>
[INFO] Processing war project
[INFO] Copying webapp resources [<https://builds.apache.org/job/maven-plugins-ITs-2.x/ws/maven-war-plugin/target/test-classes/unit/warexplodedmojo/test-dir/ExplodedWar_WithEJB-test-data/source]>
[INFO] Webapp assembled in [4 msecs]
[INFO] Exploding webapp
[INFO] Assembling webapp [maven-war-plugin-test] in [<https://builds.apache.org/job/maven-plugins-ITs-2.x/ws/maven-war-plugin/target/test-classes/unit/warexplodedmojo/test-dir/ExplodedWarWithJar]>
[INFO] Processing war project
[INFO] Copying webapp resources [<https://builds.apache.org/job/maven-plugins-ITs-2.x/ws/maven-war-plugin/target/test-classes/unit/warexplodedmojo/test-dir/ExplodedWarWithJar-test-data/source]>
[INFO] Webapp assembled in [4 msecs]
[INFO] Exploding webapp
[INFO] Assembling webapp [maven-war-plugin-test] in [<https://builds.apache.org/job/maven-plugins-ITs-2.x/ws/maven-war-plugin/target/test-classes/unit/warexplodedmojo/test-dir/ExplodedWar_WithEJB]>
[INFO] Processing war project
[INFO] Copying webapp resources [<https://builds.apache.org/job/maven-plugins-ITs-2.x/ws/maven-war-plugin/target/test-classes/unit/warexplodedmojo/test-dir/ExplodedWar_WithEJB-test-data/source]>
[INFO] Webapp assembled in [3 msecs]
[INFO] Exploding webapp
[INFO] Assembling webapp [maven-war-plugin-test] in [<https://builds.apache.org/job/maven-plugins-ITs-2.x/ws/maven-war-plugin/target/test-classes/unit/warexplodedmojo/test-dir/ExplodedWar_WithTLD]>
[INFO] Processing war project
[INFO] Copying webapp resources [<https://builds.apache.org/job/maven-plugins-ITs-2.x/ws/maven-war-plugin/target/test-classes/unit/warexplodedmojo/test-dir/ExplodedWar_WithTLD-test-data/source]>
[INFO] Webapp assembled in [3 msecs]
[INFO] Exploding webapp
[INFO] Assembling webapp [maven-war-plugin-test] in [<https://builds.apache.org/job/maven-plugins-ITs-2.x/ws/maven-war-plugin/target/test-classes/unit/warexplodedmojo/test-dir/ExplodedWar_WithPAR]>
[INFO] Processing war project
[INFO] Copying webapp resources [<https://builds.apache.org/job/maven-plugins-ITs-2.x/ws/maven-war-plugin/target/test-classes/unit/warexplodedmojo/test-dir/ExplodedWar_WithPAR-test-data/source]>
[INFO] Webapp assembled in [3 msecs]
[INFO] Exploding webapp
[INFO] Assembling webapp [maven-war-plugin-test] in [<https://builds.apache.org/job/maven-plugins-ITs-2.x/ws/maven-war-plugin/target/test-classes/unit/warexplodedmojo/test-dir/ExplodedWarWithAar]>
[INFO] Processing war project
[INFO] Copying webapp resources [<https://builds.apache.org/job/maven-plugins-ITs-2.x/ws/maven-war-plugin/target/test-classes/unit/warexplodedmojo/test-dir/ExplodedWarWithAar-test-data/source]>
[INFO] Webapp assembled in [3 msecs]
[INFO] Exploding webapp
[INFO] Assembling webapp [maven-war-plugin-test] in [<https://builds.apache.org/job/maven-plugins-ITs-2.x/ws/maven-war-plugin/target/test-classes/unit/warexplodedmojo/test-dir/ExplodedWarWithMar]>
[INFO] Processing war project
[INFO] Copying webapp resources [<https://builds.apache.org/job/maven-plugins-ITs-2.x/ws/maven-war-plugin/target/test-classes/unit/warexplodedmojo/test-dir/ExplodedWarWithMar-test-data/source]>
[INFO] Webapp assembled in [3 msecs]
[INFO] Exploding webapp
[INFO] Assembling webapp [maven-war-plugin-test] in [<https://builds.apache.org/job/maven-plugins-ITs-2.x/ws/maven-war-plugin/target/test-classes/unit/warexplodedmojo/test-dir/ExplodedWar_WithDuplicateDependencies]>
[INFO] Processing war project
[INFO] Copying webapp resources [<https://builds.apache.org/job/maven-plugins-ITs-2.x/ws/maven-war-plugin/target/test-classes/unit/warexplodedmojo/test-dir/ExplodedWar_WithDuplicateDependencies-test-data/source]>
[INFO] Webapp assembled in [3 msecs]
[INFO] Exploding webapp
[INFO] Assembling webapp [maven-war-plugin-test] in [<https://builds.apache.org/job/maven-plugins-ITs-2.x/ws/maven-war-plugin/target/test-classes/unit/warexplodedmojo/test-dir/ExplodedWar_DuplicateWithClassifier]>
[INFO] Processing war project
[INFO] Copying webapp resources [<https://builds.apache.org/job/maven-plugins-ITs-2.x/ws/maven-war-plugin/target/test-classes/unit/warexplodedmojo/test-dir/ExplodedWar_DuplicateWithClassifier-test-data/source]>
[INFO] Webapp assembled in [4 msecs]
[INFO] Exploding webapp
[INFO] Assembling webapp [maven-war-plugin-test] in [<https://builds.apache.org/job/maven-plugins-ITs-2.x/ws/maven-war-plugin/target/test-classes/unit/warexplodedmojo/test-dir/ExplodedWar_WithClasses]>
[INFO] Processing war project
[INFO] Copying webapp resources [<https://builds.apache.org/job/maven-plugins-ITs-2.x/ws/maven-war-plugin/target/test-classes/unit/warexplodedmojo/test-dir/ExplodedWar_WithClasses-test-data/source]>
[INFO] Webapp assembled in [2 msecs]
[INFO] Exploding webapp
[INFO] Assembling webapp [maven-war-plugin-test] in [<https://builds.apache.org/job/maven-plugins-ITs-2.x/ws/maven-war-plugin/target/test-classes/unit/warexplodedmojo/test-dir/ExplodedWar_WithSourceIncludeExclude]>
[INFO] Processing war project
[INFO] Copying webapp resources [<https://builds.apache.org/job/maven-plugins-ITs-2.x/ws/maven-war-plugin/target/test-classes/unit/warexplodedmojo/test-dir/ExplodedWar_WithSourceIncludeExclude-test-data/source]>
[INFO] Webapp assembled in [1 msecs]
[INFO] Exploding webapp
[INFO] Assembling webapp [maven-war-plugin-test] in [<https://builds.apache.org/job/maven-plugins-ITs-2.x/ws/maven-war-plugin/target/test-classes/unit/warexplodedmojo/test-dir/ExplodedWar_WithWarDependencyIncludeExclude]>
[INFO] Processing war project
[INFO] Copying webapp resources [<https://builds.apache.org/job/maven-plugins-ITs-2.x/ws/maven-war-plugin/target/test-classes/unit/warexplodedmojo/test-dir/ExplodedWar_WithWarDependencyIncludeExclude-test-data/source]>
[INFO] Processing overlay [ id wartests:war-include-exclude]
[INFO] Webapp assembled in [7 msecs]
[INFO] Exploding webapp
[INFO] Assembling webapp [maven-war-plugin-test] in [<https://builds.apache.org/job/maven-plugins-ITs-2.x/ws/maven-war-plugin/target/test-classes/unit/warexplodedmojo/test-dir/ExplodedWarWithSourceModificationCheck]>
[INFO] Processing war project
[INFO] Copying webapp resources [<https://builds.apache.org/job/maven-plugins-ITs-2.x/ws/maven-war-plugin/target/test-classes/unit/warexplodedmojo/test-dir/ExplodedWarWithSourceModificationCheck-test-data/source]>
[INFO] Webapp assembled in [2 msecs]
[INFO] Exploding webapp
[INFO] Assembling webapp [maven-war-plugin-test] in [<https://builds.apache.org/job/maven-plugins-ITs-2.x/ws/maven-war-plugin/target/test-classes/unit/warexplodedmojo/test-dir/ExplodedWarWithFileNameMapping]>
[INFO] Processing war project
[INFO] Copying webapp resources [<https://builds.apache.org/job/maven-plugins-ITs-2.x/ws/maven-war-plugin/target/test-classes/unit/warexplodedmojo/test-dir/ExplodedWarWithFileNameMapping-test-data/source]>
[INFO] Webapp assembled in [3 msecs]
[INFO] Exploding webapp
[INFO] Assembling webapp [maven-war-plugin-test] in [<https://builds.apache.org/job/maven-plugins-ITs-2.x/ws/maven-war-plugin/target/test-classes/unit/warexplodedmojo/test-dir/ExplodedWarWithFileNameMappingAndDuplicateDependencies]>
[INFO] Processing war project
[INFO] Copying webapp resources [<https://builds.apache.org/job/maven-plugins-ITs-2.x/ws/maven-war-plugin/target/test-classes/unit/warexplodedmojo/test-dir/ExplodedWarWithFileNameMappingAndDuplicateDependencies-test-data/source]>
[INFO] Webapp assembled in [3 msecs]
Tests run: 21, Failures: 0, Errors: 0, Skipped: 0, Time elapsed: 0.897 sec
Running org.apache.maven.plugin.war.WarInPlaceMojoTest
[INFO] Generating webapp in source directory [<https://builds.apache.org/job/maven-plugins-ITs-2.x/ws/maven-war-plugin/target/test-classes/unit/warexplodedinplacemojo/test-dir/SimpleExplodedInplaceWar-test-data/source]>
[INFO] Assembling webapp [maven-war-plugin-test] in [<https://builds.apache.org/job/maven-plugins-ITs-2.x/ws/maven-war-plugin/target/test-classes/unit/warexplodedinplacemojo/test-dir/SimpleExplodedInplaceWar-test-data/source]>
[INFO] Processing war project
[INFO] Copying webapp webResources [<https://builds.apache.org/job/maven-plugins-ITs-2.x/ws/maven-war-plugin/target/test-classes/unit/warexplodedinplacemojo/test-dir/resources]>
to [<https://builds.apache.org/job/maven-plugins-ITs-2.x/ws/maven-war-plugin/target/test-classes/unit/warexplodedinplacemojo/test-dir/SimpleExplodedInplaceWar-test-data/source]>
[INFO] Webapp assembled in [1 msecs]
Tests run: 2, Failures: 0, Errors: 0, Skipped: 0, Time elapsed: 0.07 sec

Results :

Tests run: 83, Failures: 0, Errors: 0, Skipped: 0

[INFO] [jar:jar {execution: default-jar}]
[INFO] Building jar: <https://builds.apache.org/job/maven-plugins-ITs-2.x/ws/maven-war-plugin/target/maven-war-plugin-2.2-SNAPSHOT.jar>
[INFO] [plugin:addPluginArtifactMetadata {execution: default-addPluginArtifactMetadata}]
[INFO] [invoker:install {execution: integration-test}]
[INFO] Installing <https://builds.apache.org/job/maven-plugins-ITs-2.x/ws/maven-war-plugin/pom.xml>
to <https://builds.apache.org/job/maven-plugins-ITs-2.x/ws/maven-war-plugin/target/local-repo/org/apache/maven/plugins/maven-war-plugin/2.2-SNAPSHOT/maven-war-plugin-2.2-SNAPSHOT.pom>
[INFO] Installing <https://builds.apache.org/job/maven-plugins-ITs-2.x/ws/maven-war-plugin/target/maven-war-plugin-2.2-SNAPSHOT.jar>
to <https://builds.apache.org/job/maven-plugins-ITs-2.x/ws/maven-war-plugin/target/local-repo/org/apache/maven/plugins/maven-war-plugin/2.2-SNAPSHOT/maven-war-plugin-2.2-SNAPSHOT.jar>
[INFO] [invoker:run {execution: integration-test}]
[INFO] Building: simple-war-project/pom.xml
[INFO] ..SUCCESS (3.1 s)
[INFO] Building: MWAR-143/pom.xml
[INFO] ..SUCCESS (7.6 s)
[INFO] Building: MWAR-139/pom.xml
[INFO] ..SUCCESS (2.9 s)
[INFO] Building: MWAR-133/pom.xml
[INFO] ..SUCCESS (2.2 s)
[INFO] Building: scoped-dependency-same-artifact/pom.xml
[INFO] ..SUCCESS (18.7 s)
[INFO] Building: simple-war-no-webxml/pom.xml
[INFO] ..SUCCESS (2.8 s)
[INFO] Building: MWAR-62/pom.xml
[INFO] ..SUCCESS (2.2 s)
[INFO] Building: web-resources-filtering/pom.xml
[INFO] ..SUCCESS (3.8 s)
[INFO] Building: MWAR-96/pom.xml
[INFO] ..SUCCESS (2.9 s)
[INFO] Building: MWAR-131/pom.xml
[INFO] ..SUCCESS (16.5 s)
[INFO] Building: default/pom.xml
[INFO] ..SUCCESS (3.2 s)
[INFO] Building: MWAR-129/pom.xml
[INFO] ..SUCCESS (2.2 s)
[INFO] ---------------------------------------
[INFO] Execution Summary:
[INFO]   Builds Passing: 12
[INFO]   Builds Failing: 0
[INFO]   Builds Skipped: 0
[INFO] ---------------------------------------
[INFO] [install:install {execution: default-install}]
[INFO] Installing <https://builds.apache.org/job/maven-plugins-ITs-2.x/ws/maven-war-plugin/target/maven-war-plugin-2.2-SNAPSHOT.jar>
to /home/jenkins/.m2/repository/org/apache/maven/plugins/maven-war-plugin/2.2-SNAPSHOT/maven-war-plugin-2.2-SNAPSHOT.jar
[INFO] ------------------------------------------------------------------------
[INFO] Building Maven Plugins Aggregator
[INFO]    task-segment: [clean, install]
[INFO] ------------------------------------------------------------------------
[INFO] [clean:clean {execution: default-clean}]
[INFO] Deleting <https://builds.apache.org/job/maven-plugins-ITs-2.x/ws/target>
[INFO] [remote-resources:process {execution: default}]
[INFO] [site:attach-descriptor {execution: default-attach-descriptor}]
[INFO] [install:install {execution: default-install}]
[INFO] Installing <https://builds.apache.org/job/maven-plugins-ITs-2.x/ws/pom.xml> to
/home/jenkins/.m2/repository/org/apache/maven/plugins/maven-plugins-aggregator/1-SNAPSHOT/maven-plugins-aggregator-1-SNAPSHOT.pom
[INFO] 
[INFO] 
[INFO] ------------------------------------------------------------------------
[INFO] Reactor Summary:
[INFO] ------------------------------------------------------------------------
[INFO] Maven Plugins ......................................... SUCCESS [6.403s]
[INFO] Maven ACR Plugin ...................................... SUCCESS [21.742s]
[INFO] Maven Ant Plugin ...................................... SUCCESS [1:21.435s]
[INFO] Maven AntRun Plugin ................................... SUCCESS [46.374s]
[INFO] Maven Eclipse Plugin .................................. SUCCESS [8:56.842s]
[INFO] Maven Assembly Plugin ................................. SUCCESS [12:36.292s]
[INFO] Maven Changelog Plugin ................................ SUCCESS [21.614s]
[INFO] Maven Compiler Plugin ................................. SUCCESS [19.572s]
[INFO] Maven Changes Report Plugin ........................... FAILED [26.905s]
[INFO] Maven Checkstyle Plugin ............................... SUCCESS [1:22.181s]
[INFO] Maven Clean Plugin .................................... SUCCESS [13.297s]
[INFO] Maven Dependency Plugin ............................... SUCCESS [2:10.132s]
[INFO] Maven Deploy Plugin ................................... SUCCESS [1:04.917s]
[INFO] Maven DOAP Plugin ..................................... SUCCESS [16.757s]
[INFO] Maven Documentation Checker Plugin .................... SUCCESS [9.101s]
[INFO] Maven EAR Plugin ...................................... SUCCESS [3:10.097s]
[INFO] Maven EJB Plugin ...................................... SUCCESS [23.088s]
[INFO] Maven GPG Plugin ...................................... SUCCESS [20.194s]
[INFO] Maven Help Plugin ..................................... SUCCESS [29.745s]
[INFO] Maven IDEA Plugin ..................................... SUCCESS [6.521s]
[INFO] Maven Install Plugin .................................. SUCCESS [42.973s]
[INFO] Maven JAR Plugin ...................................... SUCCESS [1:04.832s]
[INFO] Maven Jarsigner Plugin ................................ SUCCESS [32.269s]
[INFO] Maven Shade Plugin .................................... SUCCESS [1:55.305s]
[INFO] Maven Javadoc Plugin .................................. FAILED [12:09.591s]
[INFO] Maven Linkcheck Plugin ................................ SUCCESS [1.822s]
[INFO] Maven One Plugin ...................................... SUCCESS [36.200s]
[INFO] Maven Patch Plugin .................................... FAILED [10.101s]
[INFO] Maven PDF Plugin ...................................... SUCCESS [37.293s]
[INFO] Maven PMD Plugin ...................................... SUCCESS [21.085s]
[INFO] Maven RAR Plugin ...................................... SUCCESS [5.862s]
[INFO] Maven Reactor Plugin .................................. SUCCESS [2.371s]
[INFO] Maven Repository Plugin ............................... SUCCESS [2:11.620s]
[INFO] Maven Resources Plugin ................................ SUCCESS [46.316s]
[INFO] Maven Site Plugin 3 ................................... FAILED [12:50.117s]
[INFO] Maven Source Plugin ................................... SUCCESS [27.667s]
[INFO] Maven Stage Plugin .................................... SUCCESS [1.846s]
[INFO] Maven Toolchains Plugin ............................... SUCCESS [1.480s]
[INFO] Maven Verifier Plugin ................................. SUCCESS [8.617s]
[INFO] Maven WAR Plugin ...................................... SUCCESS [1:23.579s]
[INFO] Maven Plugins Aggregator .............................. SUCCESS [1.101s]
[INFO] ------------------------------------------------------------------------
[INFO] Error for project: Maven Changes Report Plugin (during install)
[INFO] ------------------------------------------------------------------------
[INFO] : org.apache.maven.plugin.invoker.InvokerSession@6575d6
4 builds failed.
[INFO] ------------------------------------------------------------------------
[INFO] Error for project: Maven Javadoc Plugin (during install)
[INFO] ------------------------------------------------------------------------
[INFO] There are test failures.

Please refer to <https://builds.apache.org/job/maven-plugins-ITs-2.x/ws/maven-javadoc-plugin/target/surefire-reports>
for the individual test results.
[INFO] ------------------------------------------------------------------------
[INFO] Error for project: Maven Patch Plugin (during install)
[INFO] ------------------------------------------------------------------------
[INFO] : org.apache.maven.plugin.invoker.InvokerSession@465ae8
4 builds failed.
[INFO] ------------------------------------------------------------------------
[INFO] Error for project: Maven Site Plugin 3 (during install)
[INFO] ------------------------------------------------------------------------
[INFO] : org.apache.maven.plugin.invoker.InvokerSession@df5d57
1 build failed.
[INFO] ------------------------------------------------------------------------
[INFO] For more information, run Maven with the -e switch
[INFO] ------------------------------------------------------------------------
[INFO] BUILD ERRORS
[INFO] ------------------------------------------------------------------------
[INFO] Total time: 72 minutes 9 seconds
[INFO] Finished at: Tue Jul 26 09:35:31 UTC 2011
[INFO] Final Memory: 80M/395M
[INFO] ------------------------------------------------------------------------


Mime
View raw message