maven-notifications mailing list archives

Site index · List index
Message view « Date » · « Thread »
Top « Date » · « Thread »
From Apache Jenkins Server <jenk...@builds.apache.org>
Subject Build failed in Jenkins: core-integration-testing-maven-3-trunk-windows #8
Date Sun, 31 Jul 2011 19:12:24 GMT
See <https://builds.apache.org/job/core-integration-testing-maven-3-trunk-windows/8/changes>

Changes:

[jvanzyl] o slight fix for the bootstrap, we want to use the distributionId for the build
not the distributionName

[jvanzyl] o make it possible to change:
 - the overarching archive name
 - id of the product
 - long name of the product
 - short name of the product
 - have "mvn -v" output this information so that it's clear it's not Apache Maven

This allows people in the community creating builds of their own builds of Apache Maven to
conform to the naming conventions put forth by the Apache Software Foundation.

[ifedorenko] MNG-5141 Make MojoExecutor.ensureDependenciesAreResolved public

[bentmann] o Decoupled from production plugin

[bentmann] o Improved POM location tracking

[bentmann] o Avoided corruption of local repository when installing a snapshot artifact that
was already deployed and as such has a timestamped version, this happens in the wild when
using invoker:install during a build that deploys its output

[bentmann] [MNG-5135] Regression: in some cases aggregator mojo is unable to resolve dependencies
with custom packaging

[bentmann] [MNG-5096] <exclusion> on <dependency> with <type>test-jar</type>
doesn't work in maven 3

[bentmann] [MNG-5137] Reactor resolution does not work for forked multi module builds
Submitted by: Stuart McCulloch

[bentmann] [MNG-5113] NullPointerException on javadoc site generation

[bentmann] [MNG-5131] Wrong encoding for encrypted passwords

[bentmann] [MNG-5064] mvn -nsu (--no-snapshot-updates) should not download snapshots (and
break local builds)

[bentmann] [MNG-5064] mvn -nsu (--no-snapshot-updates) should not download snapshots (and
break local builds)

o Fixed IT

[bentmann] o Set svn:eol-style=native

[hboutemy] improved javadoc

[hboutemy] added description for every module

[hboutemy] use m-jxr-p 2.3 to add aggregate source jxr

[hboutemy] added missing breadcrumb

[hboutemy] use MavenServiceLocator instead of deprecated DefaultServiceLocator

[pgier] [MNG-4112] Add test for new properties "maven.version" and "maven.build.version"

[pgier] [MNG-4112] Add properties "maven.version" and "maven.build.version" which contain
the current version of Maven

[hboutemy] updated url to match site organization: Maven core url is not the whole site but
the core subset

[hboutemy] prepare m.jxr.p 2.3 with its new aggregate goal

[hboutemy] added development menu

[hboutemy] improved descriptions

------------------------------------------
[...truncated 2647 lines...]
[INFO] --- maven-jar-plugin:2.3.1:jar (default-jar) @ maven-it-plugin-no-project ---
[INFO] Building jar: F:\hudson\hudson-slave\workspace\core-integration-testing-maven-3-trunk-windows\core-integration-testing-trunk\core-it-support\core-it-plugins\maven-it-plugin-no-project\target\maven-it-plugin-no-project-2.1-SNAPSHOT.jar
[INFO] 
[INFO] --- maven-plugin-plugin:2.8:addPluginArtifactMetadata (default-addPluginArtifactMetadata)
@ maven-it-plugin-no-project ---
[INFO] 
[INFO] --- maven-install-plugin:2.3.1:install (default-install) @ maven-it-plugin-no-project
---
[INFO] Installing F:\hudson\hudson-slave\workspace\core-integration-testing-maven-3-trunk-windows\core-integration-testing-trunk\core-it-support\core-it-plugins\maven-it-plugin-no-project\target\maven-it-plugin-no-project-2.1-SNAPSHOT.jar
to <https://builds.apache.org/job/core-integration-testing-maven-3-trunk-windows/ws/.repository\org\apache\maven\its\plugins\maven-it-plugin-no-project\2.1-SNAPSHOT\maven-it-plugin-no-project-2.1-SNAPSHOT.jar>
[INFO] Installing F:\hudson\hudson-slave\workspace\core-integration-testing-maven-3-trunk-windows\core-integration-testing-trunk\core-it-support\core-it-plugins\maven-it-plugin-no-project\pom.xml
to <https://builds.apache.org/job/core-integration-testing-maven-3-trunk-windows/ws/.repository\org\apache\maven\its\plugins\maven-it-plugin-no-project\2.1-SNAPSHOT\maven-it-plugin-no-project-2.1-SNAPSHOT.pom>
[INFO]                                                                         
[INFO] ------------------------------------------------------------------------
[INFO] Building Maven IT Plugin :: Online 2.1-SNAPSHOT
[INFO] ------------------------------------------------------------------------
[INFO] 
[INFO] --- maven-clean-plugin:2.4.1:clean (default-clean) @ maven-it-plugin-online ---
[INFO] Deleting F:\hudson\hudson-slave\workspace\core-integration-testing-maven-3-trunk-windows\core-integration-testing-trunk\core-it-support\core-it-plugins\maven-it-plugin-online\target
[INFO] 
[INFO] --- maven-plugin-plugin:2.8:descriptor (default-descriptor) @ maven-it-plugin-online
---
[INFO] Using 'UTF-8' encoding to read mojo metadata.
[INFO] Applying mojo extractor for language: java
[INFO] Mojo extractor for language: java found 1 mojo descriptors.
[INFO] Applying mojo extractor for language: bsh
[INFO] Mojo extractor for language: bsh found 0 mojo descriptors.
[INFO] 
[INFO] --- maven-remote-resources-plugin:1.2.1:process (default) @ maven-it-plugin-online
---
[INFO] 
[INFO] --- maven-resources-plugin:2.5:resources (default-resources) @ maven-it-plugin-online
---
[debug] execute contextualize
[INFO] Using 'UTF-8' encoding to copy filtered resources.
[INFO] skip non existing resourceDirectory F:\hudson\hudson-slave\workspace\core-integration-testing-maven-3-trunk-windows\core-integration-testing-trunk\core-it-support\core-it-plugins\maven-it-plugin-online\src\main\resources
[INFO] Copying 3 resources
[INFO] 
[INFO] --- maven-compiler-plugin:2.3.2:compile (default-compile) @ maven-it-plugin-online
---
[INFO] Compiling 1 source file to F:\hudson\hudson-slave\workspace\core-integration-testing-maven-3-trunk-windows\core-integration-testing-trunk\core-it-support\core-it-plugins\maven-it-plugin-online\target\classes
[INFO] 
[INFO] --- maven-resources-plugin:2.5:testResources (default-testResources) @ maven-it-plugin-online
---
[debug] execute contextualize
[INFO] Using 'UTF-8' encoding to copy filtered resources.
[INFO] skip non existing resourceDirectory F:\hudson\hudson-slave\workspace\core-integration-testing-maven-3-trunk-windows\core-integration-testing-trunk\core-it-support\core-it-plugins\maven-it-plugin-online\src\test\resources
[INFO] Copying 3 resources
[INFO] 
[INFO] --- maven-compiler-plugin:2.3.2:testCompile (default-testCompile) @ maven-it-plugin-online
---
[INFO] Not compiling test sources
[INFO] 
[INFO] --- maven-surefire-plugin:2.9:test (default-test) @ maven-it-plugin-online ---
[INFO] Tests are skipped.
[INFO] 
[INFO] --- maven-jar-plugin:2.3.1:jar (default-jar) @ maven-it-plugin-online ---
[INFO] Building jar: F:\hudson\hudson-slave\workspace\core-integration-testing-maven-3-trunk-windows\core-integration-testing-trunk\core-it-support\core-it-plugins\maven-it-plugin-online\target\maven-it-plugin-online-2.1-SNAPSHOT.jar
[INFO] 
[INFO] --- maven-plugin-plugin:2.8:addPluginArtifactMetadata (default-addPluginArtifactMetadata)
@ maven-it-plugin-online ---
[INFO] 
[INFO] --- maven-install-plugin:2.3.1:install (default-install) @ maven-it-plugin-online ---
[INFO] Installing F:\hudson\hudson-slave\workspace\core-integration-testing-maven-3-trunk-windows\core-integration-testing-trunk\core-it-support\core-it-plugins\maven-it-plugin-online\target\maven-it-plugin-online-2.1-SNAPSHOT.jar
to <https://builds.apache.org/job/core-integration-testing-maven-3-trunk-windows/ws/.repository\org\apache\maven\its\plugins\maven-it-plugin-online\2.1-SNAPSHOT\maven-it-plugin-online-2.1-SNAPSHOT.jar>
[INFO] Installing F:\hudson\hudson-slave\workspace\core-integration-testing-maven-3-trunk-windows\core-integration-testing-trunk\core-it-support\core-it-plugins\maven-it-plugin-online\pom.xml
to <https://builds.apache.org/job/core-integration-testing-maven-3-trunk-windows/ws/.repository\org\apache\maven\its\plugins\maven-it-plugin-online\2.1-SNAPSHOT\maven-it-plugin-online-2.1-SNAPSHOT.pom>
[INFO]                                                                         
[INFO] ------------------------------------------------------------------------
[INFO] Building Maven IT Plugin :: Optional Mojos 2.1-SNAPSHOT
[INFO] ------------------------------------------------------------------------
[INFO] 
[INFO] --- maven-clean-plugin:2.4.1:clean (default-clean) @ maven-it-plugin-optional-mojos
---
[INFO] Deleting F:\hudson\hudson-slave\workspace\core-integration-testing-maven-3-trunk-windows\core-integration-testing-trunk\core-it-support\core-it-plugins\maven-it-plugin-optional-mojos\target
[INFO] 
[INFO] --- maven-plugin-plugin:2.8:descriptor (default-descriptor) @ maven-it-plugin-optional-mojos
---
[INFO] Using 'UTF-8' encoding to read mojo metadata.
[INFO] Applying mojo extractor for language: java
[INFO] Mojo extractor for language: java found 1 mojo descriptors.
[INFO] Applying mojo extractor for language: bsh
[INFO] Mojo extractor for language: bsh found 0 mojo descriptors.
[INFO] 
[INFO] --- maven-remote-resources-plugin:1.2.1:process (default) @ maven-it-plugin-optional-mojos
---
[INFO] 
[INFO] --- maven-resources-plugin:2.5:resources (default-resources) @ maven-it-plugin-optional-mojos
---
[debug] execute contextualize
[INFO] Using 'UTF-8' encoding to copy filtered resources.
[INFO] Copying 1 resource
[INFO] Copying 3 resources
[INFO] 
[INFO] --- maven-compiler-plugin:2.3.2:compile (default-compile) @ maven-it-plugin-optional-mojos
---
[INFO] Compiling 1 source file to F:\hudson\hudson-slave\workspace\core-integration-testing-maven-3-trunk-windows\core-integration-testing-trunk\core-it-support\core-it-plugins\maven-it-plugin-optional-mojos\target\classes
[INFO] 
[INFO] --- maven-resources-plugin:2.5:testResources (default-testResources) @ maven-it-plugin-optional-mojos
---
[debug] execute contextualize
[INFO] Using 'UTF-8' encoding to copy filtered resources.
[INFO] skip non existing resourceDirectory F:\hudson\hudson-slave\workspace\core-integration-testing-maven-3-trunk-windows\core-integration-testing-trunk\core-it-support\core-it-plugins\maven-it-plugin-optional-mojos\src\test\resources
[INFO] Copying 3 resources
[INFO] 
[INFO] --- maven-compiler-plugin:2.3.2:testCompile (default-testCompile) @ maven-it-plugin-optional-mojos
---
[INFO] Not compiling test sources
[INFO] 
[INFO] --- maven-surefire-plugin:2.9:test (default-test) @ maven-it-plugin-optional-mojos
---
[INFO] Tests are skipped.
[INFO] 
[INFO] --- maven-jar-plugin:2.3.1:jar (default-jar) @ maven-it-plugin-optional-mojos ---
[INFO] Building jar: F:\hudson\hudson-slave\workspace\core-integration-testing-maven-3-trunk-windows\core-integration-testing-trunk\core-it-support\core-it-plugins\maven-it-plugin-optional-mojos\target\maven-it-plugin-optional-mojos-2.1-SNAPSHOT.jar
[INFO] 
[INFO] --- maven-plugin-plugin:2.8:addPluginArtifactMetadata (default-addPluginArtifactMetadata)
@ maven-it-plugin-optional-mojos ---
[INFO] 
[INFO] --- maven-install-plugin:2.3.1:install (default-install) @ maven-it-plugin-optional-mojos
---
[INFO] Installing F:\hudson\hudson-slave\workspace\core-integration-testing-maven-3-trunk-windows\core-integration-testing-trunk\core-it-support\core-it-plugins\maven-it-plugin-optional-mojos\target\maven-it-plugin-optional-mojos-2.1-SNAPSHOT.jar
to <https://builds.apache.org/job/core-integration-testing-maven-3-trunk-windows/ws/.repository\org\apache\maven\its\plugins\maven-it-plugin-optional-mojos\2.1-SNAPSHOT\maven-it-plugin-optional-mojos-2.1-SNAPSHOT.jar>
[INFO] Installing F:\hudson\hudson-slave\workspace\core-integration-testing-maven-3-trunk-windows\core-integration-testing-trunk\core-it-support\core-it-plugins\maven-it-plugin-optional-mojos\pom.xml
to <https://builds.apache.org/job/core-integration-testing-maven-3-trunk-windows/ws/.repository\org\apache\maven\its\plugins\maven-it-plugin-optional-mojos\2.1-SNAPSHOT\maven-it-plugin-optional-mojos-2.1-SNAPSHOT.pom>
[INFO]                                                                         
[INFO] ------------------------------------------------------------------------
[INFO] Building Maven IT Plugin :: Packaging 2.1-SNAPSHOT
[INFO] ------------------------------------------------------------------------
[INFO] 
[INFO] --- maven-clean-plugin:2.4.1:clean (default-clean) @ maven-it-plugin-packaging ---
[INFO] Deleting F:\hudson\hudson-slave\workspace\core-integration-testing-maven-3-trunk-windows\core-integration-testing-trunk\core-it-support\core-it-plugins\maven-it-plugin-packaging\target
[INFO] 
[INFO] --- maven-plugin-plugin:2.8:descriptor (default-descriptor) @ maven-it-plugin-packaging
---
[INFO] Using 'UTF-8' encoding to read mojo metadata.
[INFO] Applying mojo extractor for language: java
[INFO] Mojo extractor for language: java found 2 mojo descriptors.
[INFO] Applying mojo extractor for language: bsh
[INFO] Mojo extractor for language: bsh found 0 mojo descriptors.
[INFO] 
[INFO] --- maven-remote-resources-plugin:1.2.1:process (default) @ maven-it-plugin-packaging
---
[INFO] 
[INFO] --- maven-resources-plugin:2.5:resources (default-resources) @ maven-it-plugin-packaging
---
[debug] execute contextualize
[INFO] Using 'UTF-8' encoding to copy filtered resources.
[INFO] Copying 1 resource
[INFO] Copying 3 resources
[INFO] 
[INFO] --- maven-compiler-plugin:2.3.2:compile (default-compile) @ maven-it-plugin-packaging
---
[INFO] Compiling 2 source files to F:\hudson\hudson-slave\workspace\core-integration-testing-maven-3-trunk-windows\core-integration-testing-trunk\core-it-support\core-it-plugins\maven-it-plugin-packaging\target\classes
[INFO] 
[INFO] --- maven-resources-plugin:2.5:testResources (default-testResources) @ maven-it-plugin-packaging
---
[debug] execute contextualize
[INFO] Using 'UTF-8' encoding to copy filtered resources.
[INFO] skip non existing resourceDirectory F:\hudson\hudson-slave\workspace\core-integration-testing-maven-3-trunk-windows\core-integration-testing-trunk\core-it-support\core-it-plugins\maven-it-plugin-packaging\src\test\resources
[INFO] Copying 3 resources
[INFO] 
[INFO] --- maven-compiler-plugin:2.3.2:testCompile (default-testCompile) @ maven-it-plugin-packaging
---
[INFO] Not compiling test sources
[INFO] 
[INFO] --- maven-surefire-plugin:2.9:test (default-test) @ maven-it-plugin-packaging ---
[INFO] Tests are skipped.
[INFO] 
[INFO] --- maven-jar-plugin:2.3.1:jar (default-jar) @ maven-it-plugin-packaging ---
[INFO] Building jar: F:\hudson\hudson-slave\workspace\core-integration-testing-maven-3-trunk-windows\core-integration-testing-trunk\core-it-support\core-it-plugins\maven-it-plugin-packaging\target\maven-it-plugin-packaging-2.1-SNAPSHOT.jar
[INFO] 
[INFO] --- maven-plugin-plugin:2.8:addPluginArtifactMetadata (default-addPluginArtifactMetadata)
@ maven-it-plugin-packaging ---
[INFO] 
[INFO] --- maven-install-plugin:2.3.1:install (default-install) @ maven-it-plugin-packaging
---
[INFO] Installing F:\hudson\hudson-slave\workspace\core-integration-testing-maven-3-trunk-windows\core-integration-testing-trunk\core-it-support\core-it-plugins\maven-it-plugin-packaging\target\maven-it-plugin-packaging-2.1-SNAPSHOT.jar
to <https://builds.apache.org/job/core-integration-testing-maven-3-trunk-windows/ws/.repository\org\apache\maven\its\plugins\maven-it-plugin-packaging\2.1-SNAPSHOT\maven-it-plugin-packaging-2.1-SNAPSHOT.jar>
[INFO] Installing F:\hudson\hudson-slave\workspace\core-integration-testing-maven-3-trunk-windows\core-integration-testing-trunk\core-it-support\core-it-plugins\maven-it-plugin-packaging\pom.xml
to <https://builds.apache.org/job/core-integration-testing-maven-3-trunk-windows/ws/.repository\org\apache\maven\its\plugins\maven-it-plugin-packaging\2.1-SNAPSHOT\maven-it-plugin-packaging-2.1-SNAPSHOT.pom>
[INFO]                                                                         
[INFO] ------------------------------------------------------------------------
[INFO] Building Maven IT Plugin :: Parameter Implementation 2.1-SNAPSHOT
[INFO] ------------------------------------------------------------------------
[INFO] 
[INFO] --- maven-clean-plugin:2.4.1:clean (default-clean) @ maven-it-plugin-parameter-implementation
---
[INFO] Deleting F:\hudson\hudson-slave\workspace\core-integration-testing-maven-3-trunk-windows\core-integration-testing-trunk\core-it-support\core-it-plugins\maven-it-plugin-parameter-implementation\target
[INFO] 
[INFO] --- maven-plugin-plugin:2.8:descriptor (default-descriptor) @ maven-it-plugin-parameter-implementation
---
[INFO] Using 'UTF-8' encoding to read mojo metadata.
[INFO] Applying mojo extractor for language: java
[INFO] Mojo extractor for language: java found 0 mojo descriptors.
[INFO] Applying mojo extractor for language: bsh
[INFO] Mojo extractor for language: bsh found 0 mojo descriptors.
[INFO] ------------------------------------------------------------------------
[INFO] Reactor Summary:
[INFO] 
[INFO] Maven Core ITs .................................... SUCCESS [2.583s]
[INFO] Maven IT Support .................................. SUCCESS [0.046s]
[INFO] Maven IT :: Plugins ............................... SUCCESS [0.060s]
[INFO] Maven IT Plugin :: Active Collection .............. SUCCESS [2.665s]
[INFO] Maven IT Plugin :: Ant-Based ...................... SUCCESS [0.838s]
[INFO] Maven IT Plugin :: Artifact ....................... SUCCESS [1.068s]
[INFO] Maven IT Plugin :: Class Loader :: Dependency A ... SUCCESS [0.359s]
[INFO] Maven IT Plugin :: Class Loader :: Dependency B ... SUCCESS [0.454s]
[INFO] Maven IT Plugin :: Class Loader :: Dependency C ... SUCCESS [0.112s]
[INFO] Maven IT Plugin :: Class Loader ................... SUCCESS [1.458s]
[INFO] Maven IT Plugin :: Class Loader :: Aggregator ..... SUCCESS [0.029s]
[INFO] Maven IT Plugin :: Configuration .................. SUCCESS [0.942s]
[INFO] Maven IT Plugin :: Context Passing ................ SUCCESS [0.401s]
[INFO] Maven ITs :: Core Plugin Stubs .................... SUCCESS [0.027s]
[INFO] Maven IT Clean Plugin Stub ........................ SUCCESS [0.422s]
[INFO] Maven IT Compiler Plugin Stub ..................... SUCCESS [0.432s]
[INFO] Maven IT Deploy Plugin Stub ....................... SUCCESS [0.446s]
[INFO] Maven IT EAR Plugin Stub .......................... SUCCESS [0.405s]
[INFO] Maven IT EJB Plugin Stub .......................... SUCCESS [0.421s]
[INFO] Maven IT Install Plugin Stub ...................... SUCCESS [0.419s]
[INFO] Maven IT JAR Plugin Stub .......................... SUCCESS [0.481s]
[INFO] Maven IT Javadoc Plugin Stub ...................... SUCCESS [0.442s]
[INFO] Maven IT Plugin Plugin Stub ....................... SUCCESS [0.409s]
[INFO] Maven IT RAR Plugin Stub .......................... SUCCESS [0.486s]
[INFO] Maven IT Resources Plugin Stub .................... SUCCESS [0.431s]
[INFO] Maven IT Site Plugin Stub ......................... SUCCESS [0.496s]
[INFO] Maven IT Source Plugin Stub ....................... SUCCESS [0.418s]
[INFO] Maven IT Surefire Plugin Stub ..................... SUCCESS [0.485s]
[INFO] Maven IT WAR Plugin Stub .......................... SUCCESS [0.469s]
[INFO] Maven IT Plugin :: Dependency Collection .......... SUCCESS [0.845s]
[INFO] Maven IT Plugin :: Dependency Resolution .......... SUCCESS [2.702s]
[INFO] Maven IT Plugin :: Expression ..................... SUCCESS [1.091s]
[INFO] Maven IT Plugin :: Error Mojos .................... SUCCESS [0.689s]
[INFO] Maven IT Component ................................ SUCCESS [0.544s]
[INFO] Maven IT Plugin :: Extension Consumer ............. SUCCESS [0.424s]
[INFO] Maven IT Plugin :: Extension Provider ............. SUCCESS [0.371s]
[INFO] Maven IT Plugin :: Fork ........................... SUCCESS [0.517s]
[INFO] Maven IT Plugin :: Invalid Descriptor ............. SUCCESS [0.514s]
[INFO] Maven IT Plugin :: Log File ....................... SUCCESS [0.442s]
[INFO] Maven IT Plugin :: No Default Component ........... SUCCESS [0.413s]
[INFO] Maven IT Plugin :: No Project ..................... SUCCESS [0.683s]
[INFO] Maven IT Plugin :: Online ......................... SUCCESS [0.329s]
[INFO] Maven IT Plugin :: Optional Mojos ................. SUCCESS [0.348s]
[INFO] Maven IT Plugin :: Packaging ...................... SUCCESS [0.382s]
[INFO] Maven IT Plugin :: Parameter Implementation ....... FAILURE [0.016s]
[INFO] Maven IT Plugin :: Plugin Dependency .............. SKIPPED
[INFO] Maven IT Plugin :: Project ........................ SKIPPED
[INFO] Maven IT Helper Library ........................... SKIPPED
[INFO] Maven IT Plugin :: Project Interpolation .......... SKIPPED
[INFO] Maven IT Plugin :: Setter ......................... SKIPPED
[INFO] Maven IT Plugin :: Singleton Component ............ SKIPPED
[INFO] Maven IT Plugin :: Site ........................... SKIPPED
[INFO] Maven IT Plugin :: Toolchain ...................... SKIPPED
[INFO] Maven IT Plugin :: Touch .......................... SKIPPED
[INFO] Maven IT Plugin :: Uses Properties Plugin ......... SKIPPED
[INFO] Maven IT Plugin :: Uses Wagon Plugin .............. SKIPPED
[INFO] Maven IT Plugin :: This plugin should contain the mojos needed by all tests.  SKIPPED
[INFO] Maven IT Plugin :: Plexus Utils 1.1 ............... SKIPPED
[INFO] Maven IT Plugin :: Plexus Utils New ............... SKIPPED
[INFO] Maven IT Plugin :: Plexus Component API ........... SKIPPED
[INFO] Maven IT Plugin :: Log4J Client ................... SKIPPED
[INFO] maven-it-plugin-extension1 ........................ SKIPPED
[INFO] maven-it-plugin-extension2 ........................ SKIPPED
[INFO] Maven IT Toolchain ................................ SKIPPED
[INFO] Maven IT Wagon .................................... SKIPPED
[INFO] Maven IT Support Artifacts ........................ SKIPPED
[INFO] Maven IT Extension ................................ SKIPPED
[INFO] Maven ITs ......................................... SKIPPED
[INFO] ------------------------------------------------------------------------
[INFO] BUILD FAILURE
[INFO] ------------------------------------------------------------------------
[INFO] Total time: 29.969s
[INFO] Finished at: Sun Jul 31 20:12:20 BST 2011
[INFO] Final Memory: 31M/719M
[INFO] ------------------------------------------------------------------------
[ERROR] Failed to execute goal org.apache.maven.plugins:maven-plugin-plugin:2.8:descriptor
(default-descriptor) on project maven-it-plugin-parameter-implementation: Error extracting
plugin descriptor: 'No mojo definitions were found for plugin: org.apache.maven.its.plugins:maven-it-plugin-parameter-implementation.'
-> [Help 1]
[ERROR] 
[ERROR] To see the full stack trace of the errors, re-run Maven with the -e switch.
[ERROR] Re-run Maven using the -X switch to enable full debug logging.
[ERROR] 
[ERROR] For more information about the errors and possible solutions, please read the following
articles:
[ERROR] [Help 1] http://cwiki.apache.org/confluence/display/MAVEN/MojoExecutionException
[ERROR] 
[ERROR] After correcting the problems, you can resume the build with the command
[ERROR]   mvn <goals> -rf :maven-it-plugin-parameter-implementation
Recording test results


Mime
View raw message