maven-notifications mailing list archives

Site index · List index
Message view « Date » · « Thread »
Top « Date » · « Thread »
From Apache Jenkins Server <jenk...@builds.apache.org>
Subject Build failed in Jenkins: core-integration-testing-maven-3-trunk-osx #6
Date Sun, 31 Jul 2011 20:14:20 GMT
See <https://builds.apache.org/job/core-integration-testing-maven-3-trunk-osx/6/changes>

Changes:

[jvanzyl] o slight fix for the bootstrap, we want to use the distributionId for the build
not the distributionName

[jvanzyl] o make it possible to change:
 - the overarching archive name
 - id of the product
 - long name of the product
 - short name of the product
 - have "mvn -v" output this information so that it's clear it's not Apache Maven

This allows people in the community creating builds of their own builds of Apache Maven to
conform to the naming conventions put forth by the Apache Software Foundation.

[ifedorenko] MNG-5141 Make MojoExecutor.ensureDependenciesAreResolved public

[bentmann] o Decoupled from production plugin

[bentmann] o Improved POM location tracking

[bentmann] o Avoided corruption of local repository when installing a snapshot artifact that
was already deployed and as such has a timestamped version, this happens in the wild when
using invoker:install during a build that deploys its output

[bentmann] [MNG-5135] Regression: in some cases aggregator mojo is unable to resolve dependencies
with custom packaging

[bentmann] [MNG-5096] <exclusion> on <dependency> with <type>test-jar</type>
doesn't work in maven 3

[bentmann] [MNG-5137] Reactor resolution does not work for forked multi module builds
Submitted by: Stuart McCulloch

[bentmann] [MNG-5113] NullPointerException on javadoc site generation

[bentmann] [MNG-5131] Wrong encoding for encrypted passwords

[bentmann] [MNG-5064] mvn -nsu (--no-snapshot-updates) should not download snapshots (and
break local builds)

[bentmann] [MNG-5064] mvn -nsu (--no-snapshot-updates) should not download snapshots (and
break local builds)

o Fixed IT

[bentmann] o Set svn:eol-style=native

[hboutemy] improved javadoc

[hboutemy] added description for every module

[hboutemy] use m-jxr-p 2.3 to add aggregate source jxr

[hboutemy] added missing breadcrumb

[hboutemy] use MavenServiceLocator instead of deprecated DefaultServiceLocator

[pgier] [MNG-4112] Add test for new properties "maven.version" and "maven.build.version"

[pgier] [MNG-4112] Add properties "maven.version" and "maven.build.version" which contain
the current version of Maven

[hboutemy] updated url to match site organization: Maven core url is not the whole site but
the core subset

[hboutemy] prepare m.jxr.p 2.3 with its new aggregate goal

[hboutemy] added development menu

[hboutemy] improved descriptions

------------------------------------------
[...truncated 4483 lines...]
mng2222OutputDirectoryReactorResolution(it).................OK (7.3 s)
mng2201PluginConfigInterpolation(itMNG2201).................OK (6.8 s)
mng2196ParentResolution(itMNG2196)..........................OK (5.8 s)
mng2174PluginDepsManagedByParentProfile(itMNG2174)..........OK (7.9 s)
mng2140ReactorAwareDepResolutionWhenFork(it)................OK (7.7 s)
mng2136ActiveByDefaultProfile(itMNG2136)....................OK (6.9 s)
mng2135PluginBuildInReactor(it).............................OK (12.4 s)
mng2130ParentLookupFromReactorCache(itMNG2130)..............OK (6.5 s)
mng2124PomInterpolationWithParentValues(itMNG2124)..........OK (7.3 s)
mng2123VersionRangeDependency(itMNG2123)....................OK (6.4 s)
mng2103PluginExecutionInheritance(it).......................OK (7.3 s)
mng2098VersionRangeSatisfiedFromWrongRepo(it)...............OK (6.0 s)
mng2068ReactorRelativeParents(itInheritedIdFields)..........OK (6.1 s)
mng2068ReactorRelativeParents(itExplicitIdFields)...........OK (5.8 s)
mng2068ReactorRelativeParents(itComplex)....................OK (6.3 s)
mng2054PluginExecutionInheritance(itMNG2054)................OK (7.6 s)
mng2052InterpolateWithSettingsProfileProperties(itMNG2052)..OK (6.0 s)
mng2045testJarDependenciesBrokenInReactor(itMNG2045)........OK (8.0 s)
mng2006ChildPathAwareUrlInheritance(itMNG2006)..............OK (6.3 s)
mng1999DefaultReportsInheritance(itInheritSuppression)......SKIPPED - version 3.0.4-SNAPSHOT
not in range (2.0.9,2.1.0-M1),(2.1.0-M1,3.0-alpha-1)
mng1999DefaultReportsInheritance(itOverrideSuppression).....SKIPPED - version 3.0.4-SNAPSHOT
not in range (2.0.9,2.1.0-M1),(2.1.0-M1,3.0-alpha-1)
mng1995InterpolateBooleanModelElements(itMNG1995)...........OK (7.3 s)
mng1992SystemPropOverridesPomProp(itMNG1992)................OK (5.9 s)
mng1957JdkActivationWithVersionRange(itMNG1957).............OK (6.9 s)
mng1908LegacySnapshotUpdate(itMNG1908)......................SKIPPED - version 3.0.4-SNAPSHOT
not in range [2.0,3.0-alpha-3)
mng1895ScopeConflictResolution(itDirectVsIndirect)..........OK (6.5 s)
mng1895ScopeConflictResolution(itCompileVsRuntime)..........OK (7.5 s)
mng1895ScopeConflictResolution(itCompileVsTest).............OK (7.6 s)
mng1895ScopeConflictResolution(itCompileVsProvided).........OK (6.8 s)
mng1895ScopeConflictResolution(itRuntimeVsTest).............OK (6.5 s)
mng1895ScopeConflictResolution(itRuntimeVsProvided).........OK (5.1 s)
mng1895ScopeConflictResolution(itProvidedVsTest)............OK (7.4 s)
mng1830ShowVersion(Version).................................OK (5.7 s)
mng1803PomValidationErrorIncludesLineNumber(it).............OK (5.2 s)
mng1751ForcedMetadataUpdateDuringDeployment(it).............OK (13.7 s)
mng1703PluginMgmtDepInheritance(itMNG1703)..................OK (7.7 s)
mng1701DuplicatePlugin(it)..................................OK (5.2 s)
mng1493NonStandardModulePomNames(itMNG1493).................OK (5.2 s)
mng1491ReactorArtifactIdCollision(itMNG1491)................OK (6.1 s)
mng1415QuotedSystemProperties(itMNG1415)....................OK (5.7 s)
mng1412DependenciesOrder(itMNG1412).........................OK (6.0 s)
mng1349ChecksumFormats(itMNG1349)...........................OK (7.8 s)
mng1323AntrunDependencies(itMNG1323)........................OK (7.0 s)
mng1233WarDepWithProvidedScope(itMNG1233)...................OK (6.6 s)
mng1144MultipleDefaultGoals(it).............................OK (7.4 s)
mng1142VersionRangeIntersection(itAB).......................OK (5.6 s)
mng1142VersionRangeIntersection(itBA).......................OK (7.5 s)
mng1088ReactorPluginResolution(itMNG1088)...................OK (6.6 s)
mng1073AggregatorForksReactor(itForkLifecycle)..............OK (6.0 s)
mng1073AggregatorForksReactor(itForkGoal)...................OK (5.8 s)
mng1052PluginMngtConfig(itMNG1052)..........................OK (6.5 s)
mng1021EqualAttachmentBuildNumber(itMNG1021)................OK (6.6 s)
mng0985NonExecutedPluginMngtGoals(itMNG0985)................OK (6.1 s)
mng0956ComponentInjectionViaProjectLevelPluginDep(itMNG0956)..OK (6.3 s)
mng0947OptionalDependency(it)...............................OK (6.5 s)
mng0870ReactorAwarePluginDiscovery(itMNG0870)...............OK (6.6 s)
mng0866EvaluateDefaultValue(itMNG866).......................OK (6.8 s)
mng0848SystemPropOverridesDefaultValue(itMNG848)............OK (6.2 s)
mng0836PluginParentResolution(itMNG836).....................OK (5.2 s)
mng0823MojoContextPassing(itMNG0823)........................OK (4.7 s)
mng0820ConflictResolution(itMNG0820)........................OK (6.1 s)
mng0818WarDepsNotTransitive(itMNG0818)......................OK (5.3 s)
mng0814ExplicitProfileActivation(itMNG814)..................OK (7.1 s)
mng0786ProfileAwareReactor(itMNG0786).......................OK (6.2 s)
mng0781PluginConfigVsExecConfig(itMNG0781)..................OK (5.1 s)
mng0773SettingsProfileReactorPollution(itMNG773)............OK (5.4 s)
mng0768OfflineMode(itMNG768)................................OK (19.7 s)
mng0761MissingSnapshotDistRepo(itMNG761)....................OK (6.3 s)
mng0731LegacyRepoLayout(itMNG731)...........................SKIPPED - version 3.0.4-SNAPSHOT
not in range [2.0,3.0-alpha-3)
mng0680ParentBasedir(itMNG680)..............................OK (7.0 s)
mng0674PluginParameterAlias(itLifecycle)....................OK (5.9 s)
mng0674PluginParameterAlias(itCli)..........................OK (7.4 s)
mng0666IgnoreLegacyPom(itMNG666)............................OK (6.2 s)
mng0557UserSettingsCliOption(itMNG557)......................OK (7.3 s)
mng0553SettingsAuthzEncryption(itBasic).....................OK (8.5 s)
mng0553SettingsAuthzEncryption(itRelocation)................OK (7.4 s)
mng0553SettingsAuthzEncryption(itEncryption)................OK (4.0 s)
mng0522InheritedPluginMgmtConfig(itMNG522)..................OK (2.2 s)
mng0507ArtifactRelocation(itMNG507).........................OK (2.9 s)
mng0505VersionRange(itMNG505)...............................OK (6.7 s)
mng0496IgnoreUnknownPluginParameters(itMNG496)..............OK (2.0 s)
mng0479OverrideCentralRepo(itModel).........................OK (4.1 s)
mng0479OverrideCentralRepo(itResolution)....................OK (9.1 s)
mng0471CustomLifecycle(itMNG471)............................OK (5.4 s)
mng0469ReportConfig(itReportConfigOverridesBuildDefaults)...SKIPPED - version 3.0.4-SNAPSHOT
not in range [2.0.0,3.0-alpha-1)
mng0469ReportConfig(itBuildConfigDominantDuringBuild).......OK (2.1 s)
mng0469ReportConfig(itBuildConfigIrrelevantForReports)......OK (2.1 s)
mng0461TolerateMissingDependencyPom(it).....................OK (5.7 s)
mng0449PluginVersionResolution(itLifecycleInvocation).......OK (2.2 s)
mng0449PluginVersionResolution(itCliInvocation).............OK (2.3 s)
mng0377PluginLookupFromPrefix(itMNG377).....................OK (2.9 s)
mng0294MergeGlobalAndUserSettings(itMNG294).................OK (2.1 s)
mng0282NonReactorExecWhenProjectIndependent(itMNG282).......OK (2.2 s)
mng0249ResolveDepsFromReactor(itMNG0249)....................OK (7.0 s)
mng0187CollectedProjects(it)................................OK (2.2 s)
mng0095ReactorFailureBehavior(itFailFast)...................OK (2.4 s)
mng0095ReactorFailureBehavior(itFailNever)..................OK (2.4 s)
mng0095ReactorFailureBehavior(itFailAtEnd)..................OK (2.4 s)
0145ReactorWithIncludesExcludes(itDefaultIncludesExcludes)..SKIPPED - version 3.0.4-SNAPSHOT
not in range [2.0,3.0-alpha-1)
0145ReactorWithIncludesExcludes(itCustomIncludes)...........SKIPPED - version 3.0.4-SNAPSHOT
not in range [2.0,3.0-alpha-1)
0145ReactorWithIncludesExcludes(itCustomExcludes)...........SKIPPED - version 3.0.4-SNAPSHOT
not in range [2.0,3.0-alpha-1)
0144LifecycleExecutionOrder(it0144).........................OK (3.0 s)
0143TransitiveDependencyScopes(itCompileScope)..............OK (2.6 s)
0143TransitiveDependencyScopes(itProvidedScope).............OK (2.7 s)
0143TransitiveDependencyScopes(itRuntimeScope)..............OK (2.8 s)
0143TransitiveDependencyScopes(itTestScope).................OK (3.0 s)
0142DirectDependencyScopes(it0142)..........................OK (2.9 s)
0140InterpolationWithPomPrefix(it0140)......................OK (2.8 s)
0139InterpolationWithProjectPrefix(it0139)..................OK (2.6 s)
0138PluginLifecycle(it0138).................................OK (2.9 s)
0137EarLifecycle(it0137)....................................OK (2.8 s)
0136RarLifecycle(it0136)....................................OK (3.0 s)
0135EjbLifecycle(it0135)....................................OK (2.9 s)
0134WarLifecycle(it0134)....................................OK (6.5 s)
0133JarLifecycle(it0133)....................................OK (3.0 s)
0132PomLifecycle(it0132)....................................OK (2.3 s)
0131SiteLifecycle(it0131)...................................OK (2.6 s)
0130CleanLifecycle(it0130)..................................OK (2.5 s)
0113ServerAuthzAvailableToWagonMgrInPlugin(it0113)..........OK (2.9 s)
0090EnvVarInterpolation(it0090).............................OK (2.5 s)
0087PluginRealmWithProjectLevelDeps(it0087).................OK (3.0 s)
0086PluginRealm(it0086).....................................OK (3.5 s)
0085TransitiveSystemScope(it0085)...........................OK (3.0 s)
0072InterpolationWithDottedProperty(it0072).................OK (2.8 s)
0071PluginConfigWithDottedProperty(it0071)..................OK (3.5 s)
0064MojoConfigViaSetters(it0064)............................OK (2.6 s)
0063SystemScopeDependency(it0063)...........................OK (2.9 s)
0056MultipleGoalExecutions(it0056)..........................OK (2.7 s)
0052ReleaseProfile(it0052)..................................OK (2.9 s)
0051ReleaseProfile(it0051)..................................OK (5.8 s)
0041ArtifactTypeFromPluginExtension(it0041).................OK (3.2 s)
0040PackagingFromPluginExtension(it0040)....................OK (2.9 s)
0039ReleasePomInReactor(it0039).............................SKIPPED - version 3.0.4-SNAPSHOT
not in range [2.0,3.0-alpha-1)
0038AlternatePomFileDifferentDir(it0038)....................OK (3.2 s)
0037AlternatePomFileSameDir(it0037).........................OK (2.8 s)
0036ReleasePom(it0036)......................................SKIPPED - version 3.0.4-SNAPSHOT
not in range (2.0,3.0-alpha-1)
0032MavenPrerequisite(it0032)...............................OK (2.4 s)
0030DepPomDepMngtInheritance(it0030)........................OK (8.2 s)
0025MultipleExecutionLevelConfigs(it0025)...................OK (3.3 s)
0024MultipleGoalExecutions(it0024)..........................OK (3.0 s)
0023SettingsProfile(it0023).................................OK (3.3 s)
0021PomProfile(it0021)......................................OK (3.1 s)
0019PluginVersionMngtBySuperPom(it0019).....................OK (4.2 s)
0018DependencyManagement(it0018)............................OK (3.2 s)
0012PomInterpolation(it0012)................................OK (3.7 s)
0011DefaultVersionByDependencyManagement(it0011)............OK (3.6 s)
0010DependencyClosureResolution(it0010).....................OK (3.6 s)
0009GoalConfiguration(it0009)...............................OK (3.8 s)
0008SimplePlugin(it0008)....................................OK (3.6 s)
Tests run: 699, Failures: 1, Errors: 0, Skipped: 0, Time elapsed: 3,791.807 sec <<<
FAILURE!

Results :

Failed tests:   testitMNG3951(org.apache.maven.it.MavenITmng3951AbsolutePathsTest): expected:</private/tmp>
but was:</tmp>

Tests run: 699, Failures: 1, Errors: 0, Skipped: 0

[INFO] ------------------------------------------------------------------------
[INFO] Reactor Summary:
[INFO] 
[INFO] Maven Core ITs .................................... SUCCESS [1.863s]
[INFO] Maven IT Support .................................. SUCCESS [0.072s]
[INFO] Maven IT :: Plugins ............................... SUCCESS [0.033s]
[INFO] Maven IT Plugin :: Active Collection .............. SUCCESS [2.532s]
[INFO] Maven IT Plugin :: Ant-Based ...................... SUCCESS [0.825s]
[INFO] Maven IT Plugin :: Artifact ....................... SUCCESS [1.102s]
[INFO] Maven IT Plugin :: Class Loader :: Dependency A ... SUCCESS [0.355s]
[INFO] Maven IT Plugin :: Class Loader :: Dependency B ... SUCCESS [0.471s]
[INFO] Maven IT Plugin :: Class Loader :: Dependency C ... SUCCESS [0.356s]
[INFO] Maven IT Plugin :: Class Loader ................... SUCCESS [1.405s]
[INFO] Maven IT Plugin :: Class Loader :: Aggregator ..... SUCCESS [0.036s]
[INFO] Maven IT Plugin :: Configuration .................. SUCCESS [0.883s]
[INFO] Maven IT Plugin :: Context Passing ................ SUCCESS [0.420s]
[INFO] Maven ITs :: Core Plugin Stubs .................... SUCCESS [0.024s]
[INFO] Maven IT Clean Plugin Stub ........................ SUCCESS [0.428s]
[INFO] Maven IT Compiler Plugin Stub ..................... SUCCESS [0.433s]
[INFO] Maven IT Deploy Plugin Stub ....................... SUCCESS [0.494s]
[INFO] Maven IT EAR Plugin Stub .......................... SUCCESS [0.459s]
[INFO] Maven IT EJB Plugin Stub .......................... SUCCESS [0.429s]
[INFO] Maven IT Install Plugin Stub ...................... SUCCESS [0.483s]
[INFO] Maven IT JAR Plugin Stub .......................... SUCCESS [0.441s]
[INFO] Maven IT Javadoc Plugin Stub ...................... SUCCESS [0.355s]
[INFO] Maven IT Plugin Plugin Stub ....................... SUCCESS [0.405s]
[INFO] Maven IT RAR Plugin Stub .......................... SUCCESS [0.372s]
[INFO] Maven IT Resources Plugin Stub .................... SUCCESS [0.500s]
[INFO] Maven IT Site Plugin Stub ......................... SUCCESS [0.437s]
[INFO] Maven IT Source Plugin Stub ....................... SUCCESS [0.414s]
[INFO] Maven IT Surefire Plugin Stub ..................... SUCCESS [0.440s]
[INFO] Maven IT WAR Plugin Stub .......................... SUCCESS [0.460s]
[INFO] Maven IT Plugin :: Dependency Collection .......... SUCCESS [0.655s]
[INFO] Maven IT Plugin :: Dependency Resolution .......... SUCCESS [0.582s]
[INFO] Maven IT Plugin :: Expression ..................... SUCCESS [0.792s]
[INFO] Maven IT Plugin :: Error Mojos .................... SUCCESS [0.332s]
[INFO] Maven IT Component ................................ SUCCESS [0.642s]
[INFO] Maven IT Plugin :: Extension Consumer ............. SUCCESS [0.361s]
[INFO] Maven IT Plugin :: Extension Provider ............. SUCCESS [0.352s]
[INFO] Maven IT Plugin :: Fork ........................... SUCCESS [0.416s]
[INFO] Maven IT Plugin :: Invalid Descriptor ............. SUCCESS [0.622s]
[INFO] Maven IT Plugin :: Log File ....................... SUCCESS [0.411s]
[INFO] Maven IT Plugin :: No Default Component ........... SUCCESS [0.313s]
[INFO] Maven IT Plugin :: No Project ..................... SUCCESS [0.343s]
[INFO] Maven IT Plugin :: Online ......................... SUCCESS [0.369s]
[INFO] Maven IT Plugin :: Optional Mojos ................. SUCCESS [0.444s]
[INFO] Maven IT Plugin :: Packaging ...................... SUCCESS [0.387s]
[INFO] Maven IT Plugin :: Parameter Implementation ....... SUCCESS [0.399s]
[INFO] Maven IT Plugin :: Plugin Dependency .............. SUCCESS [0.743s]
[INFO] Maven IT Plugin :: Project ........................ SUCCESS [0.519s]
[INFO] Maven IT Helper Library ........................... SUCCESS [1.365s]
[INFO] Maven IT Plugin :: Project Interpolation .......... SUCCESS [0.792s]
[INFO] Maven IT Plugin :: Setter ......................... SUCCESS [0.337s]
[INFO] Maven IT Plugin :: Singleton Component ............ SUCCESS [0.390s]
[INFO] Maven IT Plugin :: Site ........................... SUCCESS [0.575s]
[INFO] Maven IT Plugin :: Toolchain ...................... SUCCESS [1.575s]
[INFO] Maven IT Plugin :: Touch .......................... SUCCESS [0.960s]
[INFO] Maven IT Plugin :: Uses Properties Plugin ......... SUCCESS [0.377s]
[INFO] Maven IT Plugin :: Uses Wagon Plugin .............. SUCCESS [1.075s]
[INFO] Maven IT Plugin :: This plugin should contain the mojos needed by all tests.  SUCCESS
[0.380s]
[INFO] Maven IT Plugin :: Plexus Utils 1.1 ............... SUCCESS [0.730s]
[INFO] Maven IT Plugin :: Plexus Utils New ............... SUCCESS [0.627s]
[INFO] Maven IT Plugin :: Plexus Component API ........... SUCCESS [0.721s]
[INFO] Maven IT Plugin :: Log4J Client ................... SUCCESS [0.347s]
[INFO] maven-it-plugin-extension1 ........................ SUCCESS [0.299s]
[INFO] maven-it-plugin-extension2 ........................ SUCCESS [0.288s]
[INFO] Maven IT Toolchain ................................ SUCCESS [0.972s]
[INFO] Maven IT Wagon .................................... SUCCESS [0.962s]
[INFO] Maven IT Support Artifacts ........................ SUCCESS [0.389s]
[INFO] Maven IT Extension ................................ SUCCESS [0.647s]
[INFO] Maven ITs ......................................... FAILURE [1:03:42.097s]
[INFO] ------------------------------------------------------------------------
[INFO] BUILD FAILURE
[INFO] ------------------------------------------------------------------------
[INFO] Total time: 1:04:23.150s
[INFO] Finished at: Sun Jul 31 13:14:19 PDT 2011
[INFO] Final Memory: 27M/758M
[INFO] ------------------------------------------------------------------------
[ERROR] Failed to execute goal org.apache.maven.plugins:maven-surefire-plugin:2.9:test (default-test)
on project core-it-suite: There are test failures.
[ERROR] 
[ERROR] Please refer to <https://builds.apache.org/job/core-integration-testing-maven-3-trunk-osx/ws/core-integration-testing-trunk/core-it-suite/target/surefire-reports>
for the individual test results.
[ERROR] -> [Help 1]
[ERROR] 
[ERROR] To see the full stack trace of the errors, re-run Maven with the -e switch.
[ERROR] Re-run Maven using the -X switch to enable full debug logging.
[ERROR] 
[ERROR] For more information about the errors and possible solutions, please read the following
articles:
[ERROR] [Help 1] http://cwiki.apache.org/confluence/display/MAVEN/MojoFailureException
[ERROR] 
[ERROR] After correcting the problems, you can resume the build with the command
[ERROR]   mvn <goals> -rf :core-it-suite
Recording test results


Mime
View raw message