maven-notifications mailing list archives

Site index · List index
Message view « Date » · « Thread »
Top « Date » · « Thread »
From Apache Jenkins Server <jenk...@builds.apache.org>
Subject Build failed in Jenkins: maven-plugins-ITs-m3 #171
Date Fri, 05 Aug 2011 19:35:53 GMT
See <https://builds.apache.org/job/maven-plugins-ITs-m3/171/changes>

Changes:

[rfscholte] Make xml inside javadoc easier to read

------------------------------------------
[...truncated 8499 lines...]
[INFO] Copying 1 resource
[INFO] Copying 3 resources
[INFO] 
[INFO] --- maven-compiler-plugin:2.3.2:testCompile (default-testCompile) @ maven-remote-resources-plugin
---
[INFO] Compiling 17 source files to /x1/jenkins/jenkins-slave/workspace/maven-plugins-ITs-m3/maven-remote-resources-plugin/target/test-classes
Tests run: 1, Failures: 0, Errors: 0, Skipped: 0, Time elapsed: 20.83 sec
Running org.apache.maven.report.projectinfo.PluginManagementReportTest
Tests run: 1, Failures: 0, Errors: 0, Skipped: 0, Time elapsed: 0.104 sec
Running org.apache.maven.report.projectinfo.ModulesReportTest
[INFO] 
[INFO] --- maven-surefire-plugin:2.7.2:test (default-test) @ maven-remote-resources-plugin
---
[INFO] Surefire report directory: /x1/jenkins/jenkins-slave/workspace/maven-plugins-ITs-m3/maven-remote-resources-plugin/target/surefire-reports

-------------------------------------------------------
 T E S T S
-------------------------------------------------------
Running org.apache.maven.plugin.resources.remote.RemoteResourcesMojoTest
Tests run: 1, Failures: 0, Errors: 0, Skipped: 0, Time elapsed: 1.054 sec
Running org.apache.maven.report.projectinfo.DependencyManagementReportTest
[INFO] artifact junit:junit: checking for updates from central
Tests run: 8, Failures: 0, Errors: 0, Skipped: 0, Time elapsed: 0.942 sec

Results :

Tests run: 8, Failures: 0, Errors: 0, Skipped: 0

[INFO] 
[INFO] --- maven-jar-plugin:2.3.1:jar (default-jar) @ maven-remote-resources-plugin ---
[INFO] Building jar: /x1/jenkins/jenkins-slave/workspace/maven-plugins-ITs-m3/maven-remote-resources-plugin/target/maven-remote-resources-plugin-1.3-SNAPSHOT.jar
[INFO] 
[INFO] --- maven-plugin-plugin:2.7:addPluginArtifactMetadata (default-addPluginArtifactMetadata)
@ maven-remote-resources-plugin ---
[INFO] 
[INFO] --- maven-invoker-plugin:1.5:install (install-descriptor) @ maven-remote-resources-plugin
---
[INFO] Installing /x1/jenkins/jenkins-slave/workspace/maven-plugins-ITs-m3/maven-remote-resources-plugin/pom.xml
to /x1/jenkins/jenkins-slave/workspace/maven-plugins-ITs-m3/maven-remote-resources-plugin/target/it-repo/org/apache/maven/plugins/maven-remote-resources-plugin/1.3-SNAPSHOT/maven-remote-resources-plugin-1.3-SNAPSHOT.pom
[INFO] Installing /x1/jenkins/jenkins-slave/workspace/maven-plugins-ITs-m3/maven-remote-resources-plugin/target/maven-remote-resources-plugin-1.3-SNAPSHOT.jar
to /x1/jenkins/jenkins-slave/workspace/maven-plugins-ITs-m3/maven-remote-resources-plugin/target/it-repo/org/apache/maven/plugins/maven-remote-resources-plugin/1.3-SNAPSHOT/maven-remote-resources-plugin-1.3-SNAPSHOT.jar
[INFO] 
[INFO] --- maven-failsafe-plugin:2.9:integration-test (integration-tests) @ maven-remote-resources-plugin
---
[INFO] Failsafe report directory: /x1/jenkins/jenkins-slave/workspace/maven-plugins-ITs-m3/maven-remote-resources-plugin/target/failsafe-reports

-------------------------------------------------------
 T E S T S
-------------------------------------------------------
Running org.apache.maven.plugin.resources.remote.it.IT_CustomFilterDelimiter
Tests run: 1, Failures: 0, Errors: 0, Skipped: 0, Time elapsed: 1.053 sec
Running org.apache.maven.report.projectinfo.ScmReportTest
Tests run: 2, Failures: 0, Errors: 0, Skipped: 0, Time elapsed: 0.251 sec
Running org.apache.maven.report.projectinfo.ProjectInfoReportUtilsTest
2011-08-05 19:33:30.04::INFO:  Logging to STDERR via org.mortbay.log.StdErrLog
2011-08-05 19:33:30.041::INFO:  jetty-6.1.5
2011-08-05 19:33:30.160::INFO:  NO JSP Support for /, did not find org.apache.jasper.servlet.JspServlet
2011-08-05 19:33:30.176:/:INFO:  default: init
2011-08-05 19:33:30.177:/:INFO:  jsp: init
2011-08-05 19:33:30.185::INFO:  Started SelectChannelConnector@0.0.0.0:54393
2011-08-05 19:33:30.227:/:INFO:  jsp: destroy
2011-08-05 19:33:30.227:/:INFO:  default: destroy
[INFO] ..SUCCESS (6.5 s)
[INFO] Building: MSITE-504/pom.xml
2011-08-05 19:33:30.334::INFO:  jetty-6.1.5
2011-08-05 19:33:30.351::INFO:  NO JSP Support for /, did not find org.apache.jasper.servlet.JspServlet
2011-08-05 19:33:30.355:/:INFO:  default: init
2011-08-05 19:33:30.359:/:INFO:  jsp: init
2011-08-05 19:33:30.359::INFO:  Started SelectChannelConnector@0.0.0.0:52515
2011-08-05 19:33:30.364:/:INFO:  jsp: destroy
2011-08-05 19:33:30.364:/:INFO:  default: destroy
2011-08-05 19:33:30.469::INFO:  jetty-6.1.5
2011-08-05 19:33:30.481::INFO:  NO JSP Support for /, did not find org.apache.jasper.servlet.JspServlet
2011-08-05 19:33:30.484:/:INFO:  default: init
2011-08-05 19:33:30.484:/:INFO:  jsp: init
2011-08-05 19:33:30.767::INFO:  Started SslSocketConnector@0.0.0.0:37426
2011-08-05 19:33:31.851:/:INFO:  jsp: destroy
2011-08-05 19:33:31.851:/:INFO:  default: destroy
2011-08-05 19:33:31.953::INFO:  jetty-6.1.5
2011-08-05 19:33:31.963::INFO:  NO JSP Support for /, did not find org.apache.jasper.servlet.JspServlet
2011-08-05 19:33:31.965:/:INFO:  default: init
2011-08-05 19:33:31.965:/:INFO:  jsp: init
2011-08-05 19:33:31.967::INFO:  Started SslSocketConnector@0.0.0.0:38364
2011-08-05 19:33:31.984:/:INFO:  jsp: destroy
2011-08-05 19:33:31.984:/:INFO:  default: destroy
Tests run: 1, Failures: 0, Errors: 0, Skipped: 0, Time elapsed: 1.132 sec

Results :

Tests run: 18, Failures: 0, Errors: 0, Skipped: 0

2011-08-05 19:33:31.088::INFO:  Shutdown hook executing
2011-08-05 19:33:31.088::INFO:  Shutdown hook complete
2011-08-05 19:33:32.088::INFO:  Shutdown hook complete
2011-08-05 19:33:33.088::INFO:  Shutdown hook complete
2011-08-05 19:33:34.992::INFO:  Shutdown hook complete
[INFO] 
[INFO] --- maven-jar-plugin:2.3.1:jar (default-jar) @ maven-project-info-reports-plugin ---
[INFO] Building jar: /x1/jenkins/jenkins-slave/workspace/maven-plugins-ITs-m3/maven-project-info-reports-plugin/target/maven-project-info-reports-plugin-2.4.1-SNAPSHOT.jar
[INFO] 
[INFO] --- maven-plugin-plugin:2.7:addPluginArtifactMetadata (default-addPluginArtifactMetadata)
@ maven-project-info-reports-plugin ---
[INFO] 
[INFO] --- maven-jarsigner-plugin:1.2:sign (sign) @ maven-project-info-reports-plugin ---
[INFO] 1 archive(s) processed
[INFO] 
[INFO] --- maven-invoker-plugin:1.5:install (integration-test) @ maven-project-info-reports-plugin
---
[INFO] Installing /x1/jenkins/jenkins-slave/workspace/maven-plugins-ITs-m3/maven-project-info-reports-plugin/pom.xml
to /x1/jenkins/jenkins-slave/workspace/maven-plugins-ITs-m3/maven-project-info-reports-plugin/target/local-repo/org/apache/maven/plugins/maven-project-info-reports-plugin/2.4.1-SNAPSHOT/maven-project-info-reports-plugin-2.4.1-SNAPSHOT.pom
[INFO] Installing /x1/jenkins/jenkins-slave/workspace/maven-plugins-ITs-m3/maven-project-info-reports-plugin/target/maven-project-info-reports-plugin-2.4.1-SNAPSHOT.jar
to /x1/jenkins/jenkins-slave/workspace/maven-plugins-ITs-m3/maven-project-info-reports-plugin/target/local-repo/org/apache/maven/plugins/maven-project-info-reports-plugin/2.4.1-SNAPSHOT/maven-project-info-reports-plugin-2.4.1-SNAPSHOT.jar
[INFO] 
[INFO] --- maven-invoker-plugin:1.5:run (integration-test) @ maven-project-info-reports-plugin
---
[INFO] Building: full-pom/pom.xml
[INFO] ..SUCCESS (48.4 s)
[INFO] Building: MSITE-512/pom.xml
[INFO] ..SUCCESS (4.8 s)
[INFO] Building: top-parent-no-site/pom.xml
[INFO] ..SUCCESS (4.9 s)
[INFO] -------------------------------------------------
[INFO] Build Summary:
[INFO]   Passed: 35, Failed: 0, Errors: 0, Skipped: 1
[INFO] -------------------------------------------------
[INFO] 
[INFO] --- maven-install-plugin:2.3.1:install (default-install) @ maven-site-plugin ---
[INFO] Installing /x1/jenkins/jenkins-slave/workspace/maven-plugins-ITs-m3/maven-site-plugin/target/maven-site-plugin-3.1-SNAPSHOT.jar
to /home/jenkins/.m2/repository/org/apache/maven/plugins/maven-site-plugin/3.1-SNAPSHOT/maven-site-plugin-3.1-SNAPSHOT.jar
[INFO] Installing /x1/jenkins/jenkins-slave/workspace/maven-plugins-ITs-m3/maven-site-plugin/dependency-reduced-pom.xml
to /home/jenkins/.m2/repository/org/apache/maven/plugins/maven-site-plugin/3.1-SNAPSHOT/maven-site-plugin-3.1-SNAPSHOT.pom
[INFO]                                                                         
[INFO] ------------------------------------------------------------------------
[INFO] Building Maven Plugins Aggregator 1-SNAPSHOT
[INFO] ------------------------------------------------------------------------
[WARNING] *****************************************************************
[WARNING] * Your build is requesting parallel execution, but project      *
[WARNING] * contains the following plugin(s) that are not marked as       *
[WARNING] * @threadSafe to support parallel building.                     *
[WARNING] * While this /may/ work fine, please look for plugin updates    *
[WARNING] * and/or request plugins be made thread-safe.                   *
[WARNING] * If reporting an issue, report it against the plugin in        *
[WARNING] * question, not against maven-core                              *
[WARNING] *****************************************************************
[WARNING] The following plugins are not marked @threadSafe in Maven Plugins Aggregator:
[WARNING] org.apache.maven.plugins:maven-remote-resources-plugin:1.1
[WARNING] *****************************************************************
[INFO] 
[INFO] --- maven-clean-plugin:2.4.1:clean (default-clean) @ maven-plugins-aggregator ---
[INFO] Deleting /x1/jenkins/jenkins-slave/workspace/maven-plugins-ITs-m3/target
[INFO] 
[INFO] --- maven-remote-resources-plugin:1.1:process (default) @ maven-plugins-aggregator
---
[INFO] 
[INFO] --- maven-install-plugin:2.3.1:install (default-install) @ maven-plugins-aggregator
---
[INFO] Installing /x1/jenkins/jenkins-slave/workspace/maven-plugins-ITs-m3/pom.xml to /home/jenkins/.m2/repository/org/apache/maven/plugins/maven-plugins-aggregator/1-SNAPSHOT/maven-plugins-aggregator-1-SNAPSHOT.pom
[INFO] ..SUCCESS (95.0 s)
[INFO] Building: minimal-pom/pom.xml
[INFO] ..SUCCESS (16.1 s)
[INFO] -------------------------------------------------
[INFO] Build Summary:
[INFO]   Passed: 2, Failed: 0, Errors: 0, Skipped: 0
[INFO] -------------------------------------------------
[INFO] 
[INFO] --- maven-jarsigner-plugin:1.2:verify (verify) @ maven-project-info-reports-plugin
---
[INFO] 1 archive(s) processed
[INFO] 
[INFO] --- maven-install-plugin:2.3.1:install (default-install) @ maven-project-info-reports-plugin
---
[INFO] Installing /x1/jenkins/jenkins-slave/workspace/maven-plugins-ITs-m3/maven-project-info-reports-plugin/target/maven-project-info-reports-plugin-2.4.1-SNAPSHOT.jar
to /home/jenkins/.m2/repository/org/apache/maven/plugins/maven-project-info-reports-plugin/2.4.1-SNAPSHOT/maven-project-info-reports-plugin-2.4.1-SNAPSHOT.jar
[INFO] Installing /x1/jenkins/jenkins-slave/workspace/maven-plugins-ITs-m3/maven-project-info-reports-plugin/pom.xml
to /home/jenkins/.m2/repository/org/apache/maven/plugins/maven-project-info-reports-plugin/2.4.1-SNAPSHOT/maven-project-info-reports-plugin-2.4.1-SNAPSHOT.pom
Tests run: 1, Failures: 0, Errors: 0, Skipped: 0, Time elapsed: 120.573 sec
Running org.apache.maven.plugin.resources.remote.it.IT_FilterLocalOverride
Tests run: 1, Failures: 0, Errors: 0, Skipped: 0, Time elapsed: 2.078 sec
Running org.apache.maven.plugin.resources.remote.it.IT_GenerateFromOverride
Tests run: 1, Failures: 0, Errors: 0, Skipped: 0, Time elapsed: 2.089 sec
Running org.apache.maven.plugin.resources.remote.it.IT_SupplementalArtifact
Tests run: 1, Failures: 0, Errors: 0, Skipped: 0, Time elapsed: 5.044 sec
Running org.apache.maven.plugin.resources.remote.it.IT_RunOnlyAtExecutionRoot
Tests run: 1, Failures: 0, Errors: 0, Skipped: 0, Time elapsed: 4.798 sec
Running org.apache.maven.plugin.resources.remote.it.IT_GetDependencyProjects
Tests run: 1, Failures: 0, Errors: 0, Skipped: 0, Time elapsed: 4.672 sec
Running org.apache.maven.plugin.resources.remote.it.IT_GenerateFromBundle
Tests run: 1, Failures: 0, Errors: 0, Skipped: 0, Time elapsed: 1.892 sec
Running org.apache.maven.plugin.resources.remote.it.IT_BadDependencyPoms
Tests run: 1, Failures: 0, Errors: 0, Skipped: 0, Time elapsed: 2.299 sec

Results :

Tests run: 8, Failures: 0, Errors: 0, Skipped: 0

[WARNING] File encoding has not been set, using platform encoding ANSI_X3.4-1968, i.e. build
is platform dependent!
[INFO] 
[INFO] --- maven-failsafe-plugin:2.9:verify (integration-tests) @ maven-remote-resources-plugin
---
[INFO] Failsafe report directory: /x1/jenkins/jenkins-slave/workspace/maven-plugins-ITs-m3/maven-remote-resources-plugin/target/failsafe-reports
[WARNING] File encoding has not been set, using platform encoding ANSI_X3.4-1968, i.e. build
is platform dependent!
[INFO] 
[INFO] --- maven-install-plugin:2.3.1:install (default-install) @ maven-remote-resources-plugin
---
[INFO] Installing /x1/jenkins/jenkins-slave/workspace/maven-plugins-ITs-m3/maven-remote-resources-plugin/target/maven-remote-resources-plugin-1.3-SNAPSHOT.jar
to /home/jenkins/.m2/repository/org/apache/maven/plugins/maven-remote-resources-plugin/1.3-SNAPSHOT/maven-remote-resources-plugin-1.3-SNAPSHOT.jar
[INFO] Installing /x1/jenkins/jenkins-slave/workspace/maven-plugins-ITs-m3/maven-remote-resources-plugin/pom.xml
to /home/jenkins/.m2/repository/org/apache/maven/plugins/maven-remote-resources-plugin/1.3-SNAPSHOT/maven-remote-resources-plugin-1.3-SNAPSHOT.pom
[INFO] ------------------------------------------------------------------------
[INFO] Reactor Summary:
[INFO] 
[INFO] Maven Plugins ..................................... SUCCESS [2.612s]
[INFO] Maven ACR Plugin .................................. SUCCESS [21.142s]
[INFO] Maven Ant Plugin .................................. SUCCESS [1:06.180s]
[INFO] Maven AntRun Plugin ............................... SUCCESS [48.341s]
[INFO] Maven Eclipse Plugin .............................. SUCCESS [13:21.747s]
[INFO] Maven Assembly Plugin ............................. FAILURE [11:12.508s]
[INFO] Maven Changelog Plugin ............................ SUCCESS [1:07.526s]
[INFO] Maven Changes Report Plugin ....................... SUCCESS [1:18.824s]
[INFO] Maven Checkstyle Plugin ........................... SUCCESS [1:10.541s]
[INFO] Maven Clean Plugin ................................ SUCCESS [13.329s]
[INFO] Maven Compiler Plugin ............................. SUCCESS [15.652s]
[INFO] Maven Dependency Plugin ........................... SUCCESS [1:41.982s]
[INFO] Maven Deploy Plugin ............................... SUCCESS [49.101s]
[INFO] Maven DOAP Plugin ................................. SUCCESS [24.553s]
[INFO] Maven Documentation Checker Plugin ................ SUCCESS [4.679s]
[INFO] Maven EAR Plugin .................................. SUCCESS [3:08.010s]
[INFO] Maven EJB Plugin .................................. SUCCESS [20.227s]
[INFO] Maven GPG Plugin .................................. SUCCESS [15.817s]
[INFO] Maven Help Plugin ................................. SUCCESS [32.272s]
[INFO] Maven IDEA Plugin ................................. SUCCESS [5.175s]
[INFO] Maven Install Plugin .............................. SUCCESS [30.742s]
[INFO] Maven JAR Plugin .................................. SUCCESS [54.196s]
[INFO] Maven Jarsigner Plugin ............................ SUCCESS [23.801s]
[INFO] Maven Javadoc Plugin .............................. SUCCESS [8:28.014s]
[INFO] Maven Linkcheck Plugin ............................ SUCCESS [1.431s]
[INFO] Maven One Plugin .................................. SUCCESS [1.992s]
[INFO] Maven Patch Plugin ................................ SUCCESS [10.052s]
[INFO] Maven PDF Plugin .................................. SUCCESS [19.441s]
[INFO] Maven PMD Plugin .................................. SUCCESS [42.444s]
[INFO] Maven RAR Plugin .................................. SUCCESS [5.989s]
[INFO] Maven Reactor Plugin .............................. SUCCESS [2.442s]
[INFO] Maven Repository Plugin ........................... SUCCESS [3:21.786s]
[INFO] Maven Resources Plugin ............................ SUCCESS [40.353s]
[INFO] Maven Shade Plugin ................................ SUCCESS [1:37.398s]
[INFO] Maven Site Plugin 3 ............................... SUCCESS [6:18.908s]
[INFO] Maven Source Plugin ............................... SUCCESS [23.595s]
[INFO] Maven Stage Plugin ................................ SUCCESS [1.589s]
[INFO] Maven Toolchains Plugin ........................... SUCCESS [1.111s]
[INFO] Maven Verifier Plugin ............................. SUCCESS [6.729s]
[INFO] Maven WAR Plugin .................................. SUCCESS [52.547s]
[INFO] Maven Invoker Plugin .............................. SUCCESS [3:07.752s]
[INFO] Maven Project Info Reports Plugin ................. SUCCESS [2:29.938s]
[INFO] Maven Remote Resources Plugin ..................... SUCCESS [2:27.252s]
[INFO] Maven Plugins Aggregator .......................... SUCCESS [0.027s]
[INFO] ------------------------------------------------------------------------
[INFO] BUILD FAILURE
[INFO] ------------------------------------------------------------------------
[INFO] Total time: 24:35.067s (Wall Clock)
[INFO] Finished at: Fri Aug 05 19:35:53 GMT 2011
[INFO] Final Memory: 62M/998M
[INFO] ------------------------------------------------------------------------
[WARNING] The requested profile "apache.snapshots" could not be activated because it does
not exist.
[ERROR] Failed to execute goal org.apache.maven.plugins:maven-invoker-plugin:1.5:run (integration-test)
on project maven-assembly-plugin: 17 builds failed. -> [Help 1]
[ERROR] 
[ERROR] To see the full stack trace of the errors, re-run Maven with the -e switch.
[ERROR] Re-run Maven using the -X switch to enable full debug logging.
[ERROR] 
[ERROR] For more information about the errors and possible solutions, please read the following
articles:
[ERROR] [Help 1] http://cwiki.apache.org/confluence/display/MAVEN/MojoFailureException
[ERROR] 
[ERROR] After correcting the problems, you can resume the build with the command
[ERROR]   mvn <goals> -rf :maven-assembly-plugin


Mime
View raw message