maven-notifications mailing list archives

Site index · List index
Message view « Date » · « Thread »
Top « Date » · « Thread »
From Apache Jenkins Server <jenk...@builds.apache.org>
Subject Build failed in Jenkins: doxia-sitetools » JDK 1.5 (latest),Ubuntu #87
Date Tue, 18 Oct 2011 17:50:06 GMT
See <https://builds.apache.org/job/doxia-sitetools/./jdk=JDK%201.5%20(latest),label=Ubuntu/87/>

------------------------------------------
[...truncated 132 lines...]
[INFO] Using 'UTF-8' encoding to copy filtered resources.
[INFO] skip non existing resourceDirectory <https://builds.apache.org/job/doxia-sitetools/./jdk=JDK%201.5%20(latest),label=Ubuntu/ws/doxia-decoration-model/src/main/resources>
[INFO] Copying 1 resource
[INFO] Copying 3 resources
[INFO] Copying 3 resources
[INFO] [compiler:compile {execution: default-compile}]
[INFO] Compiling 12 source files to <https://builds.apache.org/job/doxia-sitetools/./jdk=JDK%201.5%20(latest),label=Ubuntu/ws/doxia-decoration-model/target/classes>
[INFO] [clirr:check {execution: default}]
[INFO] Comparing to version: 1.1
[INFO] Succeeded with 0 errors; 0 warnings; and 0 other changes.
[INFO] [install:install {execution: default-install}]
[INFO] Installing <https://builds.apache.org/job/doxia-sitetools/./jdk=JDK%201.5%20(latest),label=Ubuntu/ws/doxia-decoration-model/target/doxia-decoration-model-1.2.1-SNAPSHOT.jar>
to /home/jenkins/.m2/repository/org/apache/maven/doxia/doxia-decoration-model/1.2.1-SNAPSHOT/doxia-decoration-model-1.2.1-SNAPSHOT.jar
[INFO] ------------------------------------------------------------------------
[INFO] Building Document Renderer
[INFO]    task-segment: [clean, install]
[INFO] ------------------------------------------------------------------------
[INFO] [clean:clean {execution: default-clean}]
[INFO] Deleting <https://builds.apache.org/job/doxia-sitetools/./jdk=JDK%201.5%20(latest),label=Ubuntu/ws/doxia-doc-renderer/target>
[INFO] [remote-resources:process {execution: default}]
[INFO] snapshot org.apache.maven.doxia:doxia-core:1.3-SNAPSHOT: checking for updates from
apache.snapshots
Downloading: http://repository.apache.org/snapshots/org/apache/maven/doxia/doxia-core/1.3-SNAPSHOT/doxia-core-1.3-20111014.114523-2.pom
3K downloaded  (doxia-core-1.3-20111014.114523-2.pom)
[INFO] snapshot org.apache.maven.doxia:doxia:1.3-SNAPSHOT: checking for updates from apache.snapshots
Downloading: http://repository.apache.org/snapshots/org/apache/maven/doxia/doxia/1.3-SNAPSHOT/doxia-1.3-20111014.114523-2.pom
16K downloaded  (doxia-1.3-20111014.114523-2.pom)
[INFO] snapshot org.apache.maven.doxia:doxia-sink-api:1.3-SNAPSHOT: checking for updates from
apache.snapshots
Downloading: http://repository.apache.org/snapshots/org/apache/maven/doxia/doxia-sink-api/1.3-SNAPSHOT/doxia-sink-api-1.3-20111014.114523-2.pom
1K downloaded  (doxia-sink-api-1.3-20111014.114523-2.pom)
[INFO] snapshot org.apache.maven.doxia:doxia-logging-api:1.3-SNAPSHOT: checking for updates
from apache.snapshots
Downloading: http://repository.apache.org/snapshots/org/apache/maven/doxia/doxia-logging-api/1.3-SNAPSHOT/doxia-logging-api-1.3-20111014.114523-2.pom
1K downloaded  (doxia-logging-api-1.3-20111014.114523-2.pom)
[INFO] snapshot org.apache.maven.doxia:doxia-module-itext:1.3-SNAPSHOT: checking for updates
from apache.snapshots
Downloading: http://repository.apache.org/snapshots/org/apache/maven/doxia/doxia-module-itext/1.3-SNAPSHOT/doxia-module-itext-1.3-20111014.114523-2.pom
2K downloaded  (doxia-module-itext-1.3-20111014.114523-2.pom)
[INFO] snapshot org.apache.maven.doxia:doxia-modules:1.3-SNAPSHOT: checking for updates from
apache.snapshots
Downloading: http://repository.apache.org/snapshots/org/apache/maven/doxia/doxia-modules/1.3-SNAPSHOT/doxia-modules-1.3-20111014.114523-2.pom
2K downloaded  (doxia-modules-1.3-20111014.114523-2.pom)
[INFO] snapshot org.apache.maven.doxia:doxia-module-fo:1.3-SNAPSHOT: checking for updates
from apache.snapshots
Downloading: http://repository.apache.org/snapshots/org/apache/maven/doxia/doxia-module-fo/1.3-SNAPSHOT/doxia-module-fo-1.3-20111014.114523-2.pom
3K downloaded  (doxia-module-fo-1.3-20111014.114523-2.pom)
[INFO] snapshot org.apache.maven.doxia:doxia-module-apt:1.3-SNAPSHOT: checking for updates
from apache.snapshots
Downloading: http://repository.apache.org/snapshots/org/apache/maven/doxia/doxia-module-apt/1.3-SNAPSHOT/doxia-module-apt-1.3-20111014.114523-2.pom
2K downloaded  (doxia-module-apt-1.3-20111014.114523-2.pom)
[INFO] snapshot org.apache.maven.doxia:doxia-module-fml:1.3-SNAPSHOT: checking for updates
from apache.snapshots
Downloading: http://repository.apache.org/snapshots/org/apache/maven/doxia/doxia-module-fml/1.3-SNAPSHOT/doxia-module-fml-1.3-20111014.114523-2.pom
5K downloaded  (doxia-module-fml-1.3-20111014.114523-2.pom)
[INFO] snapshot org.apache.maven.doxia:doxia-module-xdoc:1.3-SNAPSHOT: checking for updates
from apache.snapshots
Downloading: http://repository.apache.org/snapshots/org/apache/maven/doxia/doxia-module-xdoc/1.3-SNAPSHOT/doxia-module-xdoc-1.3-20111014.114523-2.pom
5K downloaded  (doxia-module-xdoc-1.3-20111014.114523-2.pom)
[INFO] snapshot org.apache.maven.doxia:doxia-module-xhtml:1.3-SNAPSHOT: checking for updates
from apache.snapshots
Downloading: http://repository.apache.org/snapshots/org/apache/maven/doxia/doxia-module-xhtml/1.3-SNAPSHOT/doxia-module-xhtml-1.3-20111014.114523-2.pom
1K downloaded  (doxia-module-xhtml-1.3-20111014.114523-2.pom)
Downloading: http://repository.apache.org/snapshots/org/apache/maven/doxia/doxia-core/1.3-SNAPSHOT/doxia-core-1.3-20111014.114523-2.jar
150K downloaded  (doxia-core-1.3-20111014.114523-2.jar)
Downloading: http://repository.apache.org/snapshots/org/apache/maven/doxia/doxia-sink-api/1.3-SNAPSHOT/doxia-sink-api-1.3-20111014.114523-2.jar
10K downloaded  (doxia-sink-api-1.3-20111014.114523-2.jar)
Downloading: http://repository.apache.org/snapshots/org/apache/maven/doxia/doxia-logging-api/1.3-SNAPSHOT/doxia-logging-api-1.3-20111014.114523-2.jar
11K downloaded  (doxia-logging-api-1.3-20111014.114523-2.jar)
Downloading: http://repository.apache.org/snapshots/org/apache/maven/doxia/doxia-module-itext/1.3-SNAPSHOT/doxia-module-itext-1.3-20111014.114523-2.jar
26K downloaded  (doxia-module-itext-1.3-20111014.114523-2.jar)
Downloading: http://repository.apache.org/snapshots/org/apache/maven/doxia/doxia-module-fo/1.3-SNAPSHOT/doxia-module-fo-1.3-20111014.114523-2.jar
60K downloaded  (doxia-module-fo-1.3-20111014.114523-2.jar)
Downloading: http://repository.apache.org/snapshots/org/apache/maven/doxia/doxia-module-apt/1.3-SNAPSHOT/doxia-module-apt-1.3-20111014.114523-2.jar
50K downloaded  (doxia-module-apt-1.3-20111014.114523-2.jar)
Downloading: http://repository.apache.org/snapshots/org/apache/maven/doxia/doxia-module-fml/1.3-SNAPSHOT/doxia-module-fml-1.3-20111014.114523-2.jar
36K downloaded  (doxia-module-fml-1.3-20111014.114523-2.jar)
Downloading: http://repository.apache.org/snapshots/org/apache/maven/doxia/doxia-module-xdoc/1.3-SNAPSHOT/doxia-module-xdoc-1.3-20111014.114523-2.jar
35K downloaded  (doxia-module-xdoc-1.3-20111014.114523-2.jar)
Downloading: http://repository.apache.org/snapshots/org/apache/maven/doxia/doxia-module-xhtml/1.3-SNAPSHOT/doxia-module-xhtml-1.3-20111014.114523-2.jar
14K downloaded  (doxia-module-xhtml-1.3-20111014.114523-2.jar)
[debug] execute contextualize
[INFO] [resources:resources {execution: default-resources}]
[INFO] Using 'UTF-8' encoding to copy filtered resources.
[INFO] Copying 1 resource
[INFO] skip non existing resourceDirectory <https://builds.apache.org/job/doxia-sitetools/./jdk=JDK%201.5%20(latest),label=Ubuntu/ws/doxia-doc-renderer/target/generated-site/xsd>
[INFO] Copying 3 resources
[INFO] [compiler:compile {execution: default-compile}]
[INFO] Compiling 14 source files to <https://builds.apache.org/job/doxia-sitetools/./jdk=JDK%201.5%20(latest),label=Ubuntu/ws/doxia-doc-renderer/target/classes>
[INFO] [plexus:descriptor {execution: default}]
[INFO] Discovered 4 component descriptors(s)
[debug] execute contextualize
[INFO] [resources:testResources {execution: default-testResources}]
[INFO] Using 'UTF-8' encoding to copy filtered resources.
[INFO] Copying 13 resources
[INFO] Copying 3 resources
[INFO] [compiler:testCompile {execution: default-testCompile}]
[INFO] Compiling 1 source file to <https://builds.apache.org/job/doxia-sitetools/./jdk=JDK%201.5%20(latest),label=Ubuntu/ws/doxia-doc-renderer/target/test-classes>
[WARNING] DEPRECATED [systemProperties]: Use systemPropertyVariables instead.
[INFO] [surefire:test {execution: default-test}]
[INFO] Surefire report directory: <https://builds.apache.org/job/doxia-sitetools/./jdk=JDK%201.5%20(latest),label=Ubuntu/ws/doxia-doc-renderer/target/surefire-reports>

-------------------------------------------------------
 T E S T S
-------------------------------------------------------
Running org.apache.maven.doxia.docrenderer.DocumentRendererTest
[WARNING] [iText Sink] Modified invalid link: 'Frequently Asked Questions_How_to_export_in_PDF'
to 'Frequently_Asked_Questions_How_to_export_in_PDF'
[WARNING] [iText Sink] Modified invalid link: 'Frequently Asked Questions_How_to_handle_style_in_the_APT_markup_language'
to 'Frequently_Asked_Questions_How_to_handle_style_in_the_APT_markup_language'
[WARNING] [iText Sink] Modified invalid link: 'Frequently Asked Questions_Is_it_possible_to_create_a_book'
to 'Frequently_Asked_Questions_Is_it_possible_to_create_a_book'
[WARNING] [iText Sink] Modified invalid link: 'Frequently Asked Questions_top' to 'Frequently_Asked_Questions_top'
[WARNING] [iText Sink] Modified invalid link: 'Frequently Asked Questions_How_to_export_in_PDF'
to 'Frequently_Asked_Questions_How_to_export_in_PDF'
[WARNING] [iText Sink] Modified invalid link: 'Frequently Asked Questions_How_to_handle_style_in_the_APT_markup_language'
to 'Frequently_Asked_Questions_How_to_handle_style_in_the_APT_markup_language'
[WARNING] [iText Sink] Modified invalid link: 'Frequently Asked Questions_Is_it_possible_to_create_a_book'
to 'Frequently_Asked_Questions_Is_it_possible_to_create_a_book'
[WARNING] [iText Sink] Modified invalid link: 'Frequently Asked Questions_top' to 'Frequently_Asked_Questions_top'
Tests run: 4, Failures: 0, Errors: 0, Skipped: 0, Time elapsed: 5.787 sec

Results :

Tests run: 4, Failures: 0, Errors: 0, Skipped: 0

[INFO] [jar:jar {execution: default-jar}]
[INFO] Building jar: <https://builds.apache.org/job/doxia-sitetools/./jdk=JDK%201.5%20(latest),label=Ubuntu/ws/doxia-doc-renderer/target/doxia-doc-renderer-1.2.1-SNAPSHOT.jar>
[INFO] Preparing clirr:check
[WARNING] Removing: check from forked lifecycle, to prevent recursive invocation.
[INFO] [remote-resources:process {execution: default}]
[debug] execute contextualize
[INFO] [resources:resources {execution: default-resources}]
[INFO] Using 'UTF-8' encoding to copy filtered resources.
[INFO] Copying 1 resource
[INFO] skip non existing resourceDirectory <https://builds.apache.org/job/doxia-sitetools/./jdk=JDK%201.5%20(latest),label=Ubuntu/ws/doxia-doc-renderer/target/generated-site/xsd>
[INFO] Copying 3 resources
[INFO] Copying 3 resources
[INFO] [compiler:compile {execution: default-compile}]
[INFO] Nothing to compile - all classes are up to date
[INFO] [clirr:check {execution: default}]
[INFO] Comparing to version: 1.1
[INFO] Succeeded with 0 errors; 0 warnings; and 0 other changes.
[INFO] [install:install {execution: default-install}]
[INFO] Installing <https://builds.apache.org/job/doxia-sitetools/./jdk=JDK%201.5%20(latest),label=Ubuntu/ws/doxia-doc-renderer/target/doxia-doc-renderer-1.2.1-SNAPSHOT.jar>
to /home/jenkins/.m2/repository/org/apache/maven/doxia/doxia-doc-renderer/1.2.1-SNAPSHOT/doxia-doc-renderer-1.2.1-SNAPSHOT.jar
[INFO] ------------------------------------------------------------------------
[INFO] Building Site Renderer
[INFO]    task-segment: [clean, install]
[INFO] ------------------------------------------------------------------------
[INFO] [clean:clean {execution: default-clean}]
[INFO] Deleting <https://builds.apache.org/job/doxia-sitetools/./jdk=JDK%201.5%20(latest),label=Ubuntu/ws/doxia-site-renderer/target>
[INFO] [remote-resources:process {execution: default}]
[INFO] snapshot org.apache.maven.doxia:doxia-module-confluence:1.3-SNAPSHOT: checking for
updates from apache.snapshots
Downloading: http://repository.apache.org/snapshots/org/apache/maven/doxia/doxia-module-confluence/1.3-SNAPSHOT/doxia-module-confluence-1.3-20111014.114523-2.pom
2K downloaded  (doxia-module-confluence-1.3-20111014.114523-2.pom)
[INFO] snapshot org.apache.maven.doxia:doxia-module-docbook-simple:1.3-SNAPSHOT: checking
for updates from apache.snapshots
Downloading: http://repository.apache.org/snapshots/org/apache/maven/doxia/doxia-module-docbook-simple/1.3-SNAPSHOT/doxia-module-docbook-simple-1.3-20111014.114523-2.pom
2K downloaded  (doxia-module-docbook-simple-1.3-20111014.114523-2.pom)
Downloading: http://repository.apache.org/snapshots/org/apache/maven/doxia/doxia-module-confluence/1.3-SNAPSHOT/doxia-module-confluence-1.3-20111014.114523-2.jar
50K downloaded  (doxia-module-confluence-1.3-20111014.114523-2.jar)
Downloading: http://repository.apache.org/snapshots/org/apache/maven/doxia/doxia-module-docbook-simple/1.3-SNAPSHOT/doxia-module-docbook-simple-1.3-20111014.114523-2.jar
123K downloaded  (doxia-module-docbook-simple-1.3-20111014.114523-2.jar)
Downloading: http://repository.apache.org/snapshots/org/apache/maven/doxia/doxia-core/1.3-SNAPSHOT/doxia-core-1.3-20111014.114523-2-tests.jar
88K downloaded  (doxia-core-1.3-20111014.114523-2-tests.jar)
[debug] execute contextualize
[INFO] [resources:resources {execution: default-resources}]
[INFO] Using 'UTF-8' encoding to copy filtered resources.
[INFO] Copying 22 resources
[INFO] skip non existing resourceDirectory <https://builds.apache.org/job/doxia-sitetools/./jdk=JDK%201.5%20(latest),label=Ubuntu/ws/doxia-site-renderer/target/generated-site/xsd>
[INFO] Copying 3 resources
[INFO] [compiler:compile {execution: default-compile}]
[INFO] Compiling 8 source files to <https://builds.apache.org/job/doxia-sitetools/./jdk=JDK%201.5%20(latest),label=Ubuntu/ws/doxia-site-renderer/target/classes>
[debug] execute contextualize
[INFO] [resources:testResources {execution: default-testResources}]
[INFO] Using 'UTF-8' encoding to copy filtered resources.
[INFO] Copying 44 resources
[INFO] Copying 3 resources
[INFO] [compiler:testCompile {execution: default-testCompile}]
[INFO] Compiling 12 source files to <https://builds.apache.org/job/doxia-sitetools/./jdk=JDK%201.5%20(latest),label=Ubuntu/ws/doxia-site-renderer/target/test-classes>
[INFO] [surefire:test {execution: default-test}]
[INFO] Surefire report directory: <https://builds.apache.org/job/doxia-sitetools/./jdk=JDK%201.5%20(latest),label=Ubuntu/ws/doxia-site-renderer/target/surefire-reports>

-------------------------------------------------------
 T E S T S
-------------------------------------------------------
Running org.apache.maven.doxia.siterenderer.DefaultSiteRendererTest
[WARNING] [XHTML Sink] No HTML tag found for unknown event: 'note', ignoring!
[WARNING] [XHTML Sink] No HTML tag found for unknown event: 'sidebar', ignoring!
[WARNING] [APT Parser] Ambiguous link: 'cdc.html'. If this is a local link, prepend "./"!
Oct 18, 2011 5:50:05 PM com.gargoylesoftware.htmlunit.javascript.host.Stylesheet loadStylesheet
SEVERE: <https://builds.apache.org/job/doxia-sitetools/./jdk=JDK%201.5%20(latest),label=Ubuntu/ws/doxia-site-renderer/target/output/css/maven-theme.css>
(No such file or directory)
Oct 18, 2011 5:50:05 PM com.gargoylesoftware.htmlunit.javascript.host.Stylesheet loadStylesheet
SEVERE: <https://builds.apache.org/job/doxia-sitetools/./jdk=JDK%201.5%20(latest),label=Ubuntu/ws/doxia-site-renderer/target/output/css/maven-theme.css>
(No such file or directory)
Oct 18, 2011 5:50:05 PM com.gargoylesoftware.htmlunit.javascript.host.Stylesheet loadStylesheet
SEVERE: <https://builds.apache.org/job/doxia-sitetools/./jdk=JDK%201.5%20(latest),label=Ubuntu/ws/doxia-site-renderer/target/output/css/maven-theme.css>
(No such file or directory)
Oct 18, 2011 5:50:05 PM com.gargoylesoftware.htmlunit.javascript.host.Stylesheet loadStylesheet
SEVERE: <https://builds.apache.org/job/doxia-sitetools/./jdk=JDK%201.5%20(latest),label=Ubuntu/ws/doxia-site-renderer/target/output/css/maven-theme.css>
(No such file or directory)
Oct 18, 2011 5:50:05 PM com.gargoylesoftware.htmlunit.javascript.host.Stylesheet loadStylesheet
SEVERE: <https://builds.apache.org/job/doxia-sitetools/./jdk=JDK%201.5%20(latest),label=Ubuntu/ws/doxia-site-renderer/target/output/css/maven-theme.css>
(No such file or directory)
Oct 18, 2011 5:50:05 PM com.gargoylesoftware.htmlunit.javascript.host.Stylesheet loadStylesheet
SEVERE: <https://builds.apache.org/job/doxia-sitetools/./jdk=JDK%201.5%20(latest),label=Ubuntu/ws/doxia-site-renderer/target/output/css/maven-theme.css>
(No such file or directory)
Tests run: 1, Failures: 1, Errors: 0, Skipped: 0, Time elapsed: 36.398 sec <<< FAILURE!

Results :

Failed tests:   testRender(org.apache.maven.doxia.siterenderer.DefaultSiteRendererTest): expected:<[Section_with_]id>
but was:<[subsection-]id>

Tests run: 1, Failures: 1, Errors: 0, Skipped: 0

[INFO] 
[INFO] 
[INFO] ------------------------------------------------------------------------
[INFO] Reactor Summary:
[INFO] ------------------------------------------------------------------------
[INFO] Doxia Sitetools ....................................... SUCCESS [4.669s]
[INFO] Decoration Model ...................................... SUCCESS [6.623s]
[INFO] Document Renderer ..................................... SUCCESS [16.507s]
[INFO] Site Renderer ......................................... FAILED [40.276s]
[INFO] ------------------------------------------------------------------------
[INFO] Error for project: Site Renderer (during install)
[INFO] ------------------------------------------------------------------------
[INFO] There are test failures.

Please refer to <https://builds.apache.org/job/doxia-sitetools/./jdk=JDK%201.5%20(latest),label=Ubuntu/ws/doxia-site-renderer/target/surefire-reports>
for the individual test results.
[INFO] ------------------------------------------------------------------------
[INFO] Trace
org.apache.maven.BuildFailureException: There are test failures.

Please refer to <https://builds.apache.org/job/doxia-sitetools/./jdk=JDK%201.5%20(latest),label=Ubuntu/ws/doxia-site-renderer/target/surefire-reports>
for the individual test results.
	at org.apache.maven.lifecycle.DefaultLifecycleExecutor.executeGoals(DefaultLifecycleExecutor.java:715)
	at org.apache.maven.lifecycle.DefaultLifecycleExecutor.executeGoalWithLifecycle(DefaultLifecycleExecutor.java:556)
	at org.apache.maven.lifecycle.DefaultLifecycleExecutor.executeGoal(DefaultLifecycleExecutor.java:535)
	at org.apache.maven.lifecycle.DefaultLifecycleExecutor.executeGoalAndHandleFailures(DefaultLifecycleExecutor.java:387)
	at org.apache.maven.lifecycle.DefaultLifecycleExecutor.executeTaskSegments(DefaultLifecycleExecutor.java:348)
	at org.apache.maven.lifecycle.DefaultLifecycleExecutor.execute(DefaultLifecycleExecutor.java:180)
	at org.apache.maven.DefaultMaven.doExecute(DefaultMaven.java:328)
	at org.apache.maven.DefaultMaven.execute(DefaultMaven.java:138)
	at org.apache.maven.cli.MavenCli.main(MavenCli.java:362)
	at org.apache.maven.cli.compat.CompatibleMain.main(CompatibleMain.java:60)
	at sun.reflect.NativeMethodAccessorImpl.invoke0(Native Method)
	at sun.reflect.NativeMethodAccessorImpl.invoke(NativeMethodAccessorImpl.java:39)
	at sun.reflect.DelegatingMethodAccessorImpl.invoke(DelegatingMethodAccessorImpl.java:25)
	at java.lang.reflect.Method.invoke(Method.java:592)
	at org.codehaus.classworlds.Launcher.launchEnhanced(Launcher.java:315)
	at org.codehaus.classworlds.Launcher.launch(Launcher.java:255)
	at org.codehaus.classworlds.Launcher.mainWithExitCode(Launcher.java:430)
	at org.codehaus.classworlds.Launcher.main(Launcher.java:375)
Caused by: org.apache.maven.plugin.MojoFailureException: There are test failures.

Please refer to <https://builds.apache.org/job/doxia-sitetools/./jdk=JDK%201.5%20(latest),label=Ubuntu/ws/doxia-site-renderer/target/surefire-reports>
for the individual test results.
	at org.apache.maven.plugin.surefire.SurefireHelper.reportExecution(SurefireHelper.java:87)
	at org.apache.maven.plugin.surefire.SurefirePlugin.writeSummary(SurefirePlugin.java:631)
	at org.apache.maven.plugin.surefire.SurefirePlugin.handleSummary(SurefirePlugin.java:605)
	at org.apache.maven.plugin.surefire.AbstractSurefireMojo.executeAfterPreconditionsChecked(AbstractSurefireMojo.java:136)
	at org.apache.maven.plugin.surefire.AbstractSurefireMojo.execute(AbstractSurefireMojo.java:97)
	at org.apache.maven.plugin.DefaultPluginManager.executeMojo(DefaultPluginManager.java:490)
	at org.apache.maven.lifecycle.DefaultLifecycleExecutor.executeGoals(DefaultLifecycleExecutor.java:694)
	... 17 more
[INFO] ------------------------------------------------------------------------
[INFO] BUILD ERRORS
[INFO] ------------------------------------------------------------------------
[INFO] Total time: 1 minute 8 seconds
[INFO] Finished at: Tue Oct 18 17:50:05 UTC 2011
[INFO] Final Memory: 64M/276M
[INFO] ------------------------------------------------------------------------
Build step 'Invoke top-level Maven targets' marked build as failure


Mime
View raw message