maven-notifications mailing list archives

Site index · List index
Message view « Date » · « Thread »
Top « Date » · « Thread »
From Apache Jenkins Server <jenk...@builds.apache.org>
Subject Build failed in Jenkins: maven-skins #8
Date Tue, 11 Oct 2011 21:09:14 GMT
See <https://builds.apache.org/job/maven-skins/8/changes>

Changes:

[hboutemy] updated parent pom

------------------------------------------
[...truncated 175 lines...]
[INFO] Using 'UTF-8' encoding to copy filtered resources.
[INFO] Copying 15 resources
[INFO] Copying 3 resources
[INFO] 
[INFO] --- maven-compiler-plugin:2.3.2:compile (default-compile) @ maven-application-skin
---
[INFO] No sources to compile
[INFO] [debug] execute contextualize
[INFO] Using 'UTF-8' encoding to copy filtered resources.
[INFO] skip non existing resourceDirectory <https://builds.apache.org/job/maven-skins/ws/maven-application-skin/src/test/resources>
[INFO] Copying 3 resources

[INFO] --- maven-resources-plugin:2.5:testResources (default-testResources) @ maven-application-skin
---
[INFO] [INFO] No sources to compile

[INFO] --- maven-compiler-plugin:2.3.2:testCompile (default-testCompile) @ maven-application-skin
---
[INFO] 
[INFO] --- maven-surefire-plugin:2.9:test (default-test) @ maven-application-skin ---
[INFO] Surefire report directory: <https://builds.apache.org/job/maven-skins/ws/maven-application-skin/target/surefire-reports>

-------------------------------------------------------
 T E S T S
-------------------------------------------------------

Results :

Tests run: 0, Failures: 0, Errors: 0, Skipped: 0

[JENKINS] Recording test results
[INFO] 
[INFO] --- maven-jar-plugin:2.3.1:jar (default-jar) @ maven-application-skin ---
[INFO] Building jar: <https://builds.apache.org/job/maven-skins/ws/maven-application-skin/target/maven-application-skin-1.0-SNAPSHOT.jar>
[INFO] 
[INFO] --- maven-site-plugin:3.0:attach-descriptor (attach-descriptor) @ maven-application-skin
---
[INFO] [INFO] Installing <https://builds.apache.org/job/maven-skins/ws/maven-application-skin/target/maven-application-skin-1.0-SNAPSHOT.jar>
to /home/jenkins/.m2/repository/org/apache/maven/skins/maven-application-skin/1.0-SNAPSHOT/maven-application-skin-1.0-SNAPSHOT.jar
[INFO] Installing <https://builds.apache.org/job/maven-skins/ws/maven-application-skin/pom.xml>
to /home/jenkins/.m2/repository/org/apache/maven/skins/maven-application-skin/1.0-SNAPSHOT/maven-application-skin-1.0-SNAPSHOT.pom

[INFO] --- maven-install-plugin:2.3.1:install (default-install) @ maven-application-skin ---
[JENKINS] Archiving <https://builds.apache.org/job/maven-skins/ws/maven-application-skin/pom.xml>
to /home/hudson/hudson/jobs/maven-skins/modules/org.apache.maven.skins$maven-application-skin/builds/2011-10-11_21-08-35/archive/org.apache.maven.skins/maven-application-skin/1.0-SNAPSHOT/maven-application-skin-1.0-SNAPSHOT.pom
[JENKINS] Archiving <https://builds.apache.org/job/maven-skins/ws/maven-application-skin/target/maven-application-skin-1.0-SNAPSHOT.jar>
to /home/hudson/hudson/jobs/maven-skins/modules/org.apache.maven.skins$maven-application-skin/builds/2011-10-11_21-08-35/archive/org.apache.maven.skins/maven-application-skin/1.0-SNAPSHOT/maven-application-skin-1.0-SNAPSHOT.jar
[INFO]                                                                         
[INFO] ------------------------------------------------------------------------
[INFO] Building Maven Default Skin 1.1-SNAPSHOT
[INFO] ------------------------------------------------------------------------
[INFO] 
[INFO] --- maven-clean-plugin:2.4.1:clean (default-clean) @ maven-default-skin ---
[INFO] 
[INFO] --- maven-remote-resources-plugin:1.2.1:process (default) @ maven-default-skin ---
[debug] execute contextualize
[INFO] [INFO] Using 'UTF-8' encoding to copy filtered resources.
[INFO] Copying 7 resources
[INFO] Copying 3 resources

[INFO] --- maven-resources-plugin:2.5:resources (default-resources) @ maven-default-skin ---
[INFO] [INFO] No sources to compile

[INFO] --- maven-compiler-plugin:2.3.2:compile (default-compile) @ maven-default-skin ---
[INFO] [debug] execute contextualize
[INFO] Using 'UTF-8' encoding to copy filtered resources.
[INFO] skip non existing resourceDirectory <https://builds.apache.org/job/maven-skins/ws/maven-default-skin/src/test/resources>
[INFO] Copying 3 resources

[INFO] --- maven-resources-plugin:2.5:testResources (default-testResources) @ maven-default-skin
---
[INFO] [INFO] No sources to compile

[INFO] --- maven-compiler-plugin:2.3.2:testCompile (default-testCompile) @ maven-default-skin
---
[INFO] [INFO] Surefire report directory: <https://builds.apache.org/job/maven-skins/ws/maven-default-skin/target/surefire-reports>

-------------------------------------------------------
 T E S T S
-------------------------------------------------------

[INFO] --- maven-surefire-plugin:2.9:test (default-test) @ maven-default-skin ---

Results :

Tests run: 0, Failures: 0, Errors: 0, Skipped: 0

[JENKINS] Recording test results
[INFO] 
[INFO] --- maven-jar-plugin:2.3.1:jar (default-jar) @ maven-default-skin ---
[INFO] Building jar: <https://builds.apache.org/job/maven-skins/ws/maven-default-skin/target/maven-default-skin-1.1-SNAPSHOT.jar>
[INFO] 
[INFO] --- maven-site-plugin:3.0:attach-descriptor (attach-descriptor) @ maven-default-skin
---
[INFO] [INFO] Installing <https://builds.apache.org/job/maven-skins/ws/maven-default-skin/target/maven-default-skin-1.1-SNAPSHOT.jar>
to /home/jenkins/.m2/repository/org/apache/maven/skins/maven-default-skin/1.1-SNAPSHOT/maven-default-skin-1.1-SNAPSHOT.jar
[INFO] Installing <https://builds.apache.org/job/maven-skins/ws/maven-default-skin/pom.xml>
to /home/jenkins/.m2/repository/org/apache/maven/skins/maven-default-skin/1.1-SNAPSHOT/maven-default-skin-1.1-SNAPSHOT.pom

[INFO] --- maven-install-plugin:2.3.1:install (default-install) @ maven-default-skin ---
[JENKINS] Archiving <https://builds.apache.org/job/maven-skins/ws/maven-default-skin/pom.xml>
to /home/hudson/hudson/jobs/maven-skins/modules/org.apache.maven.skins$maven-default-skin/builds/2011-10-11_21-08-35/archive/org.apache.maven.skins/maven-default-skin/1.1-SNAPSHOT/maven-default-skin-1.1-SNAPSHOT.pom
[JENKINS] Archiving <https://builds.apache.org/job/maven-skins/ws/maven-default-skin/target/maven-default-skin-1.1-SNAPSHOT.jar>
to /home/hudson/hudson/jobs/maven-skins/modules/org.apache.maven.skins$maven-default-skin/builds/2011-10-11_21-08-35/archive/org.apache.maven.skins/maven-default-skin/1.1-SNAPSHOT/maven-default-skin-1.1-SNAPSHOT.jar
[INFO]                                                                         
[INFO] ------------------------------------------------------------------------
[INFO] Building Maven Classic Skin 1.1-SNAPSHOT
[INFO] ------------------------------------------------------------------------
[INFO] 
[INFO] --- maven-clean-plugin:2.4.1:clean (default-clean) @ maven-classic-skin ---
[INFO] 
[INFO] --- maven-remote-resources-plugin:1.2.1:process (default) @ maven-classic-skin ---
[INFO] [debug] execute contextualize
[INFO] Using 'UTF-8' encoding to copy filtered resources.
[INFO] Copying 29 resources
[INFO] Copying 3 resources

[INFO] --- maven-resources-plugin:2.5:resources (default-resources) @ maven-classic-skin ---
[INFO] [INFO] No sources to compile

[INFO] --- maven-compiler-plugin:2.3.2:compile (default-compile) @ maven-classic-skin ---
[debug] execute contextualize
[INFO] [INFO] Using 'UTF-8' encoding to copy filtered resources.
[INFO] skip non existing resourceDirectory <https://builds.apache.org/job/maven-skins/ws/maven-classic-skin/src/test/resources>
[INFO] Copying 3 resources

[INFO] --- maven-resources-plugin:2.5:testResources (default-testResources) @ maven-classic-skin
---
[INFO] [INFO] No sources to compile

[INFO] --- maven-compiler-plugin:2.3.2:testCompile (default-testCompile) @ maven-classic-skin
---
[INFO] [INFO] Surefire report directory: <https://builds.apache.org/job/maven-skins/ws/maven-classic-skin/target/surefire-reports>

-------------------------------------------------------
 T E S T S
-------------------------------------------------------

[INFO] --- maven-surefire-plugin:2.9:test (default-test) @ maven-classic-skin ---

Results :

Tests run: 0, Failures: 0, Errors: 0, Skipped: 0

[JENKINS] Recording test results
[INFO] 
[INFO] --- maven-jar-plugin:2.3.1:jar (default-jar) @ maven-classic-skin ---
[INFO] Building jar: <https://builds.apache.org/job/maven-skins/ws/maven-classic-skin/target/maven-classic-skin-1.1-SNAPSHOT.jar>
[INFO] 
[INFO] --- maven-site-plugin:3.0:attach-descriptor (attach-descriptor) @ maven-classic-skin
---
[INFO] [INFO] Installing <https://builds.apache.org/job/maven-skins/ws/maven-classic-skin/target/maven-classic-skin-1.1-SNAPSHOT.jar>
to /home/jenkins/.m2/repository/org/apache/maven/skins/maven-classic-skin/1.1-SNAPSHOT/maven-classic-skin-1.1-SNAPSHOT.jar
[INFO] Installing <https://builds.apache.org/job/maven-skins/ws/maven-classic-skin/pom.xml>
to /home/jenkins/.m2/repository/org/apache/maven/skins/maven-classic-skin/1.1-SNAPSHOT/maven-classic-skin-1.1-SNAPSHOT.pom

[INFO] --- maven-install-plugin:2.3.1:install (default-install) @ maven-classic-skin ---
[JENKINS] Archiving <https://builds.apache.org/job/maven-skins/ws/maven-classic-skin/pom.xml>
to /home/hudson/hudson/jobs/maven-skins/modules/org.apache.maven.skins$maven-classic-skin/builds/2011-10-11_21-08-35/archive/org.apache.maven.skins/maven-classic-skin/1.1-SNAPSHOT/maven-classic-skin-1.1-SNAPSHOT.pom
[JENKINS] Archiving <https://builds.apache.org/job/maven-skins/ws/maven-classic-skin/target/maven-classic-skin-1.1-SNAPSHOT.jar>
to /home/hudson/hudson/jobs/maven-skins/modules/org.apache.maven.skins$maven-classic-skin/builds/2011-10-11_21-08-35/archive/org.apache.maven.skins/maven-classic-skin/1.1-SNAPSHOT/maven-classic-skin-1.1-SNAPSHOT.jar
[INFO]                                                                         
[INFO] ------------------------------------------------------------------------
[INFO] Building Maven Site Skin 1.4-SNAPSHOT
[INFO] ------------------------------------------------------------------------
[INFO] 
[INFO] --- maven-clean-plugin:2.3:clean (default-clean) @ maven-stylus-skin ---
[INFO] 
[INFO] --- maven-remote-resources-plugin:1.1:process (default) @ maven-stylus-skin ---
[INFO] Setting property: classpath.resource.loader.class => 'org.codehaus.plexus.velocity.ContextClassLoaderResourceLoader'.
[INFO] Setting property: velocimacro.messages.on => 'false'.
[INFO] Setting property: resource.loader => 'classpath'.
[INFO] Setting property: resource.manager.logwhenfound => 'false'.
[INFO] 
[INFO] [INFO] Using 'UTF-8' encoding to copy filtered resources.
--- maven-resources-plugin:2.4:resources (default-resources) @ maven-stylus-skin ---
[INFO] Copying 24 resources
[INFO] Copying 3 resources
[INFO] 
[INFO] --- maven-compiler-plugin:2.0.2:compile (default-compile) @ maven-stylus-skin ---
[INFO] No sources to compile
[INFO] [INFO] Using 'UTF-8' encoding to copy filtered resources.
[INFO] skip non existing resourceDirectory <https://builds.apache.org/job/maven-skins/ws/maven-stylus-skin/src/test/resources>
[INFO] Copying 3 resources

[INFO] --- maven-resources-plugin:2.4:testResources (default-testResources) @ maven-stylus-skin
---
[INFO] [INFO] No sources to compile

[INFO] --- maven-compiler-plugin:2.0.2:testCompile (default-testCompile) @ maven-stylus-skin
---
[INFO] 
[INFO] --- maven-surefire-plugin:2.4.3:test (default-test) @ maven-stylus-skin ---
[INFO] Surefire report directory: <https://builds.apache.org/job/maven-skins/ws/maven-stylus-skin/target/surefire-reports>

-------------------------------------------------------
 T E S T S
-------------------------------------------------------
There are no tests to run.

Results :

Tests run: 0, Failures: 0, Errors: 0, Skipped: 0

[JENKINS] Recording test results
[INFO] 
[INFO] --- maven-jar-plugin:2.3:jar (default-jar) @ maven-stylus-skin ---
[INFO] Building jar: <https://builds.apache.org/job/maven-skins/ws/maven-stylus-skin/target/maven-stylus-skin-1.4-SNAPSHOT.jar>
[INFO] 
[INFO] --- maven-install-plugin:2.3:install (default-install) @ maven-stylus-skin ---
[INFO] Installing <https://builds.apache.org/job/maven-skins/ws/maven-stylus-skin/target/maven-stylus-skin-1.4-SNAPSHOT.jar>
to /home/jenkins/.m2/repository/org/apache/maven/skins/maven-stylus-skin/1.4-SNAPSHOT/maven-stylus-skin-1.4-SNAPSHOT.jar
[INFO] Installing <https://builds.apache.org/job/maven-skins/ws/maven-stylus-skin/pom.xml>
to /home/jenkins/.m2/repository/org/apache/maven/skins/maven-stylus-skin/1.4-SNAPSHOT/maven-stylus-skin-1.4-SNAPSHOT.pom
[JENKINS] Archiving <https://builds.apache.org/job/maven-skins/ws/maven-stylus-skin/pom.xml>
to /home/hudson/hudson/jobs/maven-skins/modules/org.apache.maven.skins$maven-stylus-skin/builds/2011-10-11_21-08-35/archive/org.apache.maven.skins/maven-stylus-skin/1.4-SNAPSHOT/maven-stylus-skin-1.4-SNAPSHOT.pom
[JENKINS] Archiving <https://builds.apache.org/job/maven-skins/ws/maven-stylus-skin/target/maven-stylus-skin-1.4-SNAPSHOT.jar>
to /home/hudson/hudson/jobs/maven-skins/modules/org.apache.maven.skins$maven-stylus-skin/builds/2011-10-11_21-08-35/archive/org.apache.maven.skins/maven-stylus-skin/1.4-SNAPSHOT/maven-stylus-skin-1.4-SNAPSHOT.jar
[INFO] ------------------------------------------------------------------------
[INFO] Reactor Summary:
[INFO] 
[INFO] Maven Skins ....................................... SUCCESS [10.290s]
[INFO] Maven Application Skin ............................ SUCCESS [2.980s]
[INFO] Maven Default Skin ................................ SUCCESS [1.977s]
[INFO] Maven Classic Skin ................................ SUCCESS [1.905s]
[INFO] Maven Site Skin ................................... SUCCESS [2.663s]
[INFO] ------------------------------------------------------------------------
[INFO] BUILD SUCCESS
[INFO] ------------------------------------------------------------------------
[INFO] Total time: 26.477s
[INFO] Finished at: Tue Oct 11 21:09:13 UTC 2011
[WARNING] The requested profile "run-its" could not be activated because it does not exist.
[INFO] Final Memory: 16M/192M
[INFO] ------------------------------------------------------------------------
channel stopped
Maven RedeployPublished use remote ubuntu1 maven settings from : /home/jenkins/.m2/settings.xml
[INFO] Deployment in https://repository.apache.org/content/repositories/snapshots (id=,uniqueVersion=true)
Deploying the main artifact maven-application-skin-1.0-SNAPSHOT.jar
Downloading: https://repository.apache.org/content/repositories/snapshots/org/apache/maven/skins/maven-application-skin/1.0-SNAPSHOT/maven-metadata.xml
Downloaded: https://repository.apache.org/content/repositories/snapshots/org/apache/maven/skins/maven-application-skin/1.0-SNAPSHOT/maven-metadata.xml
(1001 B at 1.6 KB/sec)
Uploading: https://repository.apache.org/content/repositories/snapshots/org/apache/maven/skins/maven-application-skin/1.0-SNAPSHOT/maven-application-skin-1.0-20111011.210914-16.jar
Uploading: https://repository.apache.org/content/repositories/snapshots/org/apache/maven/skins/maven-application-skin/1.0-SNAPSHOT/maven-application-skin-1.0-20111011.210914-16.pom
ERROR: Failed to deploy artifacts: Could not transfer artifact org.apache.maven.skins:maven-application-skin:jar:1.0-20111011.210914-16
from/to  (https://repository.apache.org/content/repositories/snapshots): Failed to transfer
file: https://repository.apache.org/content/repositories/snapshots/org/apache/maven/skins/maven-application-skin/1.0-SNAPSHOT/maven-application-skin-1.0-20111011.210914-16.jar.
Return code is: 401
org.apache.maven.artifact.deployer.ArtifactDeploymentException: Failed to deploy artifacts:
Could not transfer artifact org.apache.maven.skins:maven-application-skin:jar:1.0-20111011.210914-16
from/to  (https://repository.apache.org/content/repositories/snapshots): Failed to transfer
file: https://repository.apache.org/content/repositories/snapshots/org/apache/maven/skins/maven-application-skin/1.0-SNAPSHOT/maven-application-skin-1.0-20111011.210914-16.jar.
Return code is: 401
	at org.apache.maven.artifact.deployer.DefaultArtifactDeployer.deploy(DefaultArtifactDeployer.java:141)
	at hudson.maven.reporters.MavenArtifactRecord.deploy(MavenArtifactRecord.java:189)
	at hudson.maven.RedeployPublisher.perform(RedeployPublisher.java:158)
	at hudson.tasks.BuildStepMonitor$1.perform(BuildStepMonitor.java:19)
	at hudson.model.AbstractBuild$AbstractRunner.perform(AbstractBuild.java:693)
	at hudson.model.AbstractBuild$AbstractRunner.performAllBuildSteps(AbstractBuild.java:668)
	at hudson.maven.MavenModuleSetBuild$RunnerImpl.post2(MavenModuleSetBuild.java:953)
	at hudson.model.AbstractBuild$AbstractRunner.post(AbstractBuild.java:615)
	at hudson.model.Run.run(Run.java:1401)
	at hudson.maven.MavenModuleSetBuild.run(MavenModuleSetBuild.java:474)
	at hudson.model.ResourceController.execute(ResourceController.java:88)
	at hudson.model.Executor.run(Executor.java:230)
Caused by: org.sonatype.aether.deployment.DeploymentException: Failed to deploy artifacts:
Could not transfer artifact org.apache.maven.skins:maven-application-skin:jar:1.0-20111011.210914-16
from/to  (https://repository.apache.org/content/repositories/snapshots): Failed to transfer
file: https://repository.apache.org/content/repositories/snapshots/org/apache/maven/skins/maven-application-skin/1.0-SNAPSHOT/maven-application-skin-1.0-20111011.210914-16.jar.
Return code is: 401
	at org.sonatype.aether.impl.internal.DefaultDeployer.deploy(DefaultDeployer.java:284)
	at org.sonatype.aether.impl.internal.DefaultDeployer.deploy(DefaultDeployer.java:215)
	at org.sonatype.aether.impl.internal.DefaultRepositorySystem.deploy(DefaultRepositorySystem.java:480)
	at org.apache.maven.artifact.deployer.DefaultArtifactDeployer.deploy(DefaultArtifactDeployer.java:137)
	... 11 more
Caused by: org.sonatype.aether.transfer.ArtifactTransferException: Could not transfer artifact
org.apache.maven.skins:maven-application-skin:jar:1.0-20111011.210914-16 from/to  (https://repository.apache.org/content/repositories/snapshots):
Failed to transfer file: https://repository.apache.org/content/repositories/snapshots/org/apache/maven/skins/maven-application-skin/1.0-SNAPSHOT/maven-application-skin-1.0-20111011.210914-16.jar.
Return code is: 401
	at org.sonatype.aether.connector.wagon.WagonRepositoryConnector$4.wrap(WagonRepositoryConnector.java:949)
	at org.sonatype.aether.connector.wagon.WagonRepositoryConnector$4.wrap(WagonRepositoryConnector.java:940)
	at org.sonatype.aether.connector.wagon.WagonRepositoryConnector$PutTask.flush(WagonRepositoryConnector.java:864)
	at org.sonatype.aether.connector.wagon.WagonRepositoryConnector.put(WagonRepositoryConnector.java:466)
	at org.sonatype.aether.impl.internal.DefaultDeployer.deploy(DefaultDeployer.java:278)
	... 14 more
Caused by: org.apache.maven.wagon.TransferFailedException: Failed to transfer file: https://repository.apache.org/content/repositories/snapshots/org/apache/maven/skins/maven-application-skin/1.0-SNAPSHOT/maven-application-skin-1.0-20111011.210914-16.jar.
Return code is: 401
	at org.apache.maven.wagon.shared.http.AbstractHttpClientWagon.put(AbstractHttpClientWagon.java:368)
	at org.apache.maven.wagon.shared.http.AbstractHttpClientWagon.put(AbstractHttpClientWagon.java:280)
	at org.sonatype.aether.connector.wagon.WagonRepositoryConnector$PutTask.run(WagonRepositoryConnector.java:825)
	at org.sonatype.aether.connector.wagon.WagonRepositoryConnector.put(WagonRepositoryConnector.java:465)
	... 15 more
[INFO] Deployment failed after 0.93 sec
Build step 'Deploy artifacts to Maven repository' changed build result to FAILURE


Mime
View raw message