maven-notifications mailing list archives

Site index · List index
Message view « Date » · « Thread »
Top « Date » · « Thread »
From Apache Jenkins Server <jenk...@builds.apache.org>
Subject Build failed in Jenkins: maven-plugins-ITs-m3 #251
Date Thu, 27 Oct 2011 22:51:35 GMT
See <https://builds.apache.org/job/maven-plugins-ITs-m3/251/changes>

Changes:

[hboutemy] [MCHECKSTYLE-62] added aggregate mojo in goals overview

------------------------------------------
[...truncated 8584 lines...]
[INFO] Applying mojo extractor for language: bsh
[INFO] Mojo extractor for language: bsh found 0 mojo descriptors.
[INFO] 
[INFO] --- modello-maven-plugin:1.4.1:xpp3-writer (remote-resources) @ maven-remote-resources-plugin
---
[INFO] outputDirectory: <https://builds.apache.org/job/maven-plugins-ITs-m3/ws/maven-remote-resources-plugin/target/generated-sources/modello>
[INFO] Working on model: src/main/mdo/remote-resources.mdo
[INFO] Generating current version: 1.1.0
[INFO] 
[INFO] --- modello-maven-plugin:1.4.1:java (remote-resources) @ maven-remote-resources-plugin
---
[INFO] outputDirectory: <https://builds.apache.org/job/maven-plugins-ITs-m3/ws/maven-remote-resources-plugin/target/generated-sources/modello>
[INFO] Working on model: src/main/mdo/remote-resources.mdo
[INFO] Generating current version: 1.1.0
[INFO] 
[INFO] --- modello-maven-plugin:1.4.1:xpp3-reader (remote-resources) @ maven-remote-resources-plugin
---
[INFO] outputDirectory: <https://builds.apache.org/job/maven-plugins-ITs-m3/ws/maven-remote-resources-plugin/target/generated-sources/modello>
[INFO] Working on model: src/main/mdo/remote-resources.mdo
[INFO] Generating current version: 1.1.0
[INFO] 
[INFO] --- modello-maven-plugin:1.4.1:xpp3-writer (supplemental-models) @ maven-remote-resources-plugin
---
[INFO] outputDirectory: <https://builds.apache.org/job/maven-plugins-ITs-m3/ws/maven-remote-resources-plugin/target/generated-sources/modello>
[INFO] Working on model: src/main/mdo/supplemental-model.mdo
[INFO] Generating current version: 1.0.0
[INFO] 
[INFO] --- modello-maven-plugin:1.4.1:java (supplemental-models) @ maven-remote-resources-plugin
---
[INFO] outputDirectory: <https://builds.apache.org/job/maven-plugins-ITs-m3/ws/maven-remote-resources-plugin/target/generated-sources/modello>
[INFO] Working on model: src/main/mdo/supplemental-model.mdo
[INFO] Generating current version: 1.0.0
[INFO] 
[INFO] --- modello-maven-plugin:1.4.1:xpp3-reader (supplemental-models) @ maven-remote-resources-plugin
---
[INFO] outputDirectory: <https://builds.apache.org/job/maven-plugins-ITs-m3/ws/maven-remote-resources-plugin/target/generated-sources/modello>
[INFO] Working on model: src/main/mdo/supplemental-model.mdo
[INFO] Generating current version: 1.0.0
[INFO] 
[INFO] --- maven-plugin-plugin:2.7:descriptor (default-descriptor) @ maven-remote-resources-plugin
---
[INFO] Using 'UTF-8' encoding to read mojo metadata.
[INFO] Applying mojo extractor for language: java
[INFO] ..SUCCESS (59.8 s)
[INFO] Building: inheritedReports/pom.xml
[INFO] ..SKIPPED 
[INFO] Building: MSITE-265/pom.xml
[INFO] Mojo extractor for language: java found 3 mojo descriptors.
[INFO] Applying mojo extractor for language: bsh
[INFO] Mojo extractor for language: bsh found 0 mojo descriptors.
[INFO] 
[INFO] --- maven-remote-resources-plugin:1.1:process (default) @ maven-remote-resources-plugin
---
[INFO] 
[INFO] --- maven-resources-plugin:2.4.3:resources (default-resources) @ maven-remote-resources-plugin
---
[INFO] Using 'UTF-8' encoding to copy filtered resources.
[INFO] Copying 1 resource
[INFO] Copying 3 resources
[INFO] 
[INFO] --- maven-compiler-plugin:2.3.2:compile (default-compile) @ maven-remote-resources-plugin
---
[INFO] Compiling 11 source files to <https://builds.apache.org/job/maven-plugins-ITs-m3/ws/maven-remote-resources-plugin/target/classes>
[INFO] 
[INFO] --- maven-resources-plugin:2.4.3:testResources (default-testResources) @ maven-remote-resources-plugin
---
[INFO] Using 'UTF-8' encoding to copy filtered resources.
[INFO] Copying 7 resources
[INFO] Copying 42 resources
[INFO] Copying 1 resource
[INFO] Copying 3 resources
[INFO] 
[INFO] --- maven-compiler-plugin:2.3.2:testCompile (default-testCompile) @ maven-remote-resources-plugin
---
[INFO] Compiling 17 source files to <https://builds.apache.org/job/maven-plugins-ITs-m3/ws/maven-remote-resources-plugin/target/test-classes>
[INFO] 
[INFO] --- maven-surefire-plugin:2.7.2:test (default-test) @ maven-remote-resources-plugin
---
[INFO] Surefire report directory: <https://builds.apache.org/job/maven-plugins-ITs-m3/ws/maven-remote-resources-plugin/target/surefire-reports>

-------------------------------------------------------
 T E S T S
-------------------------------------------------------
Running org.apache.maven.plugin.resources.remote.RemoteResourcesMojoTest
Tests run: 8, Failures: 0, Errors: 0, Skipped: 0, Time elapsed: 1.238 sec

Results :

Tests run: 8, Failures: 0, Errors: 0, Skipped: 0

[INFO] 
[INFO] --- maven-jar-plugin:2.3.1:jar (default-jar) @ maven-remote-resources-plugin ---
[INFO] Building jar: <https://builds.apache.org/job/maven-plugins-ITs-m3/ws/maven-remote-resources-plugin/target/maven-remote-resources-plugin-1.3-SNAPSHOT.jar>
[INFO] 
[INFO] --- maven-plugin-plugin:2.7:addPluginArtifactMetadata (default-addPluginArtifactMetadata)
@ maven-remote-resources-plugin ---
[INFO] 
[INFO] --- maven-invoker-plugin:1.5:install (install-descriptor) @ maven-remote-resources-plugin
---
[INFO] Installing <https://builds.apache.org/job/maven-plugins-ITs-m3/ws/maven-remote-resources-plugin/pom.xml>
to <https://builds.apache.org/job/maven-plugins-ITs-m3/ws/maven-remote-resources-plugin/target/it-repo/org/apache/maven/plugins/maven-remote-resources-plugin/1.3-SNAPSHOT/maven-remote-resources-plugin-1.3-SNAPSHOT.pom>
[INFO] Installing <https://builds.apache.org/job/maven-plugins-ITs-m3/ws/maven-remote-resources-plugin/target/maven-remote-resources-plugin-1.3-SNAPSHOT.jar>
to <https://builds.apache.org/job/maven-plugins-ITs-m3/ws/maven-remote-resources-plugin/target/it-repo/org/apache/maven/plugins/maven-remote-resources-plugin/1.3-SNAPSHOT/maven-remote-resources-plugin-1.3-SNAPSHOT.jar>
[INFO] 
[INFO] --- maven-failsafe-plugin:2.9:integration-test (integration-tests) @ maven-remote-resources-plugin
---
[INFO] Failsafe report directory: <https://builds.apache.org/job/maven-plugins-ITs-m3/ws/maven-remote-resources-plugin/target/failsafe-reports>

-------------------------------------------------------
 T E S T S
-------------------------------------------------------
Running org.apache.maven.plugin.resources.remote.it.IT_GenerateFromBundle
[INFO] ..SUCCESS (64.9 s)
[INFO] 
[INFO] --- maven-jarsigner-plugin:1.2:verify (verify) @ maven-project-info-reports-plugin
---
[INFO] 1 archive(s) processed
[INFO] 
[INFO] --- maven-invoker-plugin:1.5:verify (integration-test) @ maven-project-info-reports-plugin
---
[INFO] -------------------------------------------------
[INFO] Build Summary:
[INFO]   Passed: 2, Failed: 0, Errors: 0, Skipped: 0
[INFO] -------------------------------------------------
[INFO] 
[INFO] --- maven-install-plugin:2.3.1:install (default-install) @ maven-project-info-reports-plugin
---
[INFO] Installing <https://builds.apache.org/job/maven-plugins-ITs-m3/ws/maven-project-info-reports-plugin/target/maven-project-info-reports-plugin-2.4.1-SNAPSHOT.jar>
to /home/jenkins/.m2/repository/org/apache/maven/plugins/maven-project-info-reports-plugin/2.4.1-SNAPSHOT/maven-project-info-reports-plugin-2.4.1-SNAPSHOT.jar
[INFO] Installing <https://builds.apache.org/job/maven-plugins-ITs-m3/ws/maven-project-info-reports-plugin/pom.xml>
to /home/jenkins/.m2/repository/org/apache/maven/plugins/maven-project-info-reports-plugin/2.4.1-SNAPSHOT/maven-project-info-reports-plugin-2.4.1-SNAPSHOT.pom
[INFO]                                                                         
[INFO] ------------------------------------------------------------------------
[INFO] Building Maven Plugins Aggregator 1-SNAPSHOT
[INFO] ------------------------------------------------------------------------
[WARNING] *****************************************************************
[WARNING] * Your build is requesting parallel execution, but project      *
[WARNING] * contains the following plugin(s) that are not marked as       *
[WARNING] * @threadSafe to support parallel building.                     *
[WARNING] * While this /may/ work fine, please look for plugin updates    *
[WARNING] * and/or request plugins be made thread-safe.                   *
[WARNING] * If reporting an issue, report it against the plugin in        *
[WARNING] * question, not against maven-core                              *
[WARNING] *****************************************************************
[WARNING] The following plugins are not marked @threadSafe in Maven Plugins Aggregator:
[WARNING] org.apache.maven.plugins:maven-remote-resources-plugin:1.1
[WARNING] *****************************************************************
[INFO] 
[INFO] --- maven-clean-plugin:2.4.1:clean (default-clean) @ maven-plugins-aggregator ---
[INFO] Deleting <https://builds.apache.org/job/maven-plugins-ITs-m3/ws/target>
[INFO] 
[INFO] --- maven-remote-resources-plugin:1.1:process (default) @ maven-plugins-aggregator
---
[INFO] 
[INFO] --- maven-install-plugin:2.3.1:install (default-install) @ maven-plugins-aggregator
---
[INFO] Installing <https://builds.apache.org/job/maven-plugins-ITs-m3/ws/pom.xml> to
/home/jenkins/.m2/repository/org/apache/maven/plugins/maven-plugins-aggregator/1-SNAPSHOT/maven-plugins-aggregator-1-SNAPSHOT.pom
[INFO] ..SUCCESS (8.6 s)
[INFO] Building: new-configuration/pom.xml
[INFO] ..SUCCESS (8.0 s)
[INFO] Building: MSITE-354/pom.xml
[INFO] ..SUCCESS (6.0 s)
[INFO] Building: MSITE-506/pom.xml
[INFO] ..SUCCESS (11.1 s)
[INFO] Building: site-skip/pom.xml
[INFO] ..SUCCESS (4.9 s)
[INFO] 
[INFO] --- maven-invoker-plugin:1.5:verify (integration-test) @ maven-site-plugin ---
[INFO] -------------------------------------------------
[INFO] Build Summary:
[INFO]   Passed: 38, Failed: 0, Errors: 0, Skipped: 1
[INFO] -------------------------------------------------
[INFO] 
[INFO] --- maven-install-plugin:2.3.1:install (default-install) @ maven-site-plugin ---
[INFO] Installing <https://builds.apache.org/job/maven-plugins-ITs-m3/ws/maven-site-plugin/target/maven-site-plugin-3.1-SNAPSHOT.jar>
to /home/jenkins/.m2/repository/org/apache/maven/plugins/maven-site-plugin/3.1-SNAPSHOT/maven-site-plugin-3.1-SNAPSHOT.jar
[INFO] Installing <https://builds.apache.org/job/maven-plugins-ITs-m3/ws/maven-site-plugin/dependency-reduced-pom.xml>
to /home/jenkins/.m2/repository/org/apache/maven/plugins/maven-site-plugin/3.1-SNAPSHOT/maven-site-plugin-3.1-SNAPSHOT.pom
Tests run: 1, Failures: 0, Errors: 0, Skipped: 0, Time elapsed: 89.458 sec
Running org.apache.maven.plugin.resources.remote.it.IT_GenerateFromOverride
Tests run: 1, Failures: 0, Errors: 0, Skipped: 0, Time elapsed: 2.339 sec
Running org.apache.maven.plugin.resources.remote.it.IT_CustomFilterDelimiter
Tests run: 1, Failures: 0, Errors: 0, Skipped: 0, Time elapsed: 2.433 sec
Running org.apache.maven.plugin.resources.remote.it.IT_SupplementalArtifact
Tests run: 1, Failures: 0, Errors: 0, Skipped: 0, Time elapsed: 6.231 sec
Running org.apache.maven.plugin.resources.remote.it.IT_FilterLocalOverride
Tests run: 1, Failures: 0, Errors: 0, Skipped: 0, Time elapsed: 2.337 sec
Running org.apache.maven.plugin.resources.remote.it.IT_BadDependencyPoms
Tests run: 1, Failures: 0, Errors: 0, Skipped: 0, Time elapsed: 2.628 sec
Running org.apache.maven.plugin.resources.remote.it.IT_RunOnlyAtExecutionRoot
Tests run: 1, Failures: 0, Errors: 0, Skipped: 0, Time elapsed: 6.154 sec
Running org.apache.maven.plugin.resources.remote.it.IT_GetDependencyProjects
Tests run: 1, Failures: 0, Errors: 0, Skipped: 0, Time elapsed: 5.927 sec

Results :

Tests run: 8, Failures: 0, Errors: 0, Skipped: 0

[WARNING] File encoding has not been set, using platform encoding ANSI_X3.4-1968, i.e. build
is platform dependent!
[INFO] 
[INFO] --- maven-failsafe-plugin:2.9:verify (integration-tests) @ maven-remote-resources-plugin
---
[INFO] Failsafe report directory: <https://builds.apache.org/job/maven-plugins-ITs-m3/ws/maven-remote-resources-plugin/target/failsafe-reports>
[WARNING] File encoding has not been set, using platform encoding ANSI_X3.4-1968, i.e. build
is platform dependent!
[INFO] 
[INFO] --- maven-install-plugin:2.3.1:install (default-install) @ maven-remote-resources-plugin
---
[INFO] Installing <https://builds.apache.org/job/maven-plugins-ITs-m3/ws/maven-remote-resources-plugin/target/maven-remote-resources-plugin-1.3-SNAPSHOT.jar>
to /home/jenkins/.m2/repository/org/apache/maven/plugins/maven-remote-resources-plugin/1.3-SNAPSHOT/maven-remote-resources-plugin-1.3-SNAPSHOT.jar
[INFO] Installing <https://builds.apache.org/job/maven-plugins-ITs-m3/ws/maven-remote-resources-plugin/pom.xml>
to /home/jenkins/.m2/repository/org/apache/maven/plugins/maven-remote-resources-plugin/1.3-SNAPSHOT/maven-remote-resources-plugin-1.3-SNAPSHOT.pom
[INFO] ------------------------------------------------------------------------
[INFO] Reactor Summary:
[INFO] 
[INFO] Maven Plugins ..................................... SUCCESS [3.076s]
[INFO] Maven ACR Plugin .................................. SUCCESS [1:12.166s]
[INFO] Maven Ant Plugin .................................. SUCCESS [2:24.789s]
[INFO] Maven AntRun Plugin ............................... SUCCESS [1:56.191s]
[INFO] Maven Eclipse Plugin .............................. FAILURE [12:46.395s]
[INFO] Maven Assembly Plugin ............................. SUCCESS [15:19.122s]
[INFO] Maven Changelog Plugin ............................ SUCCESS [59.012s]
[INFO] Maven Changes Report Plugin ....................... SUCCESS [1:34.844s]
[INFO] Maven Checkstyle Plugin ........................... SUCCESS [1:40.196s]
[INFO] Maven Clean Plugin ................................ SUCCESS [18.727s]
[INFO] Maven Compiler Plugin ............................. SUCCESS [28.207s]
[INFO] Maven Dependency Plugin ........................... SUCCESS [2:28.554s]
[INFO] Maven Deploy Plugin ............................... SUCCESS [2:06.268s]
[INFO] Maven DOAP Plugin ................................. SUCCESS [23.073s]
[INFO] Maven Documentation Checker Plugin ................ SUCCESS [6.336s]
[INFO] Maven EAR Plugin .................................. SUCCESS [3:56.378s]
[INFO] Maven EJB Plugin .................................. SUCCESS [36.143s]
[INFO] Maven GPG Plugin .................................. SUCCESS [46.326s]
[INFO] Maven Help Plugin ................................. SUCCESS [45.108s]
[INFO] Maven IDEA Plugin ................................. SUCCESS [8.754s]
[INFO] Maven Install Plugin .............................. SUCCESS [44.956s]
[INFO] Maven JAR Plugin .................................. SUCCESS [1:14.738s]
[INFO] Maven Jarsigner Plugin ............................ SUCCESS [28.881s]
[INFO] Maven Javadoc Plugin .............................. SUCCESS [8:49.496s]
[INFO] Maven Linkcheck Plugin ............................ SUCCESS [1.998s]
[INFO] Maven One Plugin .................................. SUCCESS [2.539s]
[INFO] Maven Patch Plugin ................................ SUCCESS [14.301s]
[INFO] Maven PDF Plugin .................................. SUCCESS [34.316s]
[INFO] Maven PMD Plugin .................................. SUCCESS [36.870s]
[INFO] Maven RAR Plugin .................................. SUCCESS [8.345s]
[INFO] Maven Reactor Plugin .............................. SUCCESS [3.350s]
[INFO] Maven Repository Plugin ........................... SUCCESS [3:06.782s]
[INFO] Maven Resources Plugin ............................ SUCCESS [56.471s]
[INFO] Maven Shade Plugin ................................ SUCCESS [2:00.507s]
[INFO] Maven Site Plugin 3 ............................... SUCCESS [7:16.222s]
[INFO] Maven Source Plugin ............................... SUCCESS [32.306s]
[INFO] Maven Stage Plugin ................................ SUCCESS [2.049s]
[INFO] Maven Toolchains Plugin ........................... SUCCESS [1.519s]
[INFO] Maven Verifier Plugin ............................. SUCCESS [11.287s]
[INFO] Maven WAR Plugin .................................. SUCCESS [1:15.421s]
[INFO] Maven Invoker Plugin .............................. SUCCESS [4:24.936s]
[INFO] Maven Project Info Reports Plugin ................. SUCCESS [2:01.628s]
[INFO] Maven Remote Resources Plugin ..................... SUCCESS [2:06.751s]
[INFO] Maven Plugins Aggregator .......................... SUCCESS [0.147s]
[INFO] ------------------------------------------------------------------------
[INFO] BUILD FAILURE
[INFO] ------------------------------------------------------------------------
[INFO] Total time: 30:08.647s (Wall Clock)
[INFO] Finished at: Thu Oct 27 22:51:34 UTC 2011
[INFO] Final Memory: 68M/999M
[INFO] ------------------------------------------------------------------------
[WARNING] The requested profile "apache.snapshots" could not be activated because it does
not exist.
[ERROR] Failed to execute goal org.apache.maven.plugins:maven-failsafe-plugin:2.9:verify (default)
on project maven-eclipse-plugin: There are test failures.
[ERROR] 
[ERROR] Please refer to <https://builds.apache.org/job/maven-plugins-ITs-m3/ws/maven-eclipse-plugin/target/failsafe-reports>
for the individual test results.
[ERROR] -> [Help 1]
[ERROR] 
[ERROR] To see the full stack trace of the errors, re-run Maven with the -e switch.
[ERROR] Re-run Maven using the -X switch to enable full debug logging.
[ERROR] 
[ERROR] For more information about the errors and possible solutions, please read the following
articles:
[ERROR] [Help 1] http://cwiki.apache.org/confluence/display/MAVEN/MojoFailureException
[ERROR] 
[ERROR] After correcting the problems, you can resume the build with the command
[ERROR]   mvn <goals> -rf :maven-eclipse-plugin
Build step 'Invoke top-level Maven targets' marked build as failure


Mime
View raw message