maven-notifications mailing list archives

Site index · List index
Message view « Date » · « Thread »
Top « Date » · « Thread »
From Apache Jenkins Server <jenk...@builds.apache.org>
Subject Build failed in Jenkins: maven-skins #11
Date Sat, 22 Oct 2011 06:23:50 GMT
See <https://builds.apache.org/job/maven-skins/11/>

------------------------------------------
[...truncated 115 lines...]
[INFO] 
[INFO] --- maven-remote-resources-plugin:1.2.1:process (default) @ maven-default-skin ---
[INFO] 
[INFO] --- maven-resources-plugin:2.5:resources (default-resources) @ maven-default-skin ---[debug]
execute contextualize
[INFO] Using 'UTF-8' encoding to copy filtered resources.
[INFO] Copying 7 resources
[INFO] Copying 3 resources

[INFO] 
[INFO] --- maven-compiler-plugin:2.3.2:compile (default-compile) @ maven-default-skin ---[INFO]
No sources to compile

[INFO] 
[INFO] --- maven-resources-plugin:2.5:testResources (default-testResources) @ maven-default-skin
---[debug] execute contextualize
[INFO] Using 'UTF-8' encoding to copy filtered resources.
[INFO] skip non existing resourceDirectory <https://builds.apache.org/job/maven-skins/ws/maven-default-skin/src/test/resources>
[INFO] Copying 3 resources

[INFO] 
[INFO] No sources to compile
[INFO] --- maven-compiler-plugin:2.3.2:testCompile (default-testCompile) @ maven-default-skin
---
[INFO] 
[INFO] --- maven-surefire-plugin:2.9:test (default-test) @ maven-default-skin ---[INFO] Surefire
report directory: <https://builds.apache.org/job/maven-skins/ws/maven-default-skin/target/surefire-reports>

-------------------------------------------------------
 T E S T S
-------------------------------------------------------


Results :

Tests run: 0, Failures: 0, Errors: 0, Skipped: 0

[JENKINS] Recording test results
[INFO] 
[INFO] --- maven-jar-plugin:2.3.1:jar (default-jar) @ maven-default-skin ---[INFO] Building
jar: <https://builds.apache.org/job/maven-skins/ws/maven-default-skin/target/maven-default-skin-1.1-SNAPSHOT.jar>

[INFO] 
[INFO] --- maven-site-plugin:3.0:attach-descriptor (attach-descriptor) @ maven-default-skin
---
[INFO] [INFO] Installing <https://builds.apache.org/job/maven-skins/ws/pom.xml> to <https://builds.apache.org/job/maven-skins/ws/maven-default-skin/target/local-repo/org/apache/maven/skins/maven-skins/6-SNAPSHOT/maven-skins-6-SNAPSHOT.pom>

[INFO] Installing <https://builds.apache.org/job/maven-skins/ws/maven-default-skin/pom.xml>
to <https://builds.apache.org/job/maven-skins/ws/maven-default-skin/target/local-repo/org/apache/maven/skins/maven-default-skin/1.1-SNAPSHOT/maven-default-skin-1.1-SNAPSHOT.pom>
[INFO] Installing <https://builds.apache.org/job/maven-skins/ws/maven-default-skin/target/maven-default-skin-1.1-SNAPSHOT.jar>
to <https://builds.apache.org/job/maven-skins/ws/maven-default-skin/target/local-repo/org/apache/maven/skins/maven-default-skin/1.1-SNAPSHOT/maven-default-skin-1.1-SNAPSHOT.jar>
[INFO] --- maven-invoker-plugin:1.5:install (integration-test) @ maven-default-skin ---
[INFO] Building: sample/pom.xml
[INFO] 
[INFO] --- maven-invoker-plugin:1.5:integration-test (integration-test) @ maven-default-skin
---
[INFO] ..SUCCESS (17.0 s)
[INFO] [INFO] -------------------------------------------------
[INFO] Build Summary:

[INFO]   Passed: 1, Failed: 0, Errors: 0, Skipped: 0
[INFO] -------------------------------------------------
[INFO] --- maven-invoker-plugin:1.5:verify (integration-test) @ maven-default-skin ---
[INFO] [INFO] Installing <https://builds.apache.org/job/maven-skins/ws/maven-default-skin/target/maven-default-skin-1.1-SNAPSHOT.jar>
to /export/home/hudson/.m2/repository/org/apache/maven/skins/maven-default-skin/1.1-SNAPSHOT/maven-default-skin-1.1-SNAPSHOT.jar

[INFO] --- maven-install-plugin:2.3.1:install (default-install) @ maven-default-skin ---[INFO]
Installing <https://builds.apache.org/job/maven-skins/ws/maven-default-skin/pom.xml>
to /export/home/hudson/.m2/repository/org/apache/maven/skins/maven-default-skin/1.1-SNAPSHOT/maven-default-skin-1.1-SNAPSHOT.pom

[JENKINS] Archiving <https://builds.apache.org/job/maven-skins/ws/maven-default-skin/pom.xml>
to /home/hudson/hudson/jobs/maven-skins/modules/org.apache.maven.skins$maven-default-skin/builds/2011-10-22_06-14-24/archive/org.apache.maven.skins/maven-default-skin/1.1-SNAPSHOT/maven-default-skin-1.1-SNAPSHOT.pom
[JENKINS] Archiving <https://builds.apache.org/job/maven-skins/ws/maven-default-skin/target/maven-default-skin-1.1-SNAPSHOT.jar>
to /home/hudson/hudson/jobs/maven-skins/modules/org.apache.maven.skins$maven-default-skin/builds/2011-10-22_06-14-24/archive/org.apache.maven.skins/maven-default-skin/1.1-SNAPSHOT/maven-default-skin-1.1-SNAPSHOT.jar
[INFO]                                                                         
[INFO] ------------------------------------------------------------------------
[INFO] Building Maven Classic Skin 1.1-SNAPSHOT
[INFO] ------------------------------------------------------------------------
[INFO] 
[INFO] Deleting <https://builds.apache.org/job/maven-skins/ws/maven-classic-skin/target>
[INFO] --- maven-clean-plugin:2.4.1:clean (default-clean) @ maven-classic-skin ---
[INFO] 
[INFO] --- maven-remote-resources-plugin:1.2.1:process (default) @ maven-classic-skin ---
[INFO] 
[INFO] --- maven-resources-plugin:2.5:resources (default-resources) @ maven-classic-skin ---[debug]
execute contextualize
[INFO] Using 'UTF-8' encoding to copy filtered resources.
[INFO] Copying 29 resources
[INFO] Copying 3 resources

[INFO] 
[INFO] --- maven-compiler-plugin:2.3.2:compile (default-compile) @ maven-classic-skin ---[INFO]
No sources to compile

[INFO] 
[INFO] --- maven-resources-plugin:2.5:testResources (default-testResources) @ maven-classic-skin
---[debug] execute contextualize
[INFO] Using 'UTF-8' encoding to copy filtered resources.
[INFO] skip non existing resourceDirectory <https://builds.apache.org/job/maven-skins/ws/maven-classic-skin/src/test/resources>
[INFO] Copying 3 resources

[INFO] 
[INFO] --- maven-compiler-plugin:2.3.2:testCompile (default-testCompile) @ maven-classic-skin
---[INFO] No sources to compile

[INFO] 
[INFO] --- maven-surefire-plugin:2.9:test (default-test) @ maven-classic-skin ---[INFO] Surefire
report directory: <https://builds.apache.org/job/maven-skins/ws/maven-classic-skin/target/surefire-reports>

-------------------------------------------------------
 T E S T S
-------------------------------------------------------


Results :

Tests run: 0, Failures: 0, Errors: 0, Skipped: 0

[JENKINS] Recording test results
[INFO] 
[INFO] --- maven-jar-plugin:2.3.1:jar (default-jar) @ maven-classic-skin ---[INFO] Building
jar: <https://builds.apache.org/job/maven-skins/ws/maven-classic-skin/target/maven-classic-skin-1.1-SNAPSHOT.jar>

[INFO] 
[INFO] --- maven-site-plugin:3.0:attach-descriptor (attach-descriptor) @ maven-classic-skin
---
[INFO] 
[INFO] --- maven-invoker-plugin:1.5:install (integration-test) @ maven-classic-skin ---[INFO]
Installing <https://builds.apache.org/job/maven-skins/ws/pom.xml> to <https://builds.apache.org/job/maven-skins/ws/maven-classic-skin/target/local-repo/org/apache/maven/skins/maven-skins/6-SNAPSHOT/maven-skins-6-SNAPSHOT.pom>
[INFO] Installing <https://builds.apache.org/job/maven-skins/ws/maven-classic-skin/pom.xml>
to <https://builds.apache.org/job/maven-skins/ws/maven-classic-skin/target/local-repo/org/apache/maven/skins/maven-classic-skin/1.1-SNAPSHOT/maven-classic-skin-1.1-SNAPSHOT.pom>
[INFO] Installing <https://builds.apache.org/job/maven-skins/ws/maven-classic-skin/target/maven-classic-skin-1.1-SNAPSHOT.jar>
to <https://builds.apache.org/job/maven-skins/ws/maven-classic-skin/target/local-repo/org/apache/maven/skins/maven-classic-skin/1.1-SNAPSHOT/maven-classic-skin-1.1-SNAPSHOT.jar>

[INFO] 
[INFO] --- maven-invoker-plugin:1.5:integration-test (integration-test) @ maven-classic-skin
---[INFO] Building: sample/pom.xml

[INFO] ..SUCCESS (23.1 s)
[INFO] [INFO] -------------------------------------------------
[INFO] Build Summary:
[INFO]   Passed: 1, Failed: 0, Errors: 0, Skipped: 0
[INFO] -------------------------------------------------

[INFO] --- maven-invoker-plugin:1.5:verify (integration-test) @ maven-classic-skin ---
[INFO] 
[INFO] Installing <https://builds.apache.org/job/maven-skins/ws/maven-classic-skin/target/maven-classic-skin-1.1-SNAPSHOT.jar>
to /export/home/hudson/.m2/repository/org/apache/maven/skins/maven-classic-skin/1.1-SNAPSHOT/maven-classic-skin-1.1-SNAPSHOT.jar
[INFO] --- maven-install-plugin:2.3.1:install (default-install) @ maven-classic-skin ---[INFO]
Installing <https://builds.apache.org/job/maven-skins/ws/maven-classic-skin/pom.xml>
to /export/home/hudson/.m2/repository/org/apache/maven/skins/maven-classic-skin/1.1-SNAPSHOT/maven-classic-skin-1.1-SNAPSHOT.pom

[JENKINS] Archiving <https://builds.apache.org/job/maven-skins/ws/maven-classic-skin/pom.xml>
to /home/hudson/hudson/jobs/maven-skins/modules/org.apache.maven.skins$maven-classic-skin/builds/2011-10-22_06-14-24/archive/org.apache.maven.skins/maven-classic-skin/1.1-SNAPSHOT/maven-classic-skin-1.1-SNAPSHOT.pom
[JENKINS] Archiving <https://builds.apache.org/job/maven-skins/ws/maven-classic-skin/target/maven-classic-skin-1.1-SNAPSHOT.jar>
to /home/hudson/hudson/jobs/maven-skins/modules/org.apache.maven.skins$maven-classic-skin/builds/2011-10-22_06-14-24/archive/org.apache.maven.skins/maven-classic-skin/1.1-SNAPSHOT/maven-classic-skin-1.1-SNAPSHOT.jar
[INFO]                                                                         
[INFO] ------------------------------------------------------------------------
[INFO] Building Maven Site Skin 1.4-SNAPSHOT
[INFO] ------------------------------------------------------------------------[INFO] Deleting
file set: <https://builds.apache.org/job/maven-skins/ws/maven-stylus-skin/target> (included:
[**], excluded: [])

[INFO] 
[INFO] --- maven-clean-plugin:2.3:clean (default-clean) @ maven-stylus-skin ---
[INFO] 
[INFO] --- maven-remote-resources-plugin:1.1:process (default) @ maven-stylus-skin ---[INFO]
Setting property: classpath.resource.loader.class => 'org.codehaus.plexus.velocity.ContextClassLoaderResourceLoader'.
[INFO] Setting property: velocimacro.messages.on => 'false'.
[INFO] Setting property: resource.loader => 'classpath'.
[INFO] Setting property: resource.manager.logwhenfound => 'false'.

[INFO] Using 'UTF-8' encoding to copy filtered resources.
[INFO] Copying 24 resources
[INFO] 
[INFO] --- maven-resources-plugin:2.4:resources (default-resources) @ maven-stylus-skin ---[INFO]
Copying 3 resources

[INFO] [INFO] No sources to compile

[INFO] --- maven-compiler-plugin:2.0.2:compile (default-compile) @ maven-stylus-skin ---
[INFO] [INFO] Using 'UTF-8' encoding to copy filtered resources.
[INFO] skip non existing resourceDirectory <https://builds.apache.org/job/maven-skins/ws/maven-stylus-skin/src/test/resources>
[INFO] Copying 3 resources

[INFO] --- maven-resources-plugin:2.4:testResources (default-testResources) @ maven-stylus-skin
---
[INFO] [INFO] No sources to compile

[INFO] --- maven-compiler-plugin:2.0.2:testCompile (default-testCompile) @ maven-stylus-skin
---
[INFO] [INFO] Surefire report directory: <https://builds.apache.org/job/maven-skins/ws/maven-stylus-skin/target/surefire-reports>

-------------------------------------------------------
 T E S T S
-------------------------------------------------------
There are no tests to run.

Results :

Tests run: 0, Failures: 0, Errors: 0, Skipped: 0


[INFO] --- maven-surefire-plugin:2.4.3:test (default-test) @ maven-stylus-skin ---
[JENKINS] Recording test results
[INFO] 
[INFO] --- maven-jar-plugin:2.3:jar (default-jar) @ maven-stylus-skin ---
[INFO] Building jar: <https://builds.apache.org/job/maven-skins/ws/maven-stylus-skin/target/maven-stylus-skin-1.4-SNAPSHOT.jar>
[INFO] [INFO] Installing <https://builds.apache.org/job/maven-skins/ws/maven-stylus-skin/pom.xml>
to <https://builds.apache.org/job/maven-skins/ws/maven-stylus-skin/target/local-repo/org/apache/maven/skins/maven-stylus-skin/1.4-SNAPSHOT/maven-stylus-skin-1.4-SNAPSHOT.pom>
[INFO] Installing <https://builds.apache.org/job/maven-skins/ws/maven-stylus-skin/target/maven-stylus-skin-1.4-SNAPSHOT.jar>
to <https://builds.apache.org/job/maven-skins/ws/maven-stylus-skin/target/local-repo/org/apache/maven/skins/maven-stylus-skin/1.4-SNAPSHOT/maven-stylus-skin-1.4-SNAPSHOT.jar>

[INFO] --- maven-invoker-plugin:1.5:install (integration-test) @ maven-stylus-skin ---
[INFO] 
[INFO] --- maven-invoker-plugin:1.5:integration-test (integration-test) @ maven-stylus-skin
---
[INFO] Building: sample/pom.xml
[INFO] ..SUCCESS (29.6 s)
[INFO] [INFO] -------------------------------------------------
[INFO] Build Summary:
[INFO]   Passed: 1, Failed: 0, Errors: 0, Skipped: 0
[INFO] -------------------------------------------------

[INFO] --- maven-invoker-plugin:1.5:verify (integration-test) @ maven-stylus-skin ---
[INFO] 
[INFO] --- maven-install-plugin:2.3:install (default-install) @ maven-stylus-skin ---
[INFO] Installing <https://builds.apache.org/job/maven-skins/ws/maven-stylus-skin/target/maven-stylus-skin-1.4-SNAPSHOT.jar>
to /export/home/hudson/.m2/repository/org/apache/maven/skins/maven-stylus-skin/1.4-SNAPSHOT/maven-stylus-skin-1.4-SNAPSHOT.jar
[INFO] Installing <https://builds.apache.org/job/maven-skins/ws/maven-stylus-skin/pom.xml>
to /export/home/hudson/.m2/repository/org/apache/maven/skins/maven-stylus-skin/1.4-SNAPSHOT/maven-stylus-skin-1.4-SNAPSHOT.pom
[JENKINS] Archiving <https://builds.apache.org/job/maven-skins/ws/maven-stylus-skin/pom.xml>
to /home/hudson/hudson/jobs/maven-skins/modules/org.apache.maven.skins$maven-stylus-skin/builds/2011-10-22_06-14-24/archive/org.apache.maven.skins/maven-stylus-skin/1.4-SNAPSHOT/maven-stylus-skin-1.4-SNAPSHOT.pom
[JENKINS] Archiving <https://builds.apache.org/job/maven-skins/ws/maven-stylus-skin/target/maven-stylus-skin-1.4-SNAPSHOT.jar>
to /home/hudson/hudson/jobs/maven-skins/modules/org.apache.maven.skins$maven-stylus-skin/builds/2011-10-22_06-14-24/archive/org.apache.maven.skins/maven-stylus-skin/1.4-SNAPSHOT/maven-stylus-skin-1.4-SNAPSHOT.jar
[INFO] ------------------------------------------------------------------------
[INFO] Reactor Summary:
[INFO] 
[INFO] Maven Skins ....................................... SUCCESS [1:13.979s]
[INFO] Maven Application Skin ............................ SUCCESS [1:00.604s]
[INFO] Maven Default Skin ................................ SUCCESS [38.979s]
[INFO] Maven Classic Skin ................................ SUCCESS [50.595s]
[INFO] Maven Site Skin ................................... SUCCESS [1:29.943s]
[INFO] ------------------------------------------------------------------------
[INFO] BUILD SUCCESS
[INFO] ------------------------------------------------------------------------
[INFO] Total time: 7:12.616s
[INFO] Finished at: Sat Oct 22 07:26:33 GMT+00:00 2011
[INFO] Final Memory: 17M/208M
[INFO] ------------------------------------------------------------------------
channel stopped
Maven RedeployPublished use remote solaris1 maven settings from : /export/home/hudson/.m2/settings.xml
[INFO] Deployment in https://repository.apache.org/content/repositories/snapshots (id=,uniqueVersion=true)
Deploying the main artifact maven-application-skin-1.0-SNAPSHOT.jar
Downloading: https://repository.apache.org/content/repositories/snapshots/org/apache/maven/skins/maven-application-skin/1.0-SNAPSHOT/maven-metadata.xml
Downloaded: https://repository.apache.org/content/repositories/snapshots/org/apache/maven/skins/maven-application-skin/1.0-SNAPSHOT/maven-metadata.xml
(1001 B at 1.0 KB/sec)
Uploading: https://repository.apache.org/content/repositories/snapshots/org/apache/maven/skins/maven-application-skin/1.0-SNAPSHOT/maven-application-skin-1.0-20111022.062350-16.jar
Uploading: https://repository.apache.org/content/repositories/snapshots/org/apache/maven/skins/maven-application-skin/1.0-SNAPSHOT/maven-application-skin-1.0-20111022.062350-16.pom
ERROR: Failed to deploy artifacts: Could not transfer artifact org.apache.maven.skins:maven-application-skin:jar:1.0-20111022.062350-16
from/to  (https://repository.apache.org/content/repositories/snapshots): Failed to transfer
file: https://repository.apache.org/content/repositories/snapshots/org/apache/maven/skins/maven-application-skin/1.0-SNAPSHOT/maven-application-skin-1.0-20111022.062350-16.jar.
Return code is: 401
org.apache.maven.artifact.deployer.ArtifactDeploymentException: Failed to deploy artifacts:
Could not transfer artifact org.apache.maven.skins:maven-application-skin:jar:1.0-20111022.062350-16
from/to  (https://repository.apache.org/content/repositories/snapshots): Failed to transfer
file: https://repository.apache.org/content/repositories/snapshots/org/apache/maven/skins/maven-application-skin/1.0-SNAPSHOT/maven-application-skin-1.0-20111022.062350-16.jar.
Return code is: 401
	at org.apache.maven.artifact.deployer.DefaultArtifactDeployer.deploy(DefaultArtifactDeployer.java:141)
	at hudson.maven.reporters.MavenArtifactRecord.deploy(MavenArtifactRecord.java:189)
	at hudson.maven.RedeployPublisher.perform(RedeployPublisher.java:158)
	at hudson.tasks.BuildStepMonitor$1.perform(BuildStepMonitor.java:19)
	at hudson.model.AbstractBuild$AbstractRunner.perform(AbstractBuild.java:693)
	at hudson.model.AbstractBuild$AbstractRunner.performAllBuildSteps(AbstractBuild.java:668)
	at hudson.maven.MavenModuleSetBuild$RunnerImpl.post2(MavenModuleSetBuild.java:953)
	at hudson.model.AbstractBuild$AbstractRunner.post(AbstractBuild.java:615)
	at hudson.model.Run.run(Run.java:1401)
	at hudson.maven.MavenModuleSetBuild.run(MavenModuleSetBuild.java:474)
	at hudson.model.ResourceController.execute(ResourceController.java:88)
	at hudson.model.Executor.run(Executor.java:230)
Caused by: org.sonatype.aether.deployment.DeploymentException: Failed to deploy artifacts:
Could not transfer artifact org.apache.maven.skins:maven-application-skin:jar:1.0-20111022.062350-16
from/to  (https://repository.apache.org/content/repositories/snapshots): Failed to transfer
file: https://repository.apache.org/content/repositories/snapshots/org/apache/maven/skins/maven-application-skin/1.0-SNAPSHOT/maven-application-skin-1.0-20111022.062350-16.jar.
Return code is: 401
	at org.sonatype.aether.impl.internal.DefaultDeployer.deploy(DefaultDeployer.java:284)
	at org.sonatype.aether.impl.internal.DefaultDeployer.deploy(DefaultDeployer.java:215)
	at org.sonatype.aether.impl.internal.DefaultRepositorySystem.deploy(DefaultRepositorySystem.java:480)
	at org.apache.maven.artifact.deployer.DefaultArtifactDeployer.deploy(DefaultArtifactDeployer.java:137)
	... 11 more
Caused by: org.sonatype.aether.transfer.ArtifactTransferException: Could not transfer artifact
org.apache.maven.skins:maven-application-skin:jar:1.0-20111022.062350-16 from/to  (https://repository.apache.org/content/repositories/snapshots):
Failed to transfer file: https://repository.apache.org/content/repositories/snapshots/org/apache/maven/skins/maven-application-skin/1.0-SNAPSHOT/maven-application-skin-1.0-20111022.062350-16.jar.
Return code is: 401
	at org.sonatype.aether.connector.wagon.WagonRepositoryConnector$4.wrap(WagonRepositoryConnector.java:949)
	at org.sonatype.aether.connector.wagon.WagonRepositoryConnector$4.wrap(WagonRepositoryConnector.java:940)
	at org.sonatype.aether.connector.wagon.WagonRepositoryConnector$PutTask.flush(WagonRepositoryConnector.java:864)
	at org.sonatype.aether.connector.wagon.WagonRepositoryConnector.put(WagonRepositoryConnector.java:466)
	at org.sonatype.aether.impl.internal.DefaultDeployer.deploy(DefaultDeployer.java:278)
	... 14 more
Caused by: org.apache.maven.wagon.TransferFailedException: Failed to transfer file: https://repository.apache.org/content/repositories/snapshots/org/apache/maven/skins/maven-application-skin/1.0-SNAPSHOT/maven-application-skin-1.0-20111022.062350-16.jar.
Return code is: 401
	at org.apache.maven.wagon.shared.http.AbstractHttpClientWagon.put(AbstractHttpClientWagon.java:368)
	at org.apache.maven.wagon.shared.http.AbstractHttpClientWagon.put(AbstractHttpClientWagon.java:280)
	at org.sonatype.aether.connector.wagon.WagonRepositoryConnector$PutTask.run(WagonRepositoryConnector.java:825)
	at org.sonatype.aether.connector.wagon.WagonRepositoryConnector.put(WagonRepositoryConnector.java:465)
	... 15 more
[INFO] Deployment failed after 6 sec
Build step 'Deploy artifacts to Maven repository' changed build result to FAILURE


Mime
View raw message