maven-notifications mailing list archives

Site index · List index
Message view « Date » · « Thread »
Top « Date » · « Thread »
From Apache Jenkins Server <jenk...@builds.apache.org>
Subject Build failed in Jenkins: maven-plugin-tools #18
Date Mon, 03 Oct 2011 23:08:27 GMT
See <https://builds.apache.org/job/maven-plugin-tools/18/changes>

Changes:

[hboutemy] removed unused import

------------------------------------------
[...truncated 291 lines...]

[JENKINS] Recording test results
[INFO] 
[INFO] --- maven-jar-plugin:2.3.1:jar (default-jar) @ maven-plugin-tools-java ---
[INFO] Building jar: <https://builds.apache.org/job/maven-plugin-tools/ws/maven-plugin-tools-java/target/maven-plugin-tools-java-2.10-SNAPSHOT.jar>
[INFO] 
[INFO] --- maven-site-plugin:3.0:attach-descriptor (attach-descriptor) @ maven-plugin-tools-java
---
[INFO] Installing <https://builds.apache.org/job/maven-plugin-tools/ws/maven-plugin-tools-java/target/maven-plugin-tools-java-2.10-SNAPSHOT.jar>
to <https://builds.apache.org/job/maven-plugin-tools/ws/.repository/org/apache/maven/plugin-tools/maven-plugin-tools-java/2.10-SNAPSHOT/maven-plugin-tools-java-2.10-SNAPSHOT.jar>
[INFO] 
[INFO] --- maven-install-plugin:2.3.1:install (default-install) @ maven-plugin-tools-java
---
[INFO] Installing <https://builds.apache.org/job/maven-plugin-tools/ws/maven-plugin-tools-java/pom.xml>
to <https://builds.apache.org/job/maven-plugin-tools/ws/.repository/org/apache/maven/plugin-tools/maven-plugin-tools-java/2.10-SNAPSHOT/maven-plugin-tools-java-2.10-SNAPSHOT.pom>
[JENKINS] Archiving <https://builds.apache.org/job/maven-plugin-tools/ws/maven-plugin-tools-java/pom.xml>
to /home/hudson/hudson/jobs/maven-plugin-tools/modules/org.apache.maven.plugin-tools$maven-plugin-tools-java/builds/2011-10-03_23-03-46/archive/org.apache.maven.plugin-tools/maven-plugin-tools-java/2.10-SNAPSHOT/maven-plugin-tools-java-2.10-SNAPSHOT.pom
[JENKINS] Archiving <https://builds.apache.org/job/maven-plugin-tools/ws/maven-plugin-tools-java/target/maven-plugin-tools-java-2.10-SNAPSHOT.jar>
to /home/hudson/hudson/jobs/maven-plugin-tools/modules/org.apache.maven.plugin-tools$maven-plugin-tools-java/builds/2011-10-03_23-03-46/archive/org.apache.maven.plugin-tools/maven-plugin-tools-java/2.10-SNAPSHOT/maven-plugin-tools-java-2.10-SNAPSHOT.jar
[INFO]                                                                         
[INFO] ------------------------------------------------------------------------
[INFO] Building Maven Plugin Tool for Beanshell 2.10-SNAPSHOT
[INFO] ------------------------------------------------------------------------
[INFO] [INFO] Deleting <https://builds.apache.org/job/maven-plugin-tools/ws/maven-plugin-tools-beanshell/target>

[INFO] --- maven-clean-plugin:2.4.1:clean (default-clean) @ maven-plugin-tools-beanshell ---
[INFO] 
[INFO] --- maven-remote-resources-plugin:1.2.1:process (default) @ maven-plugin-tools-beanshell
---
[INFO] [debug] execute contextualize
[INFO] Using 'UTF-8' encoding to copy filtered resources.

[INFO] --- maven-resources-plugin:2.5:resources (default-resources) @ maven-plugin-tools-beanshell
---
[INFO] Copying 2 resources
[INFO] Copying 3 resources
[INFO] 
[INFO] --- maven-compiler-plugin:2.3.2:compile (default-compile) @ maven-plugin-tools-beanshell
---
[INFO] Compiling 1 source file to <https://builds.apache.org/job/maven-plugin-tools/ws/maven-plugin-tools-beanshell/target/classes>
[INFO] [debug] execute contextualize
[INFO] Using 'UTF-8' encoding to copy filtered resources.
[INFO] skip non existing resourceDirectory <https://builds.apache.org/job/maven-plugin-tools/ws/maven-plugin-tools-beanshell/src/test/resources>

[INFO] --- maven-resources-plugin:2.5:testResources (default-testResources) @ maven-plugin-tools-beanshell
---
[INFO] Copying 3 resources
[INFO] [INFO] No sources to compile

[INFO] --- maven-compiler-plugin:2.3.2:testCompile (default-testCompile) @ maven-plugin-tools-beanshell
---
[INFO] Surefire report directory: <https://builds.apache.org/job/maven-plugin-tools/ws/maven-plugin-tools-beanshell/target/surefire-reports>
[INFO] 
[INFO] --- maven-surefire-plugin:2.9:test (default-test) @ maven-plugin-tools-beanshell ---

-------------------------------------------------------
 T E S T S
-------------------------------------------------------

Results :

Tests run: 0, Failures: 0, Errors: 0, Skipped: 0

[JENKINS] Recording test results
[INFO] 
[INFO] --- maven-jar-plugin:2.3.1:jar (default-jar) @ maven-plugin-tools-beanshell ---
[INFO] Building jar: <https://builds.apache.org/job/maven-plugin-tools/ws/maven-plugin-tools-beanshell/target/maven-plugin-tools-beanshell-2.10-SNAPSHOT.jar>
[INFO] 
[INFO] --- maven-site-plugin:3.0:attach-descriptor (attach-descriptor) @ maven-plugin-tools-beanshell
---
[INFO] 
[INFO] [INFO] Installing <https://builds.apache.org/job/maven-plugin-tools/ws/maven-plugin-tools-beanshell/target/maven-plugin-tools-beanshell-2.10-SNAPSHOT.jar>
to <https://builds.apache.org/job/maven-plugin-tools/ws/.repository/org/apache/maven/plugin-tools/maven-plugin-tools-beanshell/2.10-SNAPSHOT/maven-plugin-tools-beanshell-2.10-SNAPSHOT.jar>
--- maven-install-plugin:2.3.1:install (default-install) @ maven-plugin-tools-beanshell ---
[INFO] Installing <https://builds.apache.org/job/maven-plugin-tools/ws/maven-plugin-tools-beanshell/pom.xml>
to <https://builds.apache.org/job/maven-plugin-tools/ws/.repository/org/apache/maven/plugin-tools/maven-plugin-tools-beanshell/2.10-SNAPSHOT/maven-plugin-tools-beanshell-2.10-SNAPSHOT.pom>
[JENKINS] Archiving <https://builds.apache.org/job/maven-plugin-tools/ws/maven-plugin-tools-beanshell/pom.xml>
to /home/hudson/hudson/jobs/maven-plugin-tools/modules/org.apache.maven.plugin-tools$maven-plugin-tools-beanshell/builds/2011-10-03_23-03-46/archive/org.apache.maven.plugin-tools/maven-plugin-tools-beanshell/2.10-SNAPSHOT/maven-plugin-tools-beanshell-2.10-SNAPSHOT.pom
[JENKINS] Archiving <https://builds.apache.org/job/maven-plugin-tools/ws/maven-plugin-tools-beanshell/target/maven-plugin-tools-beanshell-2.10-SNAPSHOT.jar>
to /home/hudson/hudson/jobs/maven-plugin-tools/modules/org.apache.maven.plugin-tools$maven-plugin-tools-beanshell/builds/2011-10-03_23-03-46/archive/org.apache.maven.plugin-tools/maven-plugin-tools-beanshell/2.10-SNAPSHOT/maven-plugin-tools-beanshell-2.10-SNAPSHOT.jar
[INFO]                                                                         
[INFO] ------------------------------------------------------------------------
[INFO] Building Maven Plugin Plugin 2.10-SNAPSHOT
[INFO] ------------------------------------------------------------------------
[INFO] 
[INFO] --- maven-clean-plugin:2.4.1:clean (default-clean) @ maven-plugin-plugin ---
[INFO] Deleting <https://builds.apache.org/job/maven-plugin-tools/ws/maven-plugin-plugin/target>
[INFO] 
[INFO] --- maven-enforcer-plugin:1.0.1:enforce (ensure-no-container-api) @ maven-plugin-plugin
---
[INFO] 
[INFO] --- maven-plugin-plugin:2.8:helpmojo (generated-helpmojo) @ maven-plugin-plugin ---
[INFO] Using 'UTF-8' encoding to read mojo metadata.
[INFO] Applying mojo extractor for language: java
[INFO] Mojo extractor for language: java found 6 mojo descriptors.
[INFO] Applying mojo extractor for language: bsh
[INFO] Mojo extractor for language: bsh found 0 mojo descriptors.
[INFO] 
[INFO] outputDirectory: <https://builds.apache.org/job/maven-plugin-tools/ws/maven-plugin-plugin/target/generated-sources/modello>
[INFO] Working on model: src/main/mdo/pluginRequirements.mdo
[INFO] --- modello-maven-plugin:1.4.1:java (default) @ maven-plugin-plugin ---
[INFO] Generating current version: 1.0.0
[INFO] [INFO] Using 'UTF-8' encoding to read mojo metadata.
[INFO] Applying mojo extractor for language: java

[INFO] --- maven-plugin-plugin:2.8:descriptor (default-descriptor) @ maven-plugin-plugin ---
[INFO] Mojo extractor for language: java found 7 mojo descriptors.
[INFO] Applying mojo extractor for language: bsh
[INFO] Mojo extractor for language: bsh found 0 mojo descriptors.
[INFO] 
[INFO] --- maven-remote-resources-plugin:1.2.1:process (default) @ maven-plugin-plugin ---
[debug] execute contextualize
[INFO] Using 'UTF-8' encoding to copy filtered resources.
[INFO] 
[INFO] --- maven-resources-plugin:2.5:resources (default-resources) @ maven-plugin-plugin
---
[INFO] Copying 5 resources
[INFO] Copying 3 resources
[INFO] 
[INFO] --- maven-compiler-plugin:2.3.2:compile (default-compile) @ maven-plugin-plugin ---
[INFO] Compiling 9 source files to <https://builds.apache.org/job/maven-plugin-tools/ws/maven-plugin-plugin/target/classes>
[INFO] [debug] execute contextualize
[INFO] Using 'UTF-8' encoding to copy filtered resources.

[INFO] skip non existing resourceDirectory <https://builds.apache.org/job/maven-plugin-tools/ws/maven-plugin-plugin/src/test/resources>
[INFO] --- maven-resources-plugin:2.5:testResources (default-testResources) @ maven-plugin-plugin
---[INFO] Copying 3 resources

[INFO] 
[INFO] --- maven-compiler-plugin:2.3.2:testCompile (default-testCompile) @ maven-plugin-plugin
---
[INFO] No sources to compile
[INFO] 
[INFO] [INFO] Surefire report directory: <https://builds.apache.org/job/maven-plugin-tools/ws/maven-plugin-plugin/target/surefire-reports>
--- maven-surefire-plugin:2.9:test (default-test) @ maven-plugin-plugin ---

-------------------------------------------------------
 T E S T S
-------------------------------------------------------

Results :

Tests run: 0, Failures: 0, Errors: 0, Skipped: 0

[JENKINS] Recording test results
[INFO] 
[INFO] --- maven-jar-plugin:2.3.1:jar (default-jar) @ maven-plugin-plugin ---
[INFO] Building jar: <https://builds.apache.org/job/maven-plugin-tools/ws/maven-plugin-plugin/target/maven-plugin-plugin-2.10-SNAPSHOT.jar>
[INFO] 
[INFO] --- maven-plugin-plugin:2.8:addPluginArtifactMetadata (default-addPluginArtifactMetadata)
@ maven-plugin-plugin ---
[INFO] 
[INFO] --- maven-install-plugin:2.3.1:install (default-install) @ maven-plugin-plugin ---
[INFO] Installing <https://builds.apache.org/job/maven-plugin-tools/ws/maven-plugin-plugin/target/maven-plugin-plugin-2.10-SNAPSHOT.jar>
to <https://builds.apache.org/job/maven-plugin-tools/ws/.repository/org/apache/maven/plugins/maven-plugin-plugin/2.10-SNAPSHOT/maven-plugin-plugin-2.10-SNAPSHOT.jar>
[INFO] Installing <https://builds.apache.org/job/maven-plugin-tools/ws/maven-plugin-plugin/pom.xml>
to <https://builds.apache.org/job/maven-plugin-tools/ws/.repository/org/apache/maven/plugins/maven-plugin-plugin/2.10-SNAPSHOT/maven-plugin-plugin-2.10-SNAPSHOT.pom>
[JENKINS] Archiving <https://builds.apache.org/job/maven-plugin-tools/ws/maven-plugin-plugin/pom.xml>
to /home/hudson/hudson/jobs/maven-plugin-tools/modules/org.apache.maven.plugins$maven-plugin-plugin/builds/2011-10-03_23-03-46/archive/org.apache.maven.plugins/maven-plugin-plugin/2.10-SNAPSHOT/maven-plugin-plugin-2.10-SNAPSHOT.pom
[JENKINS] Archiving <https://builds.apache.org/job/maven-plugin-tools/ws/maven-plugin-plugin/target/maven-plugin-plugin-2.10-SNAPSHOT.jar>
to /home/hudson/hudson/jobs/maven-plugin-tools/modules/org.apache.maven.plugins$maven-plugin-plugin/builds/2011-10-03_23-03-46/archive/org.apache.maven.plugins/maven-plugin-plugin/2.10-SNAPSHOT/maven-plugin-plugin-2.10-SNAPSHOT.jar
[INFO]                                                                         
[INFO] ------------------------------------------------------------------------
[INFO] Building Maven Plugin Tools Javadoc 2.10-SNAPSHOT
[INFO] ------------------------------------------------------------------------
[INFO] Deleting <https://builds.apache.org/job/maven-plugin-tools/ws/maven-plugin-tools-javadoc/target>
[INFO] 
[INFO] --- maven-clean-plugin:2.4.1:clean (default-clean) @ maven-plugin-tools-javadoc ---
[INFO] 
[INFO] --- maven-remote-resources-plugin:1.2.1:process (default) @ maven-plugin-tools-javadoc
---
[INFO] [debug] execute contextualize

[INFO] --- maven-resources-plugin:2.5:resources (default-resources) @ maven-plugin-tools-javadoc
---
[INFO] Using 'UTF-8' encoding to copy filtered resources.
[INFO] skip non existing resourceDirectory <https://builds.apache.org/job/maven-plugin-tools/ws/maven-plugin-tools-javadoc/src/main/resources>
[INFO] Copying 3 resources
[INFO] 
[INFO] --- maven-compiler-plugin:2.3.2:compile (default-compile) @ maven-plugin-tools-javadoc
---
[INFO] Compiling 22 source files to <https://builds.apache.org/job/maven-plugin-tools/ws/maven-plugin-tools-javadoc/target/classes>
[INFO] 
[INFO] --- maven-resources-plugin:2.5:testResources (default-testResources) @ maven-plugin-tools-javadoc
---[debug] execute contextualize

[INFO] Using 'UTF-8' encoding to copy filtered resources.
[INFO] skip non existing resourceDirectory <https://builds.apache.org/job/maven-plugin-tools/ws/maven-plugin-tools-javadoc/src/test/resources>
[INFO] Copying 3 resources
[INFO] No sources to compile
[INFO] 
[INFO] --- maven-compiler-plugin:2.3.2:testCompile (default-testCompile) @ maven-plugin-tools-javadoc
---
[INFO] Surefire report directory: <https://builds.apache.org/job/maven-plugin-tools/ws/maven-plugin-tools-javadoc/target/surefire-reports>
[INFO] 
[INFO] --- maven-surefire-plugin:2.9:test (default-test) @ maven-plugin-tools-javadoc ---

-------------------------------------------------------
 T E S T S
-------------------------------------------------------

Results :

Tests run: 0, Failures: 0, Errors: 0, Skipped: 0

[JENKINS] Recording test results
[INFO] 
[INFO] --- maven-jar-plugin:2.3.1:jar (default-jar) @ maven-plugin-tools-javadoc ---
[INFO] Building jar: <https://builds.apache.org/job/maven-plugin-tools/ws/maven-plugin-tools-javadoc/target/maven-plugin-tools-javadoc-2.10-SNAPSHOT.jar>
[INFO] 
[INFO] --- maven-site-plugin:3.0:attach-descriptor (attach-descriptor) @ maven-plugin-tools-javadoc
---
[INFO] Installing <https://builds.apache.org/job/maven-plugin-tools/ws/maven-plugin-tools-javadoc/target/maven-plugin-tools-javadoc-2.10-SNAPSHOT.jar>
to <https://builds.apache.org/job/maven-plugin-tools/ws/.repository/org/apache/maven/plugin-tools/maven-plugin-tools-javadoc/2.10-SNAPSHOT/maven-plugin-tools-javadoc-2.10-SNAPSHOT.jar>
[INFO] 
[INFO] --- maven-install-plugin:2.3.1:install (default-install) @ maven-plugin-tools-javadoc
---
[INFO] Installing <https://builds.apache.org/job/maven-plugin-tools/ws/maven-plugin-tools-javadoc/pom.xml>
to <https://builds.apache.org/job/maven-plugin-tools/ws/.repository/org/apache/maven/plugin-tools/maven-plugin-tools-javadoc/2.10-SNAPSHOT/maven-plugin-tools-javadoc-2.10-SNAPSHOT.pom>
[JENKINS] Archiving <https://builds.apache.org/job/maven-plugin-tools/ws/maven-plugin-tools-javadoc/pom.xml>
to /home/hudson/hudson/jobs/maven-plugin-tools/modules/org.apache.maven.plugin-tools$maven-plugin-tools-javadoc/builds/2011-10-03_23-03-46/archive/org.apache.maven.plugin-tools/maven-plugin-tools-javadoc/2.10-SNAPSHOT/maven-plugin-tools-javadoc-2.10-SNAPSHOT.pom
[JENKINS] Archiving <https://builds.apache.org/job/maven-plugin-tools/ws/maven-plugin-tools-javadoc/target/maven-plugin-tools-javadoc-2.10-SNAPSHOT.jar>
to /home/hudson/hudson/jobs/maven-plugin-tools/modules/org.apache.maven.plugin-tools$maven-plugin-tools-javadoc/builds/2011-10-03_23-03-46/archive/org.apache.maven.plugin-tools/maven-plugin-tools-javadoc/2.10-SNAPSHOT/maven-plugin-tools-javadoc-2.10-SNAPSHOT.jar
[INFO] ------------------------------------------------------------------------
[INFO] Reactor Summary:
[INFO] 
[INFO] Maven Plugin Tools ................................ SUCCESS [1:13.031s]
[INFO] Maven Plugin Tools APIs ........................... SUCCESS [1:18.348s]
[INFO] Maven Plugin Metadata Model ....................... SUCCESS [19.317s]
[INFO] Maven Plugin Tool for Ant ......................... SUCCESS [13.801s]
[INFO] Maven Plugin Tool for Java ........................ SUCCESS [12.417s]
[INFO] Maven Plugin Tool for Beanshell ................... SUCCESS [6.841s]
[INFO] Maven Plugin Plugin ............................... SUCCESS [31.940s]
[INFO] Maven Plugin Tools Javadoc ........................ SUCCESS [26.107s]
[INFO] ------------------------------------------------------------------------
[INFO] BUILD SUCCESS
[INFO] ------------------------------------------------------------------------
[INFO] Total time: 4:25.407s
[INFO] Finished at: Mon Oct 03 19:08:23 EDT 2011
[INFO] Final Memory: 25M/165M
[INFO] ------------------------------------------------------------------------
Waiting for Jenkins to finish collecting data
channel stopped
Maven RedeployPublished use remote solaris2 maven settings from : /export/home/hudson/.m2/settings.xml
[INFO] Deployment in https://repository.apache.org/content/repositories/snapshots (id=,uniqueVersion=true)
Deploying the main artifact maven-plugin-tools-2.10-SNAPSHOT.pom
Downloading: https://repository.apache.org/content/repositories/snapshots/org/apache/maven/plugin-tools/maven-plugin-tools/2.10-SNAPSHOT/maven-metadata.xml
Downloaded: https://repository.apache.org/content/repositories/snapshots/org/apache/maven/plugin-tools/maven-plugin-tools/2.10-SNAPSHOT/maven-metadata.xml
(832 B at 0.4 KB/sec)
Uploading: https://repository.apache.org/content/repositories/snapshots/org/apache/maven/plugin-tools/maven-plugin-tools/2.10-SNAPSHOT/maven-plugin-tools-2.10-20111003.230826-4.pom
Uploading: https://repository.apache.org/content/repositories/snapshots/org/apache/maven/plugin-tools/maven-plugin-tools/2.10-SNAPSHOT/maven-plugin-tools-2.10-20111003.230826-4.pom
ERROR: Failed to deploy artifacts: Could not transfer artifact org.apache.maven.plugin-tools:maven-plugin-tools:pom:2.10-20111003.230826-4
from/to  (https://repository.apache.org/content/repositories/snapshots): Failed to transfer
file: https://repository.apache.org/content/repositories/snapshots/org/apache/maven/plugin-tools/maven-plugin-tools/2.10-SNAPSHOT/maven-plugin-tools-2.10-20111003.230826-4.pom.
Return code is: 401
org.apache.maven.artifact.deployer.ArtifactDeploymentException: Failed to deploy artifacts:
Could not transfer artifact org.apache.maven.plugin-tools:maven-plugin-tools:pom:2.10-20111003.230826-4
from/to  (https://repository.apache.org/content/repositories/snapshots): Failed to transfer
file: https://repository.apache.org/content/repositories/snapshots/org/apache/maven/plugin-tools/maven-plugin-tools/2.10-SNAPSHOT/maven-plugin-tools-2.10-20111003.230826-4.pom.
Return code is: 401
	at org.apache.maven.artifact.deployer.DefaultArtifactDeployer.deploy(DefaultArtifactDeployer.java:141)
	at hudson.maven.reporters.MavenArtifactRecord.deploy(MavenArtifactRecord.java:189)
	at hudson.maven.RedeployPublisher.perform(RedeployPublisher.java:158)
	at hudson.tasks.BuildStepMonitor$1.perform(BuildStepMonitor.java:19)
	at hudson.model.AbstractBuild$AbstractRunner.perform(AbstractBuild.java:693)
	at hudson.model.AbstractBuild$AbstractRunner.performAllBuildSteps(AbstractBuild.java:668)
	at hudson.maven.MavenModuleSetBuild$RunnerImpl.post2(MavenModuleSetBuild.java:953)
	at hudson.model.AbstractBuild$AbstractRunner.post(AbstractBuild.java:615)
	at hudson.model.Run.run(Run.java:1401)
	at hudson.maven.MavenModuleSetBuild.run(MavenModuleSetBuild.java:474)
	at hudson.model.ResourceController.execute(ResourceController.java:88)
	at hudson.model.Executor.run(Executor.java:230)
Caused by: org.sonatype.aether.deployment.DeploymentException: Failed to deploy artifacts:
Could not transfer artifact org.apache.maven.plugin-tools:maven-plugin-tools:pom:2.10-20111003.230826-4
from/to  (https://repository.apache.org/content/repositories/snapshots): Failed to transfer
file: https://repository.apache.org/content/repositories/snapshots/org/apache/maven/plugin-tools/maven-plugin-tools/2.10-SNAPSHOT/maven-plugin-tools-2.10-20111003.230826-4.pom.
Return code is: 401
	at org.sonatype.aether.impl.internal.DefaultDeployer.deploy(DefaultDeployer.java:284)
	at org.sonatype.aether.impl.internal.DefaultDeployer.deploy(DefaultDeployer.java:215)
	at org.sonatype.aether.impl.internal.DefaultRepositorySystem.deploy(DefaultRepositorySystem.java:480)
	at org.apache.maven.artifact.deployer.DefaultArtifactDeployer.deploy(DefaultArtifactDeployer.java:137)
	... 11 more
Caused by: org.sonatype.aether.transfer.ArtifactTransferException: Could not transfer artifact
org.apache.maven.plugin-tools:maven-plugin-tools:pom:2.10-20111003.230826-4 from/to  (https://repository.apache.org/content/repositories/snapshots):
Failed to transfer file: https://repository.apache.org/content/repositories/snapshots/org/apache/maven/plugin-tools/maven-plugin-tools/2.10-SNAPSHOT/maven-plugin-tools-2.10-20111003.230826-4.pom.
Return code is: 401
	at org.sonatype.aether.connector.wagon.WagonRepositoryConnector$4.wrap(WagonRepositoryConnector.java:949)
	at org.sonatype.aether.connector.wagon.WagonRepositoryConnector$4.wrap(WagonRepositoryConnector.java:940)
	at org.sonatype.aether.connector.wagon.WagonRepositoryConnector$PutTask.flush(WagonRepositoryConnector.java:864)
	at org.sonatype.aether.connector.wagon.WagonRepositoryConnector.put(WagonRepositoryConnector.java:466)
	at org.sonatype.aether.impl.internal.DefaultDeployer.deploy(DefaultDeployer.java:278)
	... 14 more
Caused by: org.apache.maven.wagon.TransferFailedException: Failed to transfer file: https://repository.apache.org/content/repositories/snapshots/org/apache/maven/plugin-tools/maven-plugin-tools/2.10-SNAPSHOT/maven-plugin-tools-2.10-20111003.230826-4.pom.
Return code is: 401
	at org.apache.maven.wagon.shared.http.AbstractHttpClientWagon.put(AbstractHttpClientWagon.java:368)
	at org.apache.maven.wagon.shared.http.AbstractHttpClientWagon.put(AbstractHttpClientWagon.java:280)
	at org.sonatype.aether.connector.wagon.WagonRepositoryConnector$PutTask.run(WagonRepositoryConnector.java:825)
	at org.sonatype.aether.connector.wagon.WagonRepositoryConnector.put(WagonRepositoryConnector.java:465)
	... 15 more
[INFO] Deployment failed after 2.3 sec
Build step 'Deploy artifacts to Maven repository' changed build result to FAILURE


Mime
View raw message