maven-notifications mailing list archives

Site index · List index
Message view « Date » · « Thread »
Top « Date » · « Thread »
From Apache Jenkins Server <jenk...@builds.apache.org>
Subject Build failed in Jenkins: doxia » JDK 1.5 (latest),Solaris #66
Date Mon, 17 Oct 2011 12:02:53 GMT
See <https://builds.apache.org/job/doxia/./jdk=JDK%201.5%20(latest),label=Solaris/66/changes>

Changes:

[ltheussl] some java 5 updates

------------------------------------------
[...truncated 1184 lines...]
[INFO] [clean:clean {execution: default-clean}]
[INFO] [plexus:descriptor {execution: default}]
[INFO] [remote-resources:process {execution: default}]
[debug] execute contextualize
[INFO] [resources:resources {execution: default-resources}]
[INFO] Using 'UTF-8' encoding to copy filtered resources.
[INFO] Copying 51 resources
[INFO] skip non existing resourceDirectory /zonestorage/hudson_solaris/home/hudson/hudson-slave/workspace/doxia/jdk/JDK
1.5 (latest)/label/Solaris/doxia-test-docs/target/generated-site/xsd
[INFO] skip non existing resourceDirectory /zonestorage/hudson_solaris/home/hudson/hudson-slave/workspace/doxia/jdk/JDK
1.5 (latest)/label/Solaris/doxia-test-docs/target/generated-resources/plexus
[INFO] Copying 3 resources
[INFO] [compiler:compile {execution: default-compile}]
[INFO] No sources to compile
[debug] execute contextualize
[INFO] [resources:testResources {execution: default-testResources}]
[INFO] Using 'UTF-8' encoding to copy filtered resources.
[INFO] skip non existing resourceDirectory /zonestorage/hudson_solaris/home/hudson/hudson-slave/workspace/doxia/jdk/JDK
1.5 (latest)/label/Solaris/doxia-test-docs/src/test/resources
[INFO] Copying 3 resources
[INFO] [compiler:testCompile {execution: default-testCompile}]
[INFO] No sources to compile
[INFO] [surefire:test {execution: default-test}]
[INFO] Surefire report directory: /zonestorage/hudson_solaris/home/hudson/hudson-slave/workspace/doxia/jdk/JDK
1.5 (latest)/label/Solaris/doxia-test-docs/target/surefire-reports

-------------------------------------------------------
 T E S T S
-------------------------------------------------------

Results :

Tests run: 0, Failures: 0, Errors: 0, Skipped: 0

[INFO] [jar:jar {execution: default-jar}]
[INFO] Building jar: /zonestorage/hudson_solaris/home/hudson/hudson-slave/workspace/doxia/jdk/JDK
1.5 (latest)/label/Solaris/doxia-test-docs/target/doxia-test-docs-1.3-SNAPSHOT.jar
[INFO] Preparing clirr:check
[WARNING] Removing: check from forked lifecycle, to prevent recursive invocation.
[INFO] [plexus:descriptor {execution: default}]
[INFO] [remote-resources:process {execution: default}]
[debug] execute contextualize
[INFO] [resources:resources {execution: default-resources}]
[INFO] Using 'UTF-8' encoding to copy filtered resources.
[INFO] Copying 51 resources
[INFO] skip non existing resourceDirectory /zonestorage/hudson_solaris/home/hudson/hudson-slave/workspace/doxia/jdk/JDK
1.5 (latest)/label/Solaris/doxia-test-docs/target/generated-site/xsd
[INFO] skip non existing resourceDirectory /zonestorage/hudson_solaris/home/hudson/hudson-slave/workspace/doxia/jdk/JDK
1.5 (latest)/label/Solaris/doxia-test-docs/target/generated-resources/plexus
[INFO] Copying 3 resources
[INFO] skip non existing resourceDirectory /zonestorage/hudson_solaris/home/hudson/hudson-slave/workspace/doxia/jdk/JDK
1.5 (latest)/label/Solaris/doxia-test-docs/target/generated-resources/plexus
[INFO] Copying 3 resources
[INFO] [compiler:compile {execution: default-compile}]
[INFO] No sources to compile
[INFO] [clirr:check {execution: default}]
[INFO] Comparing to version: 1.1
[INFO] Succeeded with 0 errors; 0 warnings; and 0 other changes.
[INFO] [install:install {execution: default-install}]
[INFO] Installing /zonestorage/hudson_solaris/home/hudson/hudson-slave/workspace/doxia/jdk/JDK
1.5 (latest)/label/Solaris/doxia-test-docs/target/doxia-test-docs-1.3-SNAPSHOT.jar to /export/home/hudson/.m2/repository/org/apache/maven/doxia/doxia-test-docs/1.3-SNAPSHOT/doxia-test-docs-1.3-SNAPSHOT.jar
[INFO] ------------------------------------------------------------------------
[INFO] Building Doxia :: Core
[INFO]    task-segment: [clean, install]
[INFO] ------------------------------------------------------------------------
[INFO] [clean:clean {execution: default-clean}]
[INFO] [modello:java {execution: descriptor}]
[INFO] outputDirectory: /zonestorage/hudson_solaris/home/hudson/hudson-slave/workspace/doxia/jdk/JDK
1.5 (latest)/label/Solaris/doxia-core/target/generated-sources/modello
[INFO] Working on model: src/main/mdo/document.mdo
[INFO] Generating current version: 1.0.1
[INFO] [modello:xpp3-reader {execution: descriptor}]
[INFO] outputDirectory: /zonestorage/hudson_solaris/home/hudson/hudson-slave/workspace/doxia/jdk/JDK
1.5 (latest)/label/Solaris/doxia-core/target/generated-sources/modello
[INFO] Working on model: src/main/mdo/document.mdo
[INFO] Generating current version: 1.0.1
[INFO] [modello:xpp3-writer {execution: descriptor}]
[INFO] outputDirectory: /zonestorage/hudson_solaris/home/hudson/hudson-slave/workspace/doxia/jdk/JDK
1.5 (latest)/label/Solaris/doxia-core/target/generated-sources/modello
[INFO] Working on model: src/main/mdo/document.mdo
[INFO] Generating current version: 1.0.1
[INFO] [modello:xsd {execution: descriptor}]
[INFO] outputDirectory: /zonestorage/hudson_solaris/home/hudson/hudson-slave/workspace/doxia/jdk/JDK
1.5 (latest)/label/Solaris/doxia-core/target/generated-site/xsd
[INFO] Working on model: src/main/mdo/document.mdo
[INFO] Generating current version: 1.0.1
[INFO] [plexus:descriptor {execution: default}]
[INFO] [remote-resources:process {execution: default}]
[debug] execute contextualize
[INFO] [resources:resources {execution: default-resources}]
[INFO] Using 'UTF-8' encoding to copy filtered resources.
[INFO] Copying 1 resource
[INFO] Copying 1 resource
[INFO] Copying 3 resources
[INFO] [compiler:compile {execution: default-compile}]
[INFO] Compiling 63 source files to /zonestorage/hudson_solaris/home/hudson/hudson-slave/workspace/doxia/jdk/JDK
1.5 (latest)/label/Solaris/doxia-core/target/classes
[debug] execute contextualize
[INFO] [resources:testResources {execution: default-testResources}]
[INFO] Using 'UTF-8' encoding to copy filtered resources.
[INFO] Copying 1 resource
[INFO] Copying 3 resources
[INFO] [compiler:testCompile {execution: default-testCompile}]
[INFO] Compiling 30 source files to /zonestorage/hudson_solaris/home/hudson/hudson-slave/workspace/doxia/jdk/JDK
1.5 (latest)/label/Solaris/doxia-core/target/test-classes
[INFO] -------------------------------------------------------------
[ERROR] COMPILATION ERROR : 
[INFO] -------------------------------------------------------------
[ERROR] /zonestorage/hudson_solaris/home/hudson/hudson-slave/workspace/doxia/jdk/JDK 1.5 (latest)/label/Solaris/doxia-core/src/test/java/org/apache/maven/doxia/document/DocumentModelTest.java:[362,18]
cannot find symbol
symbol  : constructor IOException(java.lang.String,org.codehaus.plexus.util.xml.pull.XmlPullParserException)
location: class java.io.IOException
[INFO] 1 error
[INFO] -------------------------------------------------------------
[INFO] ------------------------------------------------------------------------
[INFO] SKIPPING Doxia :: Modules
[INFO]    task-segment: [clean, install]
[INFO] This project has been banned from further executions due to previous failures.
[INFO] ------------------------------------------------------------------------
[INFO] ------------------------------------------------------------------------
[INFO] SKIPPING Doxia :: APT Module
[INFO]    task-segment: [clean, install]
[INFO] This project has been banned from further executions due to previous failures.
[INFO] ------------------------------------------------------------------------
[INFO] ------------------------------------------------------------------------
[INFO] SKIPPING Doxia :: Confluence Module
[INFO]    task-segment: [clean, install]
[INFO] This project has been banned from further executions due to previous failures.
[INFO] ------------------------------------------------------------------------
[INFO] ------------------------------------------------------------------------
[INFO] SKIPPING Doxia :: Simplified DocBook Module
[INFO]    task-segment: [clean, install]
[INFO] This project has been banned from further executions due to previous failures.
[INFO] ------------------------------------------------------------------------
[INFO] ------------------------------------------------------------------------
[INFO] SKIPPING Doxia :: FML Module
[INFO]    task-segment: [clean, install]
[INFO] This project has been banned from further executions due to previous failures.
[INFO] ------------------------------------------------------------------------
[INFO] ------------------------------------------------------------------------
[INFO] SKIPPING Doxia :: FO Module
[INFO]    task-segment: [clean, install]
[INFO] This project has been banned from further executions due to previous failures.
[INFO] ------------------------------------------------------------------------
[INFO] ------------------------------------------------------------------------
[INFO] SKIPPING Doxia :: iText Module
[INFO]    task-segment: [clean, install]
[INFO] This project has been banned from further executions due to previous failures.
[INFO] ------------------------------------------------------------------------
[INFO] ------------------------------------------------------------------------
[INFO] SKIPPING Doxia :: Latex Module
[INFO]    task-segment: [clean, install]
[INFO] This project has been banned from further executions due to previous failures.
[INFO] ------------------------------------------------------------------------
[INFO] ------------------------------------------------------------------------
[INFO] SKIPPING Doxia :: RTF Module
[INFO]    task-segment: [clean, install]
[INFO] This project has been banned from further executions due to previous failures.
[INFO] ------------------------------------------------------------------------
[INFO] ------------------------------------------------------------------------
[INFO] SKIPPING Doxia :: TWiki Module
[INFO]    task-segment: [clean, install]
[INFO] This project has been banned from further executions due to previous failures.
[INFO] ------------------------------------------------------------------------
[INFO] ------------------------------------------------------------------------
[INFO] SKIPPING Doxia :: XDoc Module
[INFO]    task-segment: [clean, install]
[INFO] This project has been banned from further executions due to previous failures.
[INFO] ------------------------------------------------------------------------
[INFO] ------------------------------------------------------------------------
[INFO] SKIPPING Doxia :: XHTML Module
[INFO]    task-segment: [clean, install]
[INFO] This project has been banned from further executions due to previous failures.
[INFO] ------------------------------------------------------------------------
[INFO] ------------------------------------------------------------------------
[INFO] SKIPPING Doxia :: Markdown Module
[INFO]    task-segment: [clean, install]
[INFO] This project has been banned from further executions due to previous failures.
[INFO] ------------------------------------------------------------------------
[INFO] ------------------------------------------------------------------------
[INFO] SKIPPING Doxia :: Book Component
[INFO]    task-segment: [clean, install]
[INFO] This project has been banned from further executions due to previous failures.
[INFO] ------------------------------------------------------------------------
[INFO] ------------------------------------------------------------------------
[INFO] SKIPPING Doxia :: Maven Plugin
[INFO]    task-segment: [clean, install]
[INFO] This project has been banned from further executions due to previous failures.
[INFO] ------------------------------------------------------------------------
[INFO] 
[INFO] 
[INFO] ------------------------------------------------------------------------
[INFO] Reactor Summary:
[INFO] ------------------------------------------------------------------------
[INFO] Doxia ................................................. SUCCESS [9.596s]
[INFO] Doxia :: Logging API .................................. SUCCESS [4.166s]
[INFO] Doxia :: Sink API ..................................... SUCCESS [1.638s]
[INFO] Doxia :: Test Documents ............................... SUCCESS [2.155s]
[INFO] Doxia :: Core ......................................... FAILED [6.255s]
[INFO] Doxia :: Modules ...................................... SKIPPED (dependency build failed
or was skipped)
[INFO] Doxia :: APT Module ................................... SKIPPED (dependency build failed
or was skipped)
[INFO] Doxia :: Confluence Module ............................ SKIPPED (dependency build failed
or was skipped)
[INFO] Doxia :: Simplified DocBook Module .................... SKIPPED (dependency build failed
or was skipped)
[INFO] Doxia :: FML Module ................................... SKIPPED (dependency build failed
or was skipped)
[INFO] Doxia :: FO Module .................................... SKIPPED (dependency build failed
or was skipped)
[INFO] Doxia :: iText Module ................................. SKIPPED (dependency build failed
or was skipped)
[INFO] Doxia :: Latex Module ................................. SKIPPED (dependency build failed
or was skipped)
[INFO] Doxia :: RTF Module ................................... SKIPPED (dependency build failed
or was skipped)
[INFO] Doxia :: TWiki Module ................................. SKIPPED (dependency build failed
or was skipped)
[INFO] Doxia :: XDoc Module .................................. SKIPPED (dependency build failed
or was skipped)
[INFO] Doxia :: XHTML Module ................................. SKIPPED (dependency build failed
or was skipped)
[INFO] Doxia :: Markdown Module .............................. SKIPPED (dependency build failed
or was skipped)
[INFO] Doxia :: Book Component ............................... SKIPPED (dependency build failed
or was skipped)
[INFO] Doxia :: Maven Plugin ................................. SKIPPED (dependency build failed
or was skipped)
[INFO] ------------------------------------------------------------------------
[INFO] Error for project: Doxia :: Core (during install)
[INFO] ------------------------------------------------------------------------
[INFO] Compilation failure
/zonestorage/hudson_solaris/home/hudson/hudson-slave/workspace/doxia/jdk/JDK 1.5 (latest)/label/Solaris/doxia-core/src/test/java/org/apache/maven/doxia/document/DocumentModelTest.java:[362,18]
cannot find symbol
symbol  : constructor IOException(java.lang.String,org.codehaus.plexus.util.xml.pull.XmlPullParserException)
location: class java.io.IOException

[INFO] ------------------------------------------------------------------------
[INFO] Trace
org.apache.maven.BuildFailureException: Compilation failure
/zonestorage/hudson_solaris/home/hudson/hudson-slave/workspace/doxia/jdk/JDK 1.5 (latest)/label/Solaris/doxia-core/src/test/java/org/apache/maven/doxia/document/DocumentModelTest.java:[362,18]
cannot find symbol
symbol  : constructor IOException(java.lang.String,org.codehaus.plexus.util.xml.pull.XmlPullParserException)
location: class java.io.IOException

	at org.apache.maven.lifecycle.DefaultLifecycleExecutor.executeGoals(DefaultLifecycleExecutor.java:715)
	at org.apache.maven.lifecycle.DefaultLifecycleExecutor.executeGoalWithLifecycle(DefaultLifecycleExecutor.java:556)
	at org.apache.maven.lifecycle.DefaultLifecycleExecutor.executeGoal(DefaultLifecycleExecutor.java:535)
	at org.apache.maven.lifecycle.DefaultLifecycleExecutor.executeGoalAndHandleFailures(DefaultLifecycleExecutor.java:387)
	at org.apache.maven.lifecycle.DefaultLifecycleExecutor.executeTaskSegments(DefaultLifecycleExecutor.java:348)
	at org.apache.maven.lifecycle.DefaultLifecycleExecutor.execute(DefaultLifecycleExecutor.java:180)
	at org.apache.maven.DefaultMaven.doExecute(DefaultMaven.java:328)
	at org.apache.maven.DefaultMaven.execute(DefaultMaven.java:138)
	at org.apache.maven.cli.MavenCli.main(MavenCli.java:362)
	at org.apache.maven.cli.compat.CompatibleMain.main(CompatibleMain.java:60)
	at sun.reflect.NativeMethodAccessorImpl.invoke0(Native Method)
	at sun.reflect.NativeMethodAccessorImpl.invoke(NativeMethodAccessorImpl.java:39)
	at sun.reflect.DelegatingMethodAccessorImpl.invoke(DelegatingMethodAccessorImpl.java:25)
	at java.lang.reflect.Method.invoke(Method.java:592)
	at org.codehaus.classworlds.Launcher.launchEnhanced(Launcher.java:315)
	at org.codehaus.classworlds.Launcher.launch(Launcher.java:255)
	at org.codehaus.classworlds.Launcher.mainWithExitCode(Launcher.java:430)
	at org.codehaus.classworlds.Launcher.main(Launcher.java:375)
Caused by: org.apache.maven.plugin.CompilationFailureException: Compilation failure
/zonestorage/hudson_solaris/home/hudson/hudson-slave/workspace/doxia/jdk/JDK 1.5 (latest)/label/Solaris/doxia-core/src/test/java/org/apache/maven/doxia/document/DocumentModelTest.java:[362,18]
cannot find symbol
symbol  : constructor IOException(java.lang.String,org.codehaus.plexus.util.xml.pull.XmlPullParserException)
location: class java.io.IOException

	at org.apache.maven.plugin.AbstractCompilerMojo.execute(AbstractCompilerMojo.java:656)
	at org.apache.maven.plugin.TestCompilerMojo.execute(TestCompilerMojo.java:161)
	at org.apache.maven.plugin.DefaultPluginManager.executeMojo(DefaultPluginManager.java:490)
	at org.apache.maven.lifecycle.DefaultLifecycleExecutor.executeGoals(DefaultLifecycleExecutor.java:694)
	... 17 more
[INFO] ------------------------------------------------------------------------
[INFO] BUILD ERRORS
[INFO] ------------------------------------------------------------------------
[INFO] Total time: 25 seconds
[INFO] Finished at: Mon Oct 17 13:05:50 GMT+00:00 2011
[INFO] Final Memory: 63M/277M
[INFO] ------------------------------------------------------------------------
Build step 'Invoke top-level Maven targets' marked build as failure


Mime
View raw message