maven-notifications mailing list archives

Site index · List index
Message view « Date » · « Thread »
Top « Date » · « Thread »
From Apache Jenkins Server <jenk...@builds.apache.org>
Subject Build failed in Jenkins: maven-plugins-ITs-m3 #247
Date Mon, 24 Oct 2011 11:32:23 GMT
See <https://builds.apache.org/job/maven-plugins-ITs-m3/247/changes>

Changes:

[markh] [maven-release-plugin] prepare for next development iteration

[markh] [maven-release-plugin] prepare release maven-checkstyle-plugin-2.8

------------------------------------------
[...truncated 8589 lines...]
[INFO] Copying 1 resource
[INFO] Copying 3 resources
[INFO] 
[INFO] --- maven-compiler-plugin:2.3.2:testCompile (default-testCompile) @ maven-remote-resources-plugin
---
[INFO] Compiling 17 source files to <https://builds.apache.org/job/maven-plugins-ITs-m3/ws/maven-remote-resources-plugin/target/test-classes>
[INFO] 
[INFO] --- maven-surefire-plugin:2.7.2:test (default-test) @ maven-remote-resources-plugin
---
[INFO] Surefire report directory: <https://builds.apache.org/job/maven-plugins-ITs-m3/ws/maven-remote-resources-plugin/target/surefire-reports>

-------------------------------------------------------
 T E S T S
-------------------------------------------------------
Running org.apache.maven.plugin.resources.remote.RemoteResourcesMojoTest
Tests run: 8, Failures: 0, Errors: 0, Skipped: 0, Time elapsed: 1.262 sec

Results :

Tests run: 8, Failures: 0, Errors: 0, Skipped: 0

[INFO] 
[INFO] --- maven-jar-plugin:2.3.1:jar (default-jar) @ maven-remote-resources-plugin ---
[INFO] Building jar: <https://builds.apache.org/job/maven-plugins-ITs-m3/ws/maven-remote-resources-plugin/target/maven-remote-resources-plugin-1.3-SNAPSHOT.jar>
[INFO] 
[INFO] --- maven-plugin-plugin:2.7:addPluginArtifactMetadata (default-addPluginArtifactMetadata)
@ maven-remote-resources-plugin ---
[INFO] 
[INFO] --- maven-invoker-plugin:1.5:install (install-descriptor) @ maven-remote-resources-plugin
---
[INFO] Installing <https://builds.apache.org/job/maven-plugins-ITs-m3/ws/maven-remote-resources-plugin/pom.xml>
to <https://builds.apache.org/job/maven-plugins-ITs-m3/ws/maven-remote-resources-plugin/target/it-repo/org/apache/maven/plugins/maven-remote-resources-plugin/1.3-SNAPSHOT/maven-remote-resources-plugin-1.3-SNAPSHOT.pom>
[INFO] Installing <https://builds.apache.org/job/maven-plugins-ITs-m3/ws/maven-remote-resources-plugin/target/maven-remote-resources-plugin-1.3-SNAPSHOT.jar>
to <https://builds.apache.org/job/maven-plugins-ITs-m3/ws/maven-remote-resources-plugin/target/it-repo/org/apache/maven/plugins/maven-remote-resources-plugin/1.3-SNAPSHOT/maven-remote-resources-plugin-1.3-SNAPSHOT.jar>
[INFO] 
[INFO] --- maven-failsafe-plugin:2.9:integration-test (integration-tests) @ maven-remote-resources-plugin
---
[INFO] Failsafe report directory: <https://builds.apache.org/job/maven-plugins-ITs-m3/ws/maven-remote-resources-plugin/target/failsafe-reports>

-------------------------------------------------------
 T E S T S
-------------------------------------------------------
Running org.apache.maven.plugin.resources.remote.it.IT_GenerateFromOverride
[INFO] ..SUCCESS (8.9 s)
[INFO] Building: validate/pom.xml
[INFO] ..SUCCESS (6.8 s)
[INFO] Building: local-repo-url/pom.xml
[INFO] ..SUCCESS (4.9 s)
[INFO] Building: site-skip/pom.xml
[INFO] ..SUCCESS (5.0 s)
[INFO] Building: fail-postbuild/pom.xml
[INFO] ..SUCCESS (4.2 s)
[INFO] Building: fail-build-with-verify/pom.xml
[INFO] ..SUCCESS (5.0 s)
[INFO] Building: site-inheritance/pom.xml
[INFO] ..SUCCESS (4.3 s)
[INFO] Building: script-accessibility/pom.xml
[INFO] ..SUCCESS (7.9 s)
[INFO] Building: MSITE-322/pom.xml
[INFO] ..SUCCESS (6.9 s)
[INFO] Building: project-setup/pom.xml
[INFO] ..SUCCESS (7.4 s)
[INFO] Building: surefire-report/pom.xml
[INFO] ..SUCCESS (9.6 s)
[INFO] Building: pom-filtering-reactor/pom.xml
[INFO] ..SUCCESS (6.3 s)
[INFO] Building: MSITE-566/pom.xml
[INFO] ..SUCCESS (4.3 s)
[INFO] Building: skip-run/pom.xml
[INFO] ..SUCCESS (3.9 s)
[INFO] Building: MSITE-456/pom.xml
[INFO] ..SUCCESS (2.8 s)
[INFO] Building: script-class-loading/pom.xml
[INFO] ..SUCCESS (4.8 s)
[INFO] Building: MSITE-304/pom.xml
[INFO] ..SUCCESS (7.1 s)
[INFO] Building: pom-less-invocation/pom.xml
[INFO] ..SUCCESS (7.0 s)
[INFO] Building: MSITE-609/pom.xml
[INFO] ..SUCCESS (3.3 s)
[INFO] Building: pom-filtering/pom.xml
[INFO] ..SUCCESS (4.6 s)
[INFO] Building: MSITE-512/pom.xml
[INFO] ..SUCCESS (5.8 s)
[INFO] Building: MSITE-458/pom.xml
[INFO] ..SUCCESS (14.1 s)
[INFO] Building: invocation-project/pom.xml
[INFO] ..SUCCESS (10.2 s)
[INFO] Building: MSITE-550/pom.xml
[INFO] ..SUCCESS (6.2 s)
[INFO] Building: script-classpath-duplicates/pom.xml
[INFO] ..SUCCESS (3.1 s)
[INFO] 
[INFO] --- maven-invoker-plugin:1.5:verify (integration-test) @ maven-site-plugin ---
[INFO] -------------------------------------------------
[INFO] Build Summary:
[INFO]   Passed: 38, Failed: 0, Errors: 0, Skipped: 1
[INFO] -------------------------------------------------
[INFO] 
[INFO] --- maven-install-plugin:2.3.1:install (default-install) @ maven-site-plugin ---
[INFO] Installing <https://builds.apache.org/job/maven-plugins-ITs-m3/ws/maven-site-plugin/target/maven-site-plugin-3.1-SNAPSHOT.jar>
to /home/jenkins/.m2/repository/org/apache/maven/plugins/maven-site-plugin/3.1-SNAPSHOT/maven-site-plugin-3.1-SNAPSHOT.jar
[INFO] Installing <https://builds.apache.org/job/maven-plugins-ITs-m3/ws/maven-site-plugin/dependency-reduced-pom.xml>
to /home/jenkins/.m2/repository/org/apache/maven/plugins/maven-site-plugin/3.1-SNAPSHOT/maven-site-plugin-3.1-SNAPSHOT.pom
[INFO]                                                                         
[INFO] ------------------------------------------------------------------------
[INFO] Building Maven Plugins Aggregator 1-SNAPSHOT
[INFO] ------------------------------------------------------------------------
[WARNING] *****************************************************************
[WARNING] * Your build is requesting parallel execution, but project      *
[WARNING] * contains the following plugin(s) that are not marked as       *
[WARNING] * @threadSafe to support parallel building.                     *
[WARNING] * While this /may/ work fine, please look for plugin updates    *
[WARNING] * and/or request plugins be made thread-safe.                   *
[WARNING] * If reporting an issue, report it against the plugin in        *
[WARNING] * question, not against maven-core                              *
[WARNING] *****************************************************************
[WARNING] The following plugins are not marked @threadSafe in Maven Plugins Aggregator:
[WARNING] org.apache.maven.plugins:maven-remote-resources-plugin:1.1
[WARNING] *****************************************************************
[INFO] 
[INFO] --- maven-clean-plugin:2.4.1:clean (default-clean) @ maven-plugins-aggregator ---
[INFO] Deleting <https://builds.apache.org/job/maven-plugins-ITs-m3/ws/target>
[INFO] 
[INFO] --- maven-remote-resources-plugin:1.1:process (default) @ maven-plugins-aggregator
---
[INFO] 
[INFO] --- maven-install-plugin:2.3.1:install (default-install) @ maven-plugins-aggregator
---
[INFO] Installing <https://builds.apache.org/job/maven-plugins-ITs-m3/ws/pom.xml> to
/home/jenkins/.m2/repository/org/apache/maven/plugins/maven-plugins-aggregator/1-SNAPSHOT/maven-plugins-aggregator-1-SNAPSHOT.pom
[INFO] ..SUCCESS (6.5 s)
[INFO] Building: staging-dependencies/pom.xml
[INFO] ..SUCCESS (4.7 s)
[INFO] Building: fail-ignore-with-verify/pom.xml
[INFO] ..SUCCESS (4.2 s)
[INFO] Building: staging-reactor/pom.xml
[INFO] ..SUCCESS (4.6 s)
[INFO] Building: fail-build/pom.xml
Tests run: 1, Failures: 0, Errors: 0, Skipped: 0, Time elapsed: 94.322 sec
Running org.apache.maven.plugin.resources.remote.it.IT_CustomFilterDelimiter
[INFO] ..SUCCESS (4.1 s)
[INFO] Building: local-repo-default/pom.xml
Tests run: 1, Failures: 0, Errors: 0, Skipped: 0, Time elapsed: 2.205 sec
Running org.apache.maven.plugin.resources.remote.it.IT_RunOnlyAtExecutionRoot
[INFO] ..SUCCESS (5.6 s)
[INFO] Building: staging-pom/pom.xml
Tests run: 1, Failures: 0, Errors: 0, Skipped: 0, Time elapsed: 6.789 sec
Running org.apache.maven.plugin.resources.remote.it.IT_SupplementalArtifact
[INFO] ..SUCCESS (3.0 s)
[INFO] Building: settings-auto-exclude/pom.xml
[INFO] ..SUCCESS (4.3 s)
[INFO] Building: local-repo-isolated/pom.xml
Tests run: 1, Failures: 0, Errors: 0, Skipped: 0, Time elapsed: 6.605 sec
Running org.apache.maven.plugin.resources.remote.it.IT_GetDependencyProjects
[INFO] ..SUCCESS (5.4 s)
[INFO] Building: script-global-vars/pom.xml
Tests run: 1, Failures: 0, Errors: 0, Skipped: 0, Time elapsed: 6.422 sec
Running org.apache.maven.plugin.resources.remote.it.IT_BadDependencyPoms
Tests run: 1, Failures: 0, Errors: 0, Skipped: 0, Time elapsed: 2.777 sec
Running org.apache.maven.plugin.resources.remote.it.IT_GenerateFromBundle
[INFO] ..SUCCESS (6.3 s)
[INFO] Building: invoker-report/pom.xml
Tests run: 1, Failures: 0, Errors: 0, Skipped: 0, Time elapsed: 2.437 sec
Running org.apache.maven.plugin.resources.remote.it.IT_FilterLocalOverride
Tests run: 1, Failures: 0, Errors: 0, Skipped: 0, Time elapsed: 2.687 sec

Results :

Tests run: 8, Failures: 0, Errors: 0, Skipped: 0

[WARNING] File encoding has not been set, using platform encoding ANSI_X3.4-1968, i.e. build
is platform dependent!
[INFO] 
[INFO] --- maven-failsafe-plugin:2.9:verify (integration-tests) @ maven-remote-resources-plugin
---
[INFO] Failsafe report directory: <https://builds.apache.org/job/maven-plugins-ITs-m3/ws/maven-remote-resources-plugin/target/failsafe-reports>
[WARNING] File encoding has not been set, using platform encoding ANSI_X3.4-1968, i.e. build
is platform dependent!
[INFO] 
[INFO] --- maven-install-plugin:2.3.1:install (default-install) @ maven-remote-resources-plugin
---
[INFO] Installing <https://builds.apache.org/job/maven-plugins-ITs-m3/ws/maven-remote-resources-plugin/target/maven-remote-resources-plugin-1.3-SNAPSHOT.jar>
to /home/jenkins/.m2/repository/org/apache/maven/plugins/maven-remote-resources-plugin/1.3-SNAPSHOT/maven-remote-resources-plugin-1.3-SNAPSHOT.jar
[INFO] Installing <https://builds.apache.org/job/maven-plugins-ITs-m3/ws/maven-remote-resources-plugin/pom.xml>
to /home/jenkins/.m2/repository/org/apache/maven/plugins/maven-remote-resources-plugin/1.3-SNAPSHOT/maven-remote-resources-plugin-1.3-SNAPSHOT.pom
[INFO] ..SUCCESS (14.7 s)
[INFO] Building: pom-filtering-encoding/pom.xml
[INFO] ..SUCCESS (5.9 s)
[INFO] -------------------------------------------------
[INFO] Build Summary:
[INFO]   Passed: 40, Failed: 0, Errors: 0, Skipped: 0
[INFO] -------------------------------------------------
[INFO] 
[INFO] --- maven-install-plugin:2.3.1:install (default-install) @ maven-invoker-plugin ---
[INFO] Installing <https://builds.apache.org/job/maven-plugins-ITs-m3/ws/maven-invoker-plugin/target/maven-invoker-plugin-1.6-SNAPSHOT.jar>
to /home/jenkins/.m2/repository/org/apache/maven/plugins/maven-invoker-plugin/1.6-SNAPSHOT/maven-invoker-plugin-1.6-SNAPSHOT.jar
[INFO] Installing <https://builds.apache.org/job/maven-plugins-ITs-m3/ws/maven-invoker-plugin/pom.xml>
to /home/jenkins/.m2/repository/org/apache/maven/plugins/maven-invoker-plugin/1.6-SNAPSHOT/maven-invoker-plugin-1.6-SNAPSHOT.pom
[INFO] ------------------------------------------------------------------------
[INFO] Reactor Summary:
[INFO] 
[INFO] Maven Plugins ..................................... SUCCESS [3.886s]
[INFO] Maven ACR Plugin .................................. SUCCESS [28.021s]
[INFO] Maven Ant Plugin .................................. SUCCESS [1:47.302s]
[INFO] Maven AntRun Plugin ............................... SUCCESS [1:27.448s]
[INFO] Maven Eclipse Plugin .............................. FAILURE [11:59.888s]
[INFO] Maven Assembly Plugin ............................. SUCCESS [14:41.995s]
[INFO] Maven Changelog Plugin ............................ SUCCESS [44.519s]
[INFO] Maven Changes Report Plugin ....................... SUCCESS [1:34.530s]
[INFO] Maven Checkstyle Plugin ........................... SUCCESS [1:36.127s]
[INFO] Maven Clean Plugin ................................ SUCCESS [30.255s]
[INFO] Maven Compiler Plugin ............................. SUCCESS [28.156s]
[INFO] Maven Dependency Plugin ........................... SUCCESS [2:11.346s]
[INFO] Maven Deploy Plugin ............................... SUCCESS [2:01.805s]
[INFO] Maven DOAP Plugin ................................. SUCCESS [24.140s]
[INFO] Maven Documentation Checker Plugin ................ SUCCESS [6.762s]
[INFO] Maven EAR Plugin .................................. SUCCESS [3:55.145s]
[INFO] Maven EJB Plugin .................................. SUCCESS [31.662s]
[INFO] Maven GPG Plugin .................................. SUCCESS [46.161s]
[INFO] Maven Help Plugin ................................. SUCCESS [42.670s]
[INFO] Maven IDEA Plugin ................................. SUCCESS [8.941s]
[INFO] Maven Install Plugin .............................. SUCCESS [45.845s]
[INFO] Maven JAR Plugin .................................. SUCCESS [1:13.015s]
[INFO] Maven Jarsigner Plugin ............................ SUCCESS [30.292s]
[INFO] Maven Javadoc Plugin .............................. SUCCESS [9:05.261s]
[INFO] Maven Linkcheck Plugin ............................ SUCCESS [2.249s]
[INFO] Maven One Plugin .................................. SUCCESS [3.779s]
[INFO] Maven Patch Plugin ................................ SUCCESS [13.383s]
[INFO] Maven PDF Plugin .................................. FAILURE [3:10.445s]
[INFO] Maven PMD Plugin .................................. SUCCESS [39.929s]
[INFO] Maven RAR Plugin .................................. SUCCESS [18.340s]
[INFO] Maven Reactor Plugin .............................. SUCCESS [2.958s]
[INFO] Maven Repository Plugin ........................... SUCCESS [2:48.387s]
[INFO] Maven Resources Plugin ............................ SUCCESS [57.920s]
[INFO] Maven Shade Plugin ................................ SUCCESS [2:22.736s]
[INFO] Maven Site Plugin 3 ............................... SUCCESS [7:41.889s]
[INFO] Maven Source Plugin ............................... SUCCESS [36.455s]
[INFO] Maven Stage Plugin ................................ SUCCESS [4.409s]
[INFO] Maven Toolchains Plugin ........................... SUCCESS [1.470s]
[INFO] Maven Verifier Plugin ............................. SUCCESS [11.036s]
[INFO] Maven WAR Plugin .................................. SUCCESS [1:08.894s]
[INFO] Maven Invoker Plugin .............................. SUCCESS [4:41.696s]
[INFO] Maven Project Info Reports Plugin ................. SUCCESS [2:01.779s]
[INFO] Maven Remote Resources Plugin ..................... SUCCESS [2:12.832s]
[INFO] Maven Plugins Aggregator .......................... SUCCESS [0.061s]
[INFO] ------------------------------------------------------------------------
[INFO] BUILD FAILURE
[INFO] ------------------------------------------------------------------------
[INFO] Total time: 29:31.573s (Wall Clock)
[INFO] Finished at: Mon Oct 24 11:32:22 UTC 2011
[INFO] Final Memory: 68M/1000M
[INFO] ------------------------------------------------------------------------
[WARNING] The requested profile "apache.snapshots" could not be activated because it does
not exist.
[ERROR] Failed to execute goal org.apache.maven.plugins:maven-failsafe-plugin:2.9:verify (default)
on project maven-eclipse-plugin: There are test failures.
[ERROR] 
[ERROR] Please refer to <https://builds.apache.org/job/maven-plugins-ITs-m3/ws/maven-eclipse-plugin/target/failsafe-reports>
for the individual test results.
[ERROR] -> [Help 1]
[ERROR] Failed to execute goal org.apache.maven.plugins:maven-invoker-plugin:1.5:run (integration-test)
on project maven-pdf-plugin: 1 build failed. -> [Help 1]
[ERROR] 
[ERROR] To see the full stack trace of the errors, re-run Maven with the -e switch.
[ERROR] Re-run Maven using the -X switch to enable full debug logging.
[ERROR] 
[ERROR] For more information about the errors and possible solutions, please read the following
articles:
[ERROR] [Help 1] http://cwiki.apache.org/confluence/display/MAVEN/MojoFailureException
[ERROR] 
[ERROR] After correcting the problems, you can resume the build with the command
[ERROR]   mvn <goals> -rf :maven-eclipse-plugin
Build step 'Invoke top-level Maven targets' marked build as failure


Mime
View raw message