maven-notifications mailing list archives

Site index · List index
Message view « Date » · « Thread »
Top « Date » · « Thread »
From Apache Jenkins Server <jenk...@builds.apache.org>
Subject Build failed in Jenkins: maven-plugins #473
Date Wed, 26 Oct 2011 17:12:35 GMT
See <https://builds.apache.org/job/maven-plugins/473/changes>

Changes:

[carlos] Fix boolean operation

------------------------------------------
[...truncated 1721 lines...]
[INFO] [INFO] Generating current version: 1.0.0
[INFO] Working on model: src/main/mdo/extOptions.mdo
[INFO] Generating current version: 1.0.0
Building Maven Documentation Checker Plugin 1.1-SNAPSHOT
[INFO] ------------------------------------------------------------------------
[INFO] Deleting <https://builds.apache.org/job/maven-plugins/ws/maven-docck-plugin/target>
[INFO] 
[INFO] --- maven-clean-plugin:2.4.1:clean (default-clean) @ maven-docck-plugin ---
[INFO] Using 'UTF-8' encoding to read mojo metadata.
[INFO] Applying mojo extractor for language: java
[INFO] 
[INFO] --- maven-plugin-plugin:2.7:descriptor (default-descriptor) @ maven-doap-plugin ---
[INFO] 
[INFO] --- maven-enforcer-plugin:1.0:enforce (ensure-no-container-api) @ maven-docck-plugin
---
[INFO] [INFO] Using 'UTF-8' encoding to read mojo metadata.
[INFO] Applying mojo extractor for language: java

[INFO] --- maven-plugin-plugin:2.7:helpmojo (generated-helpmojo) @ maven-docck-plugin ---
[INFO] Mojo extractor for language: java found 2 mojo descriptors.
[INFO] Applying mojo extractor for language: bsh
[INFO] Mojo extractor for language: bsh found 0 mojo descriptors.
Tests run: 9, Failures: 0, Errors: 0, Skipped: 0, Time elapsed: 1.152 sec
Running org.apache.maven.plugin.dependency.utils.markers.TestSourcesMarkerFileHandler
Tests run: 10, Failures: 0, Errors: 0, Skipped: 0, Time elapsed: 0.013 sec
Running org.apache.maven.plugin.dependency.utils.TestSilentLog
[INFO] Tests run: 2, Failures: 0, Errors: 0, Skipped: 0, Time elapsed: 0.001 sec
Running org.apache.maven.plugin.dependency.utils.translators.TestClassifierTypeTranslator
[INFO] Mojo extractor for language: java found 1 mojo descriptors.
[INFO] Applying mojo extractor for language: bsh

[INFO] --- maven-remote-resources-plugin:1.1:process (default) @ maven-doap-plugin ---
[INFO] Mojo extractor for language: bsh found 0 mojo descriptors.
[INFO] Using 'UTF-8' encoding to read mojo metadata.
[INFO] Applying mojo extractor for language: java
[INFO] 
[INFO] --- maven-plugin-plugin:2.7:descriptor (default-descriptor) @ maven-docck-plugin ---
[INFO] Mojo extractor for language: java found 2 mojo descriptors.
[INFO] Applying mojo extractor for language: bsh
[INFO] Mojo extractor for language: bsh found 0 mojo descriptors.
[INFO] 
[INFO] --- maven-remote-resources-plugin:1.1:process (default) @ maven-docck-plugin ---
[INFO] [INFO] Using 'UTF-8' encoding to copy filtered resources.
[INFO] Copying 5 resources
[INFO] Copying 3 resources

[INFO] --- maven-resources-plugin:2.4.3:resources (default-resources) @ maven-doap-plugin
---
[INFO] [INFO] Using 'UTF-8' encoding to copy filtered resources.
[INFO] Compiling 9 source files to <https://builds.apache.org/job/maven-plugins/ws/maven-doap-plugin/target/classes>
[INFO] Copying 1 resource
[INFO] Copying 3 resources

[INFO] --- maven-compiler-plugin:2.3.2:compile (default-compile) @ maven-doap-plugin ---
[INFO] 
[INFO] --- maven-resources-plugin:2.4.3:resources (default-resources) @ maven-docck-plugin
---
Tests run: 6, Failures: 0, Errors: 0, Skipped: 0, Time elapsed: 0.73 sec
Running org.apache.maven.plugin.dependency.utils.TestDependencyUtil
Tests run: 8, Failures: 0, Errors: 0, Skipped: 0, Time elapsed: 0.006 sec
Running org.apache.maven.plugin.dependency.utils.filters.TestDestFileFilter
[INFO] [INFO] Compiling 9 source files to <https://builds.apache.org/job/maven-plugins/ws/maven-docck-plugin/target/classes>

[INFO] --- maven-compiler-plugin:2.3.2:compile (default-compile) @ maven-docck-plugin ---
Tests run: 7, Failures: 0, Errors: 0, Skipped: 0, Time elapsed: 0.052 sec
Running org.apache.maven.plugin.dependency.utils.filters.TestResolveMarkerFileFilter
Tests run: 1, Failures: 0, Errors: 0, Skipped: 0, Time elapsed: 0.003 sec
Running org.apache.maven.plugin.dependency.utils.filters.TestMarkerFileFilter
> isMarkerOlder:
  artifact1 = target/markers/localTestRepo/snapshot-2.0-SNAPSHOT.jar
  marker    = target/markers/testGroupId-snapshot-jar-2.0-SNAPSHOT.marker
    artifact1 lastModified: 1319649143000
    marker lastModified: 1319649142000
< true = marker older than artifact?
> isMarkerOlder:
  artifact1 = target/markers/localTestRepo/snapshot-2.0-SNAPSHOT.jar
  marker    = target/markers/testGroupId-snapshot-jar-2.0-SNAPSHOT.marker
    artifact1 lastModified: 1319649143000
    marker lastModified: 1319649143000
< false = marker older than artifact?
> isMarkerOlder:
  artifact1 = target/markers/localTestRepo/snapshot-2.0-SNAPSHOT.jar
  marker    = target/markers/testGroupId-snapshot-jar-2.0-SNAPSHOT.marker
    artifact1 lastModified: 1319649133000
    marker lastModified: 1319649143000
< false = marker older than artifact?
Tests run: 5, Failures: 0, Errors: 0, Skipped: 0, Time elapsed: 0.01 sec
Running org.apache.maven.plugin.dependency.utils.TestDependencyStatusSets
Tests run: 5, Failures: 0, Errors: 0, Skipped: 0, Time elapsed: 0.709 sec
Running org.apache.maven.plugin.dependency.TestBuildClasspathMojo
[INFO] [INFO] Using 'UTF-8' encoding to copy filtered resources.
[INFO] skip non existing resourceDirectory <https://builds.apache.org/job/maven-plugins/ws/maven-docck-plugin/src/test/resources>
[INFO] Copying 3 resources
[INFO] Dependencies classpath:
<https://builds.apache.org/job/maven-plugins/ws/maven-dependency-plugin/target/unit-tests/build-classpath/localTestRepo/provided-1.0.jar>:<https://builds.apache.org/job/maven-plugins/ws/maven-dependency-plugin/target/unit-tests/build-classpath/localTestRepo/compile-1.0.jar>:<https://builds.apache.org/job/maven-plugins/ws/maven-dependency-plugin/target/unit-tests/build-classpath/localTestRepo/system-1.0.jar>:<https://builds.apache.org/job/maven-plugins/ws/maven-dependency-plugin/target/unit-tests/build-classpath/localTestRepo/test-1.0.jar>:<https://builds.apache.org/job/maven-plugins/ws/maven-dependency-plugin/target/unit-tests/build-classpath/localTestRepo/release-1.0.jar>:<https://builds.apache.org/job/maven-plugins/ws/maven-dependency-plugin/target/unit-tests/build-classpath/localTestRepo/snapshot-2.0-SNAPSHOT.jar>:<https://builds.apache.org/job/maven-plugins/ws/maven-dependency-plugin/target/unit-tests/build-classpath/localTestRepo/runtime-1.0.jar>
[INFO] Wrote classpath file '<https://builds.apache.org/job/maven-plugins/ws/maven-dependency-plugin/target/unit-tests/build-classpath/buildClasspath.txt'.>
[INFO] Wrote classpath file '<https://builds.apache.org/job/maven-plugins/ws/maven-dependency-plugin/target/unit-tests/build-classpath/buildClasspath.txt'.>

[INFO] --- maven-resources-plugin:2.4.3:testResources (default-testResources) @ maven-docck-plugin
---
Tests run: 2, Failures: 0, Errors: 0, Skipped: 0, Time elapsed: 0.224 sec
Running org.apache.maven.plugin.dependency.TestCopyDependenciesMojo2
[INFO] [INFO] No sources to compile

[INFO] --- maven-compiler-plugin:2.3.2:testCompile (default-testCompile) @ maven-docck-plugin
---
[INFO] [INFO] Surefire report directory: <https://builds.apache.org/job/maven-plugins/ws/maven-docck-plugin/target/surefire-reports>

[INFO] --- maven-surefire-plugin:2.7.2:test (default-test) @ maven-docck-plugin ---
[INFO] Using 'UTF-8' encoding to copy filtered resources.
[INFO] 
[INFO] --- maven-resources-plugin:2.4.3:testResources (default-testResources) @ maven-doap-plugin
---
[INFO] Copying 5 resources
[INFO] Copying 3 resources

-------------------------------------------------------
 T E S T S
-------------------------------------------------------
There are no tests to run.

Results :

Tests run: 0, Failures: 0, Errors: 0, Skipped: 0

[INFO] 
[INFO] --- maven-compiler-plugin:2.3.2:testCompile (default-testCompile) @ maven-doap-plugin
---
[INFO] Compiling 4 source files to <https://builds.apache.org/job/maven-plugins/ws/maven-doap-plugin/target/test-classes>
[JENKINS] Recording test results
[INFO] 
[INFO] --- maven-jar-plugin:2.3.1:jar (default-jar) @ maven-docck-plugin ---
[INFO] Installing <https://builds.apache.org/job/maven-plugins/ws/maven-dependency-plugin/target/unit-tests/copy-dependencies/localTestRepo/provided-1.0.jar>
to <https://builds.apache.org/job/maven-plugins/ws/maven-dependency-plugin/target/unit-tests/copy-dependencies/outputDirectory/g/provided/1.0/provided-1.0.jar>
[INFO] Installing <https://builds.apache.org/job/maven-plugins/ws/maven-dependency-plugin/target/unit-tests/copy-dependencies/localTestRepo/compile-1.0.jar>
to <https://builds.apache.org/job/maven-plugins/ws/maven-dependency-plugin/target/unit-tests/copy-dependencies/outputDirectory/g/compile/1.0/compile-1.0.jar>
[INFO] Installing <https://builds.apache.org/job/maven-plugins/ws/maven-dependency-plugin/target/unit-tests/copy-dependencies/localTestRepo/system-1.0.jar>
to <https://builds.apache.org/job/maven-plugins/ws/maven-dependency-plugin/target/unit-tests/copy-dependencies/outputDirectory/g/system/1.0/system-1.0.jar>
[INFO] Installing <https://builds.apache.org/job/maven-plugins/ws/maven-dependency-plugin/target/unit-tests/copy-dependencies/localTestRepo/test-1.0.jar>
to <https://builds.apache.org/job/maven-plugins/ws/maven-dependency-plugin/target/unit-tests/copy-dependencies/outputDirectory/g/test/1.0/test-1.0.jar>
[INFO] Installing <https://builds.apache.org/job/maven-plugins/ws/maven-dependency-plugin/target/unit-tests/copy-dependencies/localTestRepo/expanded-snapshot-2.0-SNAPSHOT.jar>
to <https://builds.apache.org/job/maven-plugins/ws/maven-dependency-plugin/target/unit-tests/copy-dependencies/outputDirectory/testGroupId/expanded-snapshot/2.0-SNAPSHOT/expanded-snapshot-2.0-20111026.171224-1.jar>
[INFO] Installing <https://builds.apache.org/job/maven-plugins/ws/maven-dependency-plugin/target/unit-tests/copy-dependencies/localTestRepo/expanded-snapshot-2.0-SNAPSHOT.jar>
to <https://builds.apache.org/job/maven-plugins/ws/maven-dependency-plugin/target/unit-tests/copy-dependencies/outputDirectory/testGroupId/expanded-snapshot/2.0-SNAPSHOT/expanded-snapshot-2.0-SNAPSHOT.jar>
[INFO] Installing <https://builds.apache.org/job/maven-plugins/ws/maven-dependency-plugin/target/unit-tests/copy-dependencies/localTestRepo/snapshot-2.0-SNAPSHOT.jar>
to <https://builds.apache.org/job/maven-plugins/ws/maven-dependency-plugin/target/unit-tests/copy-dependencies/outputDirectory/testGroupId/snapshot/2.0-SNAPSHOT/snapshot-2.0-SNAPSHOT.jar>
[INFO] Installing <https://builds.apache.org/job/maven-plugins/ws/maven-dependency-plugin/target/unit-tests/copy-dependencies/localTestRepo/release-1.0.jar>
to <https://builds.apache.org/job/maven-plugins/ws/maven-dependency-plugin/target/unit-tests/copy-dependencies/outputDirectory/testGroupId/release/1.0/release-1.0.jar>
[INFO] Installing <https://builds.apache.org/job/maven-plugins/ws/maven-dependency-plugin/target/unit-tests/copy-dependencies/localTestRepo/expanded-snapshot-2.0-SNAPSHOT.pom>
to <https://builds.apache.org/job/maven-plugins/ws/maven-dependency-plugin/target/unit-tests/copy-dependencies/outputDirectory/testGroupId/expanded-snapshot/2.0-SNAPSHOT/expanded-snapshot-2.0-20111026.171224-1.pom>
[INFO] Installing <https://builds.apache.org/job/maven-plugins/ws/maven-dependency-plugin/target/unit-tests/copy-dependencies/localTestRepo/expanded-snapshot-2.0-SNAPSHOT.pom>
to <https://builds.apache.org/job/maven-plugins/ws/maven-dependency-plugin/target/unit-tests/copy-dependencies/outputDirectory/testGroupId/expanded-snapshot/2.0-SNAPSHOT/expanded-snapshot-2.0-SNAPSHOT.pom>
[INFO] Installing <https://builds.apache.org/job/maven-plugins/ws/maven-dependency-plugin/target/unit-tests/copy-dependencies/localTestRepo/runtime-1.0.jar>
to <https://builds.apache.org/job/maven-plugins/ws/maven-dependency-plugin/target/unit-tests/copy-dependencies/outputDirectory/g/runtime/1.0/runtime-1.0.jar>
[INFO] Building jar: <https://builds.apache.org/job/maven-plugins/ws/maven-docck-plugin/target/maven-docck-plugin-1.1-SNAPSHOT.jar>
[INFO] 
[INFO] --- maven-plugin-plugin:2.7:addPluginArtifactMetadata (default-addPluginArtifactMetadata)
@ maven-docck-plugin ---
[INFO] [INFO] Installing <https://builds.apache.org/job/maven-plugins/ws/maven-docck-plugin/target/maven-docck-plugin-1.1-SNAPSHOT.jar>
to /home/jenkins/.m2/repository/org/apache/maven/plugins/maven-docck-plugin/1.1-SNAPSHOT/maven-docck-plugin-1.1-SNAPSHOT.jar
[INFO] Installing <https://builds.apache.org/job/maven-plugins/ws/maven-docck-plugin/pom.xml>
to /home/jenkins/.m2/repository/org/apache/maven/plugins/maven-docck-plugin/1.1-SNAPSHOT/maven-docck-plugin-1.1-SNAPSHOT.pom
Tests run: 11, Failures: 0, Errors: 0, Skipped: 0, Time elapsed: 1.432 sec
Running org.apache.maven.plugin.dependency.TestUnpackDependenciesMojo

[INFO] --- maven-install-plugin:2.3.1:install (default-install) @ maven-docck-plugin ---
[INFO] Surefire report directory: <https://builds.apache.org/job/maven-plugins/ws/maven-doap-plugin/target/surefire-reports>
[INFO] 
[INFO] --- maven-surefire-plugin:2.7.2:test (default-test) @ maven-doap-plugin ---
[JENKINS] Archiving <https://builds.apache.org/job/maven-plugins/ws/maven-docck-plugin/pom.xml>
to /home/hudson/hudson/jobs/maven-plugins/modules/org.apache.maven.plugins$maven-docck-plugin/builds/2011-10-26_17-10-32/archive/org.apache.maven.plugins/maven-docck-plugin/1.1-SNAPSHOT/maven-docck-plugin-1.1-SNAPSHOT.pom

-------------------------------------------------------
 T E S T S
-------------------------------------------------------
Running org.apache.maven.plugin.doap.DoapUtilTest
[JENKINS] Archiving <https://builds.apache.org/job/maven-plugins/ws/maven-docck-plugin/target/maven-docck-plugin-1.1-SNAPSHOT.jar>
to /home/hudson/hudson/jobs/maven-plugins/modules/org.apache.maven.plugins$maven-docck-plugin/builds/2011-10-26_17-10-32/archive/org.apache.maven.plugins/maven-docck-plugin/1.1-SNAPSHOT/maven-docck-plugin-1.1-SNAPSHOT.jar
Tests run: 5, Failures: 0, Errors: 0, Skipped: 0, Time elapsed: 1.308 sec
Running org.apache.maven.plugin.doap.DoapMojoTest
[INFO] Generating a pure DOAP file <https://builds.apache.org/job/maven-plugins/ws/maven-doap-plugin/target/test/unit/doap-configuration/doap-configuration.rdf>
[WARNING] No versioning was found for resources.test:resources-test. Ignored DOAP <release/>
tag.
[INFO] Generating a pure DOAP file <https://builds.apache.org/job/maven-plugins/ws/maven-doap-plugin/target/test/unit/doap-configuration/doap-configuration.rdf>
[INFO] [WARNING] *****************************************************************
[WARNING] * Your build is requesting parallel execution, but project      *
[WARNING] * contains the following plugin(s) that are not marked as       *
[WARNING] * @threadSafe to support parallel building.                     *
[WARNING] * While this /may/ work fine, please look for plugin updates    *
[WARNING] * and/or request plugins be made thread-safe.                   *
[WARNING] * If reporting an issue, report it against the plugin in        *
[WARNING] * question, not against maven-core                              *
[WARNING] *****************************************************************
[WARNING] The following plugins are not marked @threadSafe in Maven EAR Plugin:
[WARNING] org.apache.maven.plugins:maven-remote-resources-plugin:1.1
[WARNING] org.apache.maven.plugins:maven-enforcer-plugin:1.0
[WARNING] *****************************************************************
                                                                        
[INFO] ------------------------------------------------------------------------
[INFO] Building Maven EAR Plugin 2.7-SNAPSHOT
[INFO] ------------------------------------------------------------------------
[INFO] Generating a pure DOAP file <https://builds.apache.org/job/maven-plugins/ws/maven-doap-plugin/target/test/unit/doap-configuration/doap-configuration.rdf>
[INFO] [INFO] Deleting <https://builds.apache.org/job/maven-plugins/ws/maven-ear-plugin/target>
[WARNING] No versioning was found for resources.test:resources-test. Ignored DOAP <release/>
tag.
[ERROR] 
[ERROR] The <about>foo</about> parameter is not a valid URL.
[ERROR] 

[INFO] --- maven-clean-plugin:2.4.1:clean (default-clean) @ maven-ear-plugin ---
[INFO] Using artifact org.codehaus.plexus:plexus-utils:1.5.5
[INFO] 
[INFO] --- maven-enforcer-plugin:1.0:enforce (ensure-no-container-api) @ maven-ear-plugin
---
[INFO] [INFO] Using 'UTF-8' encoding to read mojo metadata.
[INFO] Applying mojo extractor for language: java

[INFO] --- maven-plugin-plugin:2.7:helpmojo (generated-helpmojo) @ maven-ear-plugin ---
[INFO] Mojo extractor for language: java found 2 mojo descriptors.
[INFO] Applying mojo extractor for language: bsh
[INFO] Mojo extractor for language: bsh found 0 mojo descriptors.
[INFO] [INFO] Using 'UTF-8' encoding to read mojo metadata.
[INFO] Applying mojo extractor for language: java

[INFO] --- maven-plugin-plugin:2.7:descriptor (default-descriptor) @ maven-ear-plugin ---
[INFO] Mojo extractor for language: java found 3 mojo descriptors.
[INFO] Applying mojo extractor for language: bsh
[INFO] Mojo extractor for language: bsh found 0 mojo descriptors.
[INFO] 
[INFO] --- maven-remote-resources-plugin:1.1:process (default) @ maven-ear-plugin ---
[INFO] [INFO] Using 'UTF-8' encoding to copy filtered resources.
[INFO] Copying 0 resource
[INFO] Copying 3 resources

[INFO] --- maven-resources-plugin:2.4.3:resources (default-resources) @ maven-ear-plugin ---
[INFO] 
[INFO] --- maven-compiler-plugin:2.3.2:compile (default-compile) @ maven-ear-plugin ---
[INFO] Compiling 40 source files to <https://builds.apache.org/job/maven-plugins/ws/maven-ear-plugin/target/classes>
[INFO] Generating a pure DOAP file <https://builds.apache.org/job/maven-plugins/ws/maven-doap-plugin/target/test/unit/doap-configuration/doap_plexus-utils.rdf>
[WARNING] No versioning was found for org.codehaus.plexus:plexus-utils. Ignored DOAP <release/>
tag.
[INFO] Using artifact xstream:xstream:1.1
[INFO] [INFO] Using 'UTF-8' encoding to copy filtered resources.

[INFO] --- maven-resources-plugin:2.4.3:testResources (default-testResources) @ maven-ear-plugin
---
[INFO] Generating a pure DOAP file <https://builds.apache.org/job/maven-plugins/ws/maven-doap-plugin/target/test/unit/doap-configuration/doap_xstream.rdf>
[WARNING] The project's url defined from <artifact><groupId>xstream</groupId><artifactId>xstream</artifactId><version>1.1</version></artifact>
is empty or not a valid URL, using <about/> parameter.
[WARNING] No <doapOptions><scmAnonymousConnection/></doapOptions> parameter
defined, it is highly recommended to have one.
[WARNING] No versioning was found for xstream:xstream. Ignored DOAP <release/> tag.
[ERROR] 
[ERROR] The <about>foo</about> parameter is not a valid URL.
[ERROR] 
[INFO] This project is an ASF project, ASF Extensions to DOAP will be added.
[INFO] Generating an ASF DOAP file <https://builds.apache.org/job/maven-plugins/ws/maven-doap-plugin/target/test/unit/asf-doap-configuration/asf-doap-configuration.rdf>
[WARNING] No versioning was found for resources.test:resources-test. Ignored DOAP <release/>
tag.
[INFO] Generating an ASF DOAP file <https://builds.apache.org/job/maven-plugins/ws/maven-doap-plugin/target/test/unit/doap-configuration/doap-extra-configuration.rdf>
[WARNING] No versioning was found for resources.test:resources-test. Ignored DOAP <release/>
tag.
Tests run: 7, Failures: 0, Errors: 0, Skipped: 0, Time elapsed: 4.112 sec

Results :

Tests run: 12, Failures: 0, Errors: 0, Skipped: 0

[JENKINS] Recording test results
[INFO] 
[INFO] --- maven-jar-plugin:2.3.1:jar (default-jar) @ maven-doap-plugin ---
[INFO] Building jar: <https://builds.apache.org/job/maven-plugins/ws/maven-doap-plugin/target/maven-doap-plugin-1.2-SNAPSHOT.jar>
Oct 26, 2011 5:12:31 PM hudson.remoting.Channel$ReaderThread run
SEVERE: I/O error in channel channel
java.io.StreamCorruptedException
	at java.io.ObjectInputStream.readObject0(ObjectInputStream.java:1332)
	at java.io.ObjectInputStream.readObject(ObjectInputStream.java:348)
	at hudson.remoting.Channel$ReaderThread.run(Channel.java:1087)
channel stopped
ERROR: Maven JVM terminated unexpectedly with exit code 0



Mime
View raw message