maven-notifications mailing list archives

Site index · List index
Message view « Date » · « Thread »
Top « Date » · « Thread »
From Apache Jenkins Server <jenk...@builds.apache.org>
Subject Build failed in Jenkins: maven-plugin-tools #20
Date Sat, 08 Oct 2011 12:08:19 GMT
See <https://builds.apache.org/job/maven-plugin-tools/20/>

------------------------------------------
[...truncated 1846 lines...]
Downloading: http://repo1.maven.org/maven2/org/codehaus/plexus/plexus-i18n/1.0-beta-6/plexus-i18n-1.0-beta-6.pom
Downloaded: http://repo1.maven.org/maven2/org/codehaus/plexus/plexus-i18n/1.0-beta-6/plexus-i18n-1.0-beta-6.pom
(771 B at 1.5 KB/sec)
Downloading: http://repo1.maven.org/maven2/org/codehaus/plexus/plexus-components/1.1.4/plexus-components-1.1.4.pom
Downloaded: http://repo1.maven.org/maven2/org/codehaus/plexus/plexus-components/1.1.4/plexus-components-1.1.4.pom
(3 KB at 4.1 KB/sec)
Downloading: http://repo1.maven.org/maven2/org/apache/maven/doxia/doxia-sink-api/1.0-alpha-10/doxia-sink-api-1.0-alpha-10.jar
Downloading: http://repo1.maven.org/maven2/commons-lang/commons-lang/2.3/commons-lang-2.3.jar
Downloading: http://repo1.maven.org/maven2/org/apache/maven/enforcer/enforcer-api/1.0.1/enforcer-api-1.0.1.jar
Downloading: http://repo1.maven.org/maven2/org/apache/maven/enforcer/enforcer-rules/1.0.1/enforcer-rules-1.0.1.jar
Downloading: http://repo1.maven.org/maven2/org/apache/maven/shared/maven-common-artifact-filters/1.2/maven-common-artifact-filters-1.2.jar
Downloaded: http://repo1.maven.org/maven2/org/apache/maven/doxia/doxia-sink-api/1.0-alpha-10/doxia-sink-api-1.0-alpha-10.jar
(10 KB at 6.5 KB/sec)
Downloading: http://repo1.maven.org/maven2/org/beanshell/bsh/2.0b4/bsh-2.0b4.jar
Downloaded: http://repo1.maven.org/maven2/org/apache/maven/enforcer/enforcer-api/1.0.1/enforcer-api-1.0.1.jar
(10 KB at 5.5 KB/sec)
Downloading: http://repo1.maven.org/maven2/org/apache/maven/shared/maven-dependency-tree/1.2/maven-dependency-tree-1.2.jar
Downloaded: http://repo1.maven.org/maven2/commons-lang/commons-lang/2.3/commons-lang-2.3.jar
(240 KB at 120.5 KB/sec)
Downloading: http://repo1.maven.org/maven2/org/codehaus/plexus/plexus-i18n/1.0-beta-6/plexus-i18n-1.0-beta-6.jar
Downloaded: http://repo1.maven.org/maven2/org/apache/maven/enforcer/enforcer-rules/1.0.1/enforcer-rules-1.0.1.jar
(60 KB at 26.6 KB/sec)
Downloaded: http://repo1.maven.org/maven2/org/apache/maven/shared/maven-common-artifact-filters/1.2/maven-common-artifact-filters-1.2.jar
(31 KB at 12.4 KB/sec)
Downloaded: http://repo1.maven.org/maven2/org/apache/maven/shared/maven-dependency-tree/1.2/maven-dependency-tree-1.2.jar
(34 KB at 19.3 KB/sec)
Downloaded: http://repo1.maven.org/maven2/org/beanshell/bsh/2.0b4/bsh-2.0b4.jar (276 KB at
122.3 KB/sec)
Downloaded: http://repo1.maven.org/maven2/org/codehaus/plexus/plexus-i18n/1.0-beta-6/plexus-i18n-1.0-beta-6.jar
(12 KB at 5.9 KB/sec)
[INFO] 
Downloading: http://repo1.maven.org/maven2/org/apache/maven/doxia/doxia-site-renderer/1.0/doxia-site-renderer-1.0.pom
[INFO] --- maven-plugin-plugin:2.8:helpmojo (generated-helpmojo) @ maven-plugin-plugin ---
Downloaded: http://repo1.maven.org/maven2/org/apache/maven/doxia/doxia-site-renderer/1.0/doxia-site-renderer-1.0.pom
(5 KB at 12.4 KB/sec)
Downloading: http://repo1.maven.org/maven2/org/apache/maven/doxia/doxia-sitetools/1.0/doxia-sitetools-1.0.pom
Downloaded: http://repo1.maven.org/maven2/org/apache/maven/doxia/doxia-sitetools/1.0/doxia-sitetools-1.0.pom
(10 KB at 18.8 KB/sec)
Downloading: http://repo1.maven.org/maven2/org/apache/maven/doxia/doxia-core/1.0/doxia-core-1.0.pom
Downloaded: http://repo1.maven.org/maven2/org/apache/maven/doxia/doxia-core/1.0/doxia-core-1.0.pom
(3 KB at 4.7 KB/sec)
Downloading: http://repo1.maven.org/maven2/org/apache/maven/doxia/doxia-decoration-model/1.0/doxia-decoration-model-1.0.pom
Downloaded: http://repo1.maven.org/maven2/org/apache/maven/doxia/doxia-decoration-model/1.0/doxia-decoration-model-1.0.pom
(4 KB at 5.8 KB/sec)
Downloading: http://repo1.maven.org/maven2/org/apache/maven/doxia/doxia-module-apt/1.0/doxia-module-apt-1.0.pom
Downloaded: http://repo1.maven.org/maven2/org/apache/maven/doxia/doxia-module-apt/1.0/doxia-module-apt-1.0.pom
(3 KB at 4.8 KB/sec)
Downloading: http://repo1.maven.org/maven2/org/apache/maven/doxia/doxia-modules/1.0/doxia-modules-1.0.pom
Downloaded: http://repo1.maven.org/maven2/org/apache/maven/doxia/doxia-modules/1.0/doxia-modules-1.0.pom
(3 KB at 4.7 KB/sec)
Downloading: http://repo1.maven.org/maven2/org/apache/maven/doxia/doxia-module-fml/1.0/doxia-module-fml-1.0.pom
Downloaded: http://repo1.maven.org/maven2/org/apache/maven/doxia/doxia-module-fml/1.0/doxia-module-fml-1.0.pom
(3 KB at 5.2 KB/sec)
Downloading: http://repo1.maven.org/maven2/org/apache/maven/doxia/doxia-module-xdoc/1.0/doxia-module-xdoc-1.0.pom
Downloaded: http://repo1.maven.org/maven2/org/apache/maven/doxia/doxia-module-xdoc/1.0/doxia-module-xdoc-1.0.pom
(3 KB at 4.4 KB/sec)
Downloading: http://repo1.maven.org/maven2/org/apache/maven/doxia/doxia-module-xhtml/1.0/doxia-module-xhtml-1.0.pom
Downloaded: http://repo1.maven.org/maven2/org/apache/maven/doxia/doxia-module-xhtml/1.0/doxia-module-xhtml-1.0.pom
(2 KB at 3.3 KB/sec)
Downloading: http://repo1.maven.org/maven2/org/apache/maven/plugin-tools/maven-plugin-tools-api/2.8/maven-plugin-tools-api-2.8.pom
Downloaded: http://repo1.maven.org/maven2/org/apache/maven/plugin-tools/maven-plugin-tools-api/2.8/maven-plugin-tools-api-2.8.pom
(5 KB at 8.9 KB/sec)
Downloading: http://repo1.maven.org/maven2/org/apache/maven/plugin-tools/maven-plugin-tools/2.8/maven-plugin-tools-2.8.pom
Downloaded: http://repo1.maven.org/maven2/org/apache/maven/plugin-tools/maven-plugin-tools/2.8/maven-plugin-tools-2.8.pom
(10 KB at 20.1 KB/sec)
Downloading: http://repo1.maven.org/maven2/org/apache/maven/reporting/maven-reporting-impl/2.0.5/maven-reporting-impl-2.0.5.pom
Downloaded: http://repo1.maven.org/maven2/org/apache/maven/reporting/maven-reporting-impl/2.0.5/maven-reporting-impl-2.0.5.pom
(5 KB at 8.3 KB/sec)
Downloading: http://repo1.maven.org/maven2/org/apache/maven/shared/maven-doxia-tools/1.0.2/maven-doxia-tools-1.0.2.pom
Downloaded: http://repo1.maven.org/maven2/org/apache/maven/shared/maven-doxia-tools/1.0.2/maven-doxia-tools-1.0.2.pom
(6 KB at 11.7 KB/sec)
Downloading: http://repo1.maven.org/maven2/org/apache/maven/plugin-tools/maven-plugin-tools-java/2.8/maven-plugin-tools-java-2.8.pom
Downloaded: http://repo1.maven.org/maven2/org/apache/maven/plugin-tools/maven-plugin-tools-java/2.8/maven-plugin-tools-java-2.8.pom
(3 KB at 5.8 KB/sec)
Downloading: http://repo1.maven.org/maven2/org/apache/maven/plugin-tools/maven-plugin-tools-beanshell/2.8/maven-plugin-tools-beanshell-2.8.pom
Downloaded: http://repo1.maven.org/maven2/org/apache/maven/plugin-tools/maven-plugin-tools-beanshell/2.8/maven-plugin-tools-beanshell-2.8.pom
(3 KB at 4.6 KB/sec)
Downloading: http://repo1.maven.org/maven2/org/apache/maven/doxia/doxia-site-renderer/1.0/doxia-site-renderer-1.0.jar
Downloading: http://repo1.maven.org/maven2/org/apache/maven/doxia/doxia-core/1.0/doxia-core-1.0.jar
Downloading: http://repo1.maven.org/maven2/org/apache/maven/doxia/doxia-decoration-model/1.0/doxia-decoration-model-1.0.jar
Downloading: http://repo1.maven.org/maven2/org/apache/maven/doxia/doxia-module-apt/1.0/doxia-module-apt-1.0.jar
Downloading: http://repo1.maven.org/maven2/org/apache/maven/doxia/doxia-module-fml/1.0/doxia-module-fml-1.0.jar
Downloaded: http://repo1.maven.org/maven2/org/apache/maven/doxia/doxia-site-renderer/1.0/doxia-site-renderer-1.0.jar
(46 KB at 30.7 KB/sec)
Downloading: http://repo1.maven.org/maven2/org/apache/maven/doxia/doxia-module-xdoc/1.0/doxia-module-xdoc-1.0.jar
Downloaded: http://repo1.maven.org/maven2/org/apache/maven/doxia/doxia-core/1.0/doxia-core-1.0.jar
(54 KB at 31.1 KB/sec)
Downloading: http://repo1.maven.org/maven2/org/apache/maven/doxia/doxia-module-xhtml/1.0/doxia-module-xhtml-1.0.jar
Downloaded: http://repo1.maven.org/maven2/org/apache/maven/doxia/doxia-module-apt/1.0/doxia-module-apt-1.0.jar
(46 KB at 23.2 KB/sec)
Downloading: http://repo1.maven.org/maven2/org/apache/maven/plugin-tools/maven-plugin-tools-api/2.8/maven-plugin-tools-api-2.8.jar
Downloaded: http://repo1.maven.org/maven2/org/apache/maven/doxia/doxia-decoration-model/1.0/doxia-decoration-model-1.0.jar
(48 KB at 21.5 KB/sec)
Downloading: http://repo1.maven.org/maven2/org/apache/maven/reporting/maven-reporting-impl/2.0.5/maven-reporting-impl-2.0.5.jar
Downloaded: http://repo1.maven.org/maven2/org/apache/maven/doxia/doxia-module-fml/1.0/doxia-module-fml-1.0.jar
(19 KB at 7.3 KB/sec)
Downloading: http://repo1.maven.org/maven2/org/apache/maven/shared/maven-doxia-tools/1.0.2/maven-doxia-tools-1.0.2.jar
Downloaded: http://repo1.maven.org/maven2/org/apache/maven/doxia/doxia-module-xdoc/1.0/doxia-module-xdoc-1.0.jar
(28 KB at 10.9 KB/sec)
Downloading: http://repo1.maven.org/maven2/org/apache/maven/plugin-tools/maven-plugin-tools-java/2.8/maven-plugin-tools-java-2.8.jar
Downloaded: http://repo1.maven.org/maven2/org/apache/maven/doxia/doxia-module-xhtml/1.0/doxia-module-xhtml-1.0.jar
(22 KB at 8.5 KB/sec)
Downloading: http://repo1.maven.org/maven2/org/apache/maven/plugin-tools/maven-plugin-tools-beanshell/2.8/maven-plugin-tools-beanshell-2.8.jar
Downloaded: http://repo1.maven.org/maven2/org/apache/maven/plugin-tools/maven-plugin-tools-api/2.8/maven-plugin-tools-api-2.8.jar
(55 KB at 22.0 KB/sec)
Downloaded: http://repo1.maven.org/maven2/org/apache/maven/reporting/maven-reporting-impl/2.0.5/maven-reporting-impl-2.0.5.jar
(21 KB at 8.1 KB/sec)
Downloaded: http://repo1.maven.org/maven2/org/apache/maven/shared/maven-doxia-tools/1.0.2/maven-doxia-tools-1.0.2.jar
(41 KB at 16.0 KB/sec)
Downloaded: http://repo1.maven.org/maven2/org/apache/maven/plugin-tools/maven-plugin-tools-java/2.8/maven-plugin-tools-java-2.8.jar
(17 KB at 9.6 KB/sec)
Downloaded: http://repo1.maven.org/maven2/org/apache/maven/plugin-tools/maven-plugin-tools-beanshell/2.8/maven-plugin-tools-beanshell-2.8.jar
(14 KB at 7.5 KB/sec)
[INFO] Using 'UTF-8' encoding to read mojo metadata.
[INFO] Applying mojo extractor for language: java
[INFO] Mojo extractor for language: java found 6 mojo descriptors.
[INFO] Applying mojo extractor for language: bsh
[INFO] Mojo extractor for language: bsh found 0 mojo descriptors.
[INFO] [INFO] outputDirectory: <https://builds.apache.org/job/maven-plugin-tools/ws/maven-plugin-plugin/target/generated-sources/modello>
[INFO] Working on model: src/main/mdo/pluginRequirements.mdo

[INFO] --- modello-maven-plugin:1.4.1:java (default) @ maven-plugin-plugin ---[INFO] Generating
current version: 1.0.0

[INFO] [INFO] Using 'UTF-8' encoding to read mojo metadata.
[INFO] Applying mojo extractor for language: java

[INFO] --- maven-plugin-plugin:2.8:descriptor (default-descriptor) @ maven-plugin-plugin ---
[INFO] Mojo extractor for language: java found 7 mojo descriptors.
[INFO] Applying mojo extractor for language: bsh
[INFO] Mojo extractor for language: bsh found 0 mojo descriptors.
[INFO] 
[INFO] --- maven-remote-resources-plugin:1.2.1:process (default) @ maven-plugin-plugin ---
[INFO] [debug] execute contextualize
[INFO] Using 'UTF-8' encoding to copy filtered resources.
[INFO] Copying 5 resources
[INFO] Copying 3 resources

[INFO] --- maven-resources-plugin:2.5:resources (default-resources) @ maven-plugin-plugin
---
[INFO] 
[INFO] Compiling 9 source files to <https://builds.apache.org/job/maven-plugin-tools/ws/maven-plugin-plugin/target/classes>
[INFO] --- maven-compiler-plugin:2.3.2:compile (default-compile) @ maven-plugin-plugin ---
[debug] execute contextualize
[INFO] [INFO] Using 'UTF-8' encoding to copy filtered resources.
[INFO] skip non existing resourceDirectory <https://builds.apache.org/job/maven-plugin-tools/ws/maven-plugin-plugin/src/test/resources>
[INFO] Copying 3 resources

[INFO] --- maven-resources-plugin:2.5:testResources (default-testResources) @ maven-plugin-plugin
---
[INFO] [INFO] No sources to compile

[INFO] --- maven-compiler-plugin:2.3.2:testCompile (default-testCompile) @ maven-plugin-plugin
---
[INFO] [INFO] Surefire report directory: <https://builds.apache.org/job/maven-plugin-tools/ws/maven-plugin-plugin/target/surefire-reports>

-------------------------------------------------------
 T E S T S
-------------------------------------------------------

[INFO] --- maven-surefire-plugin:2.9:test (default-test) @ maven-plugin-plugin ---

Results :

Tests run: 0, Failures: 0, Errors: 0, Skipped: 0

[JENKINS] Recording test results
[INFO] 
[INFO] --- maven-jar-plugin:2.3.1:jar (default-jar) @ maven-plugin-plugin ---
[INFO] Building jar: <https://builds.apache.org/job/maven-plugin-tools/ws/maven-plugin-plugin/target/maven-plugin-plugin-2.10-SNAPSHOT.jar>
[INFO] 
[INFO] --- maven-plugin-plugin:2.8:addPluginArtifactMetadata (default-addPluginArtifactMetadata)
@ maven-plugin-plugin ---
[INFO] [INFO] Installing <https://builds.apache.org/job/maven-plugin-tools/ws/maven-plugin-plugin/target/maven-plugin-plugin-2.10-SNAPSHOT.jar>
to <https://builds.apache.org/job/maven-plugin-tools/ws/.repository/org/apache/maven/plugins/maven-plugin-plugin/2.10-SNAPSHOT/maven-plugin-plugin-2.10-SNAPSHOT.jar>
[INFO] Installing <https://builds.apache.org/job/maven-plugin-tools/ws/maven-plugin-plugin/pom.xml>
to <https://builds.apache.org/job/maven-plugin-tools/ws/.repository/org/apache/maven/plugins/maven-plugin-plugin/2.10-SNAPSHOT/maven-plugin-plugin-2.10-SNAPSHOT.pom>

[INFO] --- maven-install-plugin:2.3.1:install (default-install) @ maven-plugin-plugin ---
[JENKINS] Archiving <https://builds.apache.org/job/maven-plugin-tools/ws/maven-plugin-plugin/pom.xml>
to /home/hudson/hudson/jobs/maven-plugin-tools/modules/org.apache.maven.plugins$maven-plugin-plugin/builds/2011-10-08_12-03-19/archive/org.apache.maven.plugins/maven-plugin-plugin/2.10-SNAPSHOT/maven-plugin-plugin-2.10-SNAPSHOT.pom
[JENKINS] Archiving <https://builds.apache.org/job/maven-plugin-tools/ws/maven-plugin-plugin/target/maven-plugin-plugin-2.10-SNAPSHOT.jar>
to /home/hudson/hudson/jobs/maven-plugin-tools/modules/org.apache.maven.plugins$maven-plugin-plugin/builds/2011-10-08_12-03-19/archive/org.apache.maven.plugins/maven-plugin-plugin/2.10-SNAPSHOT/maven-plugin-plugin-2.10-SNAPSHOT.jar
[INFO]                                                                         
[INFO] ------------------------------------------------------------------------
[INFO] Building Maven Plugin Tools Javadoc 2.10-SNAPSHOT
[INFO] ------------------------------------------------------------------------
[INFO] 
[INFO] --- maven-clean-plugin:2.4.1:clean (default-clean) @ maven-plugin-tools-javadoc ---
[INFO] 
[INFO] --- maven-remote-resources-plugin:1.2.1:process (default) @ maven-plugin-tools-javadoc
---
[INFO] [debug] execute contextualize
[INFO] Using 'UTF-8' encoding to copy filtered resources.
[INFO] skip non existing resourceDirectory <https://builds.apache.org/job/maven-plugin-tools/ws/maven-plugin-tools-javadoc/src/main/resources>
[INFO] Copying 3 resources

[INFO] --- maven-resources-plugin:2.5:resources (default-resources) @ maven-plugin-tools-javadoc
---
[INFO] 
[INFO] --- maven-compiler-plugin:2.3.2:compile (default-compile) @ maven-plugin-tools-javadoc
---
[INFO] Compiling 22 source files to <https://builds.apache.org/job/maven-plugin-tools/ws/maven-plugin-tools-javadoc/target/classes>
[debug] execute contextualize
[INFO] [INFO] Using 'UTF-8' encoding to copy filtered resources.
[INFO] skip non existing resourceDirectory <https://builds.apache.org/job/maven-plugin-tools/ws/maven-plugin-tools-javadoc/src/test/resources>
[INFO] Copying 3 resources

[INFO] --- maven-resources-plugin:2.5:testResources (default-testResources) @ maven-plugin-tools-javadoc
---
[INFO] [INFO] No sources to compile

[INFO] --- maven-compiler-plugin:2.3.2:testCompile (default-testCompile) @ maven-plugin-tools-javadoc
---
[INFO] [INFO] Surefire report directory: <https://builds.apache.org/job/maven-plugin-tools/ws/maven-plugin-tools-javadoc/target/surefire-reports>

[INFO] --- maven-surefire-plugin:2.9:test (default-test) @ maven-plugin-tools-javadoc ---

-------------------------------------------------------
 T E S T S
-------------------------------------------------------

Results :

Tests run: 0, Failures: 0, Errors: 0, Skipped: 0

[JENKINS] Recording test results
[INFO] 
[INFO] --- maven-jar-plugin:2.3.1:jar (default-jar) @ maven-plugin-tools-javadoc ---
[INFO] Building jar: <https://builds.apache.org/job/maven-plugin-tools/ws/maven-plugin-tools-javadoc/target/maven-plugin-tools-javadoc-2.10-SNAPSHOT.jar>
[INFO] 
[INFO] --- maven-site-plugin:3.0:attach-descriptor (attach-descriptor) @ maven-plugin-tools-javadoc
---
[INFO] [INFO] Installing <https://builds.apache.org/job/maven-plugin-tools/ws/maven-plugin-tools-javadoc/target/maven-plugin-tools-javadoc-2.10-SNAPSHOT.jar>
to <https://builds.apache.org/job/maven-plugin-tools/ws/.repository/org/apache/maven/plugin-tools/maven-plugin-tools-javadoc/2.10-SNAPSHOT/maven-plugin-tools-javadoc-2.10-SNAPSHOT.jar>
[INFO] Installing <https://builds.apache.org/job/maven-plugin-tools/ws/maven-plugin-tools-javadoc/pom.xml>
to <https://builds.apache.org/job/maven-plugin-tools/ws/.repository/org/apache/maven/plugin-tools/maven-plugin-tools-javadoc/2.10-SNAPSHOT/maven-plugin-tools-javadoc-2.10-SNAPSHOT.pom>

[INFO] --- maven-install-plugin:2.3.1:install (default-install) @ maven-plugin-tools-javadoc
---
[JENKINS] Archiving <https://builds.apache.org/job/maven-plugin-tools/ws/maven-plugin-tools-javadoc/pom.xml>
to /home/hudson/hudson/jobs/maven-plugin-tools/modules/org.apache.maven.plugin-tools$maven-plugin-tools-javadoc/builds/2011-10-08_12-03-19/archive/org.apache.maven.plugin-tools/maven-plugin-tools-javadoc/2.10-SNAPSHOT/maven-plugin-tools-javadoc-2.10-SNAPSHOT.pom
[JENKINS] Archiving <https://builds.apache.org/job/maven-plugin-tools/ws/maven-plugin-tools-javadoc/target/maven-plugin-tools-javadoc-2.10-SNAPSHOT.jar>
to /home/hudson/hudson/jobs/maven-plugin-tools/modules/org.apache.maven.plugin-tools$maven-plugin-tools-javadoc/builds/2011-10-08_12-03-19/archive/org.apache.maven.plugin-tools/maven-plugin-tools-javadoc/2.10-SNAPSHOT/maven-plugin-tools-javadoc-2.10-SNAPSHOT.jar
[INFO] ------------------------------------------------------------------------
[INFO] Reactor Summary:
[INFO] 
[INFO] Maven Plugin Tools ................................ SUCCESS [2:32.492s]
[INFO] Maven Plugin Tools APIs ........................... SUCCESS [1:16.421s]
[INFO] Maven Plugin Metadata Model ....................... SUCCESS [20.153s]
[INFO] Maven Plugin Tool for Ant ......................... SUCCESS [1.644s]
[INFO] Maven Plugin Tool for Java ........................ SUCCESS [2.510s]
[INFO] Maven Plugin Tool for Beanshell ................... SUCCESS [2.189s]
[INFO] Maven Plugin Plugin ............................... SUCCESS [35.312s]
[INFO] Maven Plugin Tools Javadoc ........................ SUCCESS [1.390s]
[INFO] ------------------------------------------------------------------------
[INFO] BUILD SUCCESS
[INFO] ------------------------------------------------------------------------
[INFO] Total time: 4:54.705s
[INFO] Finished at: Sat Oct 08 12:08:18 GMT 2011
[INFO] Final Memory: 29M/383M
[INFO] ------------------------------------------------------------------------
Waiting for Jenkins to finish collecting data
channel stopped
Maven RedeployPublished use remote ubuntu3 maven settings from : /home/jenkins/.m2/settings.xml
[INFO] Deployment in https://repository.apache.org/content/repositories/snapshots (id=,uniqueVersion=true)
Deploying the main artifact maven-plugin-tools-2.10-SNAPSHOT.pom
Downloading: https://repository.apache.org/content/repositories/snapshots/org/apache/maven/plugin-tools/maven-plugin-tools/2.10-SNAPSHOT/maven-metadata.xml
Downloaded: https://repository.apache.org/content/repositories/snapshots/org/apache/maven/plugin-tools/maven-plugin-tools/2.10-SNAPSHOT/maven-metadata.xml
(832 B at 5.6 KB/sec)
Uploading: https://repository.apache.org/content/repositories/snapshots/org/apache/maven/plugin-tools/maven-plugin-tools/2.10-SNAPSHOT/maven-plugin-tools-2.10-20111008.120818-4.pom
Uploading: https://repository.apache.org/content/repositories/snapshots/org/apache/maven/plugin-tools/maven-plugin-tools/2.10-SNAPSHOT/maven-plugin-tools-2.10-20111008.120818-4.pom
ERROR: Failed to deploy artifacts: Could not transfer artifact org.apache.maven.plugin-tools:maven-plugin-tools:pom:2.10-20111008.120818-4
from/to  (https://repository.apache.org/content/repositories/snapshots): Failed to transfer
file: https://repository.apache.org/content/repositories/snapshots/org/apache/maven/plugin-tools/maven-plugin-tools/2.10-SNAPSHOT/maven-plugin-tools-2.10-20111008.120818-4.pom.
Return code is: 401
org.apache.maven.artifact.deployer.ArtifactDeploymentException: Failed to deploy artifacts:
Could not transfer artifact org.apache.maven.plugin-tools:maven-plugin-tools:pom:2.10-20111008.120818-4
from/to  (https://repository.apache.org/content/repositories/snapshots): Failed to transfer
file: https://repository.apache.org/content/repositories/snapshots/org/apache/maven/plugin-tools/maven-plugin-tools/2.10-SNAPSHOT/maven-plugin-tools-2.10-20111008.120818-4.pom.
Return code is: 401
	at org.apache.maven.artifact.deployer.DefaultArtifactDeployer.deploy(DefaultArtifactDeployer.java:141)
	at hudson.maven.reporters.MavenArtifactRecord.deploy(MavenArtifactRecord.java:189)
	at hudson.maven.RedeployPublisher.perform(RedeployPublisher.java:158)
	at hudson.tasks.BuildStepMonitor$1.perform(BuildStepMonitor.java:19)
	at hudson.model.AbstractBuild$AbstractRunner.perform(AbstractBuild.java:693)
	at hudson.model.AbstractBuild$AbstractRunner.performAllBuildSteps(AbstractBuild.java:668)
	at hudson.maven.MavenModuleSetBuild$RunnerImpl.post2(MavenModuleSetBuild.java:953)
	at hudson.model.AbstractBuild$AbstractRunner.post(AbstractBuild.java:615)
	at hudson.model.Run.run(Run.java:1401)
	at hudson.maven.MavenModuleSetBuild.run(MavenModuleSetBuild.java:474)
	at hudson.model.ResourceController.execute(ResourceController.java:88)
	at hudson.model.Executor.run(Executor.java:230)
Caused by: org.sonatype.aether.deployment.DeploymentException: Failed to deploy artifacts:
Could not transfer artifact org.apache.maven.plugin-tools:maven-plugin-tools:pom:2.10-20111008.120818-4
from/to  (https://repository.apache.org/content/repositories/snapshots): Failed to transfer
file: https://repository.apache.org/content/repositories/snapshots/org/apache/maven/plugin-tools/maven-plugin-tools/2.10-SNAPSHOT/maven-plugin-tools-2.10-20111008.120818-4.pom.
Return code is: 401
	at org.sonatype.aether.impl.internal.DefaultDeployer.deploy(DefaultDeployer.java:284)
	at org.sonatype.aether.impl.internal.DefaultDeployer.deploy(DefaultDeployer.java:215)
	at org.sonatype.aether.impl.internal.DefaultRepositorySystem.deploy(DefaultRepositorySystem.java:480)
	at org.apache.maven.artifact.deployer.DefaultArtifactDeployer.deploy(DefaultArtifactDeployer.java:137)
	... 11 more
Caused by: org.sonatype.aether.transfer.ArtifactTransferException: Could not transfer artifact
org.apache.maven.plugin-tools:maven-plugin-tools:pom:2.10-20111008.120818-4 from/to  (https://repository.apache.org/content/repositories/snapshots):
Failed to transfer file: https://repository.apache.org/content/repositories/snapshots/org/apache/maven/plugin-tools/maven-plugin-tools/2.10-SNAPSHOT/maven-plugin-tools-2.10-20111008.120818-4.pom.
Return code is: 401
	at org.sonatype.aether.connector.wagon.WagonRepositoryConnector$4.wrap(WagonRepositoryConnector.java:949)
	at org.sonatype.aether.connector.wagon.WagonRepositoryConnector$4.wrap(WagonRepositoryConnector.java:940)
	at org.sonatype.aether.connector.wagon.WagonRepositoryConnector$PutTask.flush(WagonRepositoryConnector.java:864)
	at org.sonatype.aether.connector.wagon.WagonRepositoryConnector.put(WagonRepositoryConnector.java:466)
	at org.sonatype.aether.impl.internal.DefaultDeployer.deploy(DefaultDeployer.java:278)
	... 14 more
Caused by: org.apache.maven.wagon.TransferFailedException: Failed to transfer file: https://repository.apache.org/content/repositories/snapshots/org/apache/maven/plugin-tools/maven-plugin-tools/2.10-SNAPSHOT/maven-plugin-tools-2.10-20111008.120818-4.pom.
Return code is: 401
	at org.apache.maven.wagon.shared.http.AbstractHttpClientWagon.put(AbstractHttpClientWagon.java:368)
	at org.apache.maven.wagon.shared.http.AbstractHttpClientWagon.put(AbstractHttpClientWagon.java:280)
	at org.sonatype.aether.connector.wagon.WagonRepositoryConnector$PutTask.run(WagonRepositoryConnector.java:825)
	at org.sonatype.aether.connector.wagon.WagonRepositoryConnector.put(WagonRepositoryConnector.java:465)
	... 15 more
[INFO] Deployment failed after 0.51 sec
Build step 'Deploy artifacts to Maven repository' changed build result to FAILURE


Mime
View raw message