maven-notifications mailing list archives

Site index · List index
Message view « Date » · « Thread »
Top « Date » · « Thread »
From Apache Jenkins Server <jenk...@builds.apache.org>
Subject Build failed in Jenkins: maven-plugins-ITs-m3 #297
Date Tue, 06 Dec 2011 11:39:41 GMT
See <https://builds.apache.org/job/maven-plugins-ITs-m3/297/changes>

Changes:

[olamy] .gitignore + .idea

------------------------------------------
[...truncated 9415 lines...]
[INFO] 
[INFO] --- maven-clean-plugin:2.4.1:clean (default-clean) @ maven-remote-resources-plugin
---
[INFO] Deleting <https://builds.apache.org/job/maven-plugins-ITs-m3/ws/maven-remote-resources-plugin/target>
[INFO] ..SUCCESS (3.2 s)
[INFO] Building: script-global-vars/pom.xml
[INFO] 
[INFO] --- maven-enforcer-plugin:1.0:enforce (ensure-no-container-api) @ maven-remote-resources-plugin
---
[INFO] 
[INFO] --- maven-plugin-plugin:2.7:helpmojo (generated-helpmojo) @ maven-remote-resources-plugin
---
[INFO] Using 'UTF-8' encoding to read mojo metadata.
[INFO] Applying mojo extractor for language: java
[INFO] Mojo extractor for language: java found 2 mojo descriptors.
[INFO] Applying mojo extractor for language: bsh
[INFO] Mojo extractor for language: bsh found 0 mojo descriptors.
[INFO] 
[INFO] --- modello-maven-plugin:1.4.1:xpp3-writer (remote-resources) @ maven-remote-resources-plugin
---
[INFO] outputDirectory: <https://builds.apache.org/job/maven-plugins-ITs-m3/ws/maven-remote-resources-plugin/target/generated-sources/modello>
[INFO] Working on model: src/main/mdo/remote-resources.mdo
[INFO] Generating current version: 1.1.0
[INFO] 
[INFO] --- modello-maven-plugin:1.4.1:java (remote-resources) @ maven-remote-resources-plugin
---
[INFO] outputDirectory: <https://builds.apache.org/job/maven-plugins-ITs-m3/ws/maven-remote-resources-plugin/target/generated-sources/modello>
[INFO] Working on model: src/main/mdo/remote-resources.mdo
[INFO] Generating current version: 1.1.0
[INFO] 
[INFO] --- modello-maven-plugin:1.4.1:xpp3-reader (remote-resources) @ maven-remote-resources-plugin
---
[INFO] outputDirectory: <https://builds.apache.org/job/maven-plugins-ITs-m3/ws/maven-remote-resources-plugin/target/generated-sources/modello>
[INFO] Working on model: src/main/mdo/remote-resources.mdo
[INFO] Generating current version: 1.1.0
[INFO] 
[INFO] --- modello-maven-plugin:1.4.1:xpp3-writer (supplemental-models) @ maven-remote-resources-plugin
---
[INFO] outputDirectory: <https://builds.apache.org/job/maven-plugins-ITs-m3/ws/maven-remote-resources-plugin/target/generated-sources/modello>
[INFO] Working on model: src/main/mdo/supplemental-model.mdo
[INFO] Generating current version: 1.0.0
[INFO] 
[INFO] --- modello-maven-plugin:1.4.1:java (supplemental-models) @ maven-remote-resources-plugin
---
[INFO] outputDirectory: <https://builds.apache.org/job/maven-plugins-ITs-m3/ws/maven-remote-resources-plugin/target/generated-sources/modello>
[INFO] Working on model: src/main/mdo/supplemental-model.mdo
[INFO] Generating current version: 1.0.0
[INFO] 
[INFO] --- modello-maven-plugin:1.4.1:xpp3-reader (supplemental-models) @ maven-remote-resources-plugin
---
[INFO] outputDirectory: <https://builds.apache.org/job/maven-plugins-ITs-m3/ws/maven-remote-resources-plugin/target/generated-sources/modello>
[INFO] Working on model: src/main/mdo/supplemental-model.mdo
[INFO] Generating current version: 1.0.0
[INFO] 
[INFO] --- maven-plugin-plugin:2.7:descriptor (default-descriptor) @ maven-remote-resources-plugin
---
[INFO] Using 'UTF-8' encoding to read mojo metadata.
[INFO] Applying mojo extractor for language: java
[INFO] Mojo extractor for language: java found 3 mojo descriptors.
[INFO] Applying mojo extractor for language: bsh
[INFO] Mojo extractor for language: bsh found 0 mojo descriptors.
[INFO] 
[INFO] --- maven-remote-resources-plugin:1.1:process (default) @ maven-remote-resources-plugin
---
[INFO] 
[INFO] --- maven-resources-plugin:2.4.3:resources (default-resources) @ maven-remote-resources-plugin
---
[INFO] Using 'UTF-8' encoding to copy filtered resources.
[INFO] Copying 1 resource
[INFO] Copying 3 resources
[INFO] 
[INFO] --- maven-compiler-plugin:2.3.2:compile (default-compile) @ maven-remote-resources-plugin
---
[INFO] Compiling 11 source files to <https://builds.apache.org/job/maven-plugins-ITs-m3/ws/maven-remote-resources-plugin/target/classes>
[INFO] 
[INFO] --- maven-resources-plugin:2.4.3:testResources (default-testResources) @ maven-remote-resources-plugin
---
[INFO] Using 'UTF-8' encoding to copy filtered resources.
[INFO] Copying 7 resources
[INFO] ..SUCCESS (7.5 s)
[INFO] Building: integration-test-never-fails/pom.xml
[INFO] ..SUCCESS (28.6 s)
[INFO] 
[INFO] --- maven-jarsigner-plugin:1.2:verify (verify) @ maven-project-info-reports-plugin
---
[INFO] Copying 42 resources
[INFO] ..SUCCESS (4.5 s)
[INFO] Building: project-cloning/pom.xml
[INFO]                                                                         
[INFO] ------------------------------------------------------------------------
[INFO] Building Maven Plugins Aggregator 1-SNAPSHOT
[INFO] ------------------------------------------------------------------------
[WARNING] *****************************************************************
[WARNING] * Your build is requesting parallel execution, but project      *
[WARNING] * contains the following plugin(s) that are not marked as       *
[WARNING] * @threadSafe to support parallel building.                     *
[WARNING] * While this /may/ work fine, please look for plugin updates    *
[WARNING] * and/or request plugins be made thread-safe.                   *
[WARNING] * If reporting an issue, report it against the plugin in        *
[WARNING] * question, not against maven-core                              *
[WARNING] *****************************************************************
[WARNING] The following plugins are not marked @threadSafe in Maven Plugins Aggregator:
[WARNING] org.apache.maven.plugins:maven-remote-resources-plugin:1.1
[WARNING] *****************************************************************
[INFO] 
[INFO] --- maven-clean-plugin:2.4.1:clean (default-clean) @ maven-plugins-aggregator ---
[INFO] Deleting <https://builds.apache.org/job/maven-plugins-ITs-m3/ws/target>
[INFO] 
[INFO] --- maven-remote-resources-plugin:1.1:process (default) @ maven-plugins-aggregator
---
[INFO] Copying 1 resource
[INFO] 
[INFO] --- maven-install-plugin:2.3.1:install (default-install) @ maven-plugins-aggregator
---
[INFO] Installing <https://builds.apache.org/job/maven-plugins-ITs-m3/ws/pom.xml> to
/home/hudson/.m2/repository/org/apache/maven/plugins/maven-plugins-aggregator/1-SNAPSHOT/maven-plugins-aggregator-1-SNAPSHOT.pom
[INFO] Copying 3 resources
[INFO] 
[INFO] --- maven-compiler-plugin:2.3.2:testCompile (default-testCompile) @ maven-remote-resources-plugin
---
[INFO] Compiling 17 source files to <https://builds.apache.org/job/maven-plugins-ITs-m3/ws/maven-remote-resources-plugin/target/test-classes>
[INFO] 
[INFO] --- maven-surefire-plugin:2.7.2:test (default-test) @ maven-remote-resources-plugin
---
[INFO] Surefire report directory: <https://builds.apache.org/job/maven-plugins-ITs-m3/ws/maven-remote-resources-plugin/target/surefire-reports>

-------------------------------------------------------
 T E S T S
-------------------------------------------------------
Running org.apache.maven.plugin.resources.remote.RemoteResourcesMojoTest
Tests run: 8, Failures: 0, Errors: 0, Skipped: 0, Time elapsed: 1.171 sec

Results :

Tests run: 8, Failures: 0, Errors: 0, Skipped: 0

[INFO] 
[INFO] --- maven-jar-plugin:2.3.1:jar (default-jar) @ maven-remote-resources-plugin ---
[INFO] Building jar: <https://builds.apache.org/job/maven-plugins-ITs-m3/ws/maven-remote-resources-plugin/target/maven-remote-resources-plugin-1.3-SNAPSHOT.jar>
[INFO] 
[INFO] --- maven-plugin-plugin:2.7:addPluginArtifactMetadata (default-addPluginArtifactMetadata)
@ maven-remote-resources-plugin ---
[INFO] 
[INFO] --- maven-invoker-plugin:1.5:install (install-descriptor) @ maven-remote-resources-plugin
---
[INFO] Installing <https://builds.apache.org/job/maven-plugins-ITs-m3/ws/maven-remote-resources-plugin/pom.xml>
to <https://builds.apache.org/job/maven-plugins-ITs-m3/ws/maven-remote-resources-plugin/target/it-repo/org/apache/maven/plugins/maven-remote-resources-plugin/1.3-SNAPSHOT/maven-remote-resources-plugin-1.3-SNAPSHOT.pom>
[INFO] Installing <https://builds.apache.org/job/maven-plugins-ITs-m3/ws/maven-remote-resources-plugin/target/maven-remote-resources-plugin-1.3-SNAPSHOT.jar>
to <https://builds.apache.org/job/maven-plugins-ITs-m3/ws/maven-remote-resources-plugin/target/it-repo/org/apache/maven/plugins/maven-remote-resources-plugin/1.3-SNAPSHOT/maven-remote-resources-plugin-1.3-SNAPSHOT.jar>
[INFO] 
[INFO] --- maven-failsafe-plugin:2.9:integration-test (integration-tests) @ maven-remote-resources-plugin
---
[INFO] Failsafe report directory: <https://builds.apache.org/job/maven-plugins-ITs-m3/ws/maven-remote-resources-plugin/target/failsafe-reports>

-------------------------------------------------------
 T E S T S
-------------------------------------------------------
Running org.apache.maven.plugin.resources.remote.it.IT_RunOnlyAtExecutionRoot
[INFO] ..SUCCESS (7.2 s)
[INFO] Building: pom-less-invocation/pom.xml
[INFO] ..SUCCESS (3.1 s)
[INFO] Building: local-repo-path/pom.xml
[INFO] ..SUCCESS (5.4 s)
[INFO] Building: invocation-offline/pom.xml
[INFO] ..SUCCESS (5.7 s)
[INFO] Building: settings-auto-exclude/pom.xml
[INFO] ..SUCCESS (4.1 s)
[INFO] Building: staging-reactor/pom.xml
[INFO] ..SUCCESS (4.1 s)
[INFO] Building: script-accessibility/pom.xml
[INFO] ..SUCCESS (6.5 s)
[INFO] -------------------------------------------------
[INFO] Build Summary:
[INFO]   Passed: 40, Failed: 0, Errors: 0, Skipped: 0
[INFO] -------------------------------------------------
[INFO] 
[INFO] --- maven-install-plugin:2.3.1:install (default-install) @ maven-invoker-plugin ---
[INFO] Installing <https://builds.apache.org/job/maven-plugins-ITs-m3/ws/maven-invoker-plugin/target/maven-invoker-plugin-1.6-SNAPSHOT.jar>
to /home/hudson/.m2/repository/org/apache/maven/plugins/maven-invoker-plugin/1.6-SNAPSHOT/maven-invoker-plugin-1.6-SNAPSHOT.jar
[INFO] Installing <https://builds.apache.org/job/maven-plugins-ITs-m3/ws/maven-invoker-plugin/pom.xml>
to /home/hudson/.m2/repository/org/apache/maven/plugins/maven-invoker-plugin/1.6-SNAPSHOT/maven-invoker-plugin-1.6-SNAPSHOT.pom
Tests run: 1, Failures: 0, Errors: 0, Skipped: 0, Time elapsed: 97.692 sec
Running org.apache.maven.plugin.resources.remote.it.IT_GenerateFromOverride
Tests run: 1, Failures: 0, Errors: 0, Skipped: 0, Time elapsed: 2.338 sec
Running org.apache.maven.plugin.resources.remote.it.IT_GetDependencyProjects
Tests run: 1, Failures: 0, Errors: 0, Skipped: 0, Time elapsed: 8.001 sec
Running org.apache.maven.plugin.resources.remote.it.IT_SupplementalArtifact
Tests run: 1, Failures: 0, Errors: 0, Skipped: 0, Time elapsed: 6.3 sec
Running org.apache.maven.plugin.resources.remote.it.IT_CustomFilterDelimiter
Tests run: 1, Failures: 0, Errors: 0, Skipped: 0, Time elapsed: 2.271 sec
Running org.apache.maven.plugin.resources.remote.it.IT_FilterLocalOverride
Tests run: 1, Failures: 0, Errors: 0, Skipped: 0, Time elapsed: 2.422 sec
Running org.apache.maven.plugin.resources.remote.it.IT_BadDependencyPoms
Tests run: 1, Failures: 0, Errors: 0, Skipped: 0, Time elapsed: 2.538 sec
Running org.apache.maven.plugin.resources.remote.it.IT_GenerateFromBundle
Tests run: 1, Failures: 0, Errors: 0, Skipped: 0, Time elapsed: 2.382 sec

Results :

Tests run: 8, Failures: 0, Errors: 0, Skipped: 0

[WARNING] File encoding has not been set, using platform encoding ANSI_X3.4-1968, i.e. build
is platform dependent!
[INFO] 
[INFO] --- maven-failsafe-plugin:2.9:verify (integration-tests) @ maven-remote-resources-plugin
---
[INFO] Failsafe report directory: <https://builds.apache.org/job/maven-plugins-ITs-m3/ws/maven-remote-resources-plugin/target/failsafe-reports>
[WARNING] File encoding has not been set, using platform encoding ANSI_X3.4-1968, i.e. build
is platform dependent!
[INFO] 
[INFO] --- maven-install-plugin:2.3.1:install (default-install) @ maven-remote-resources-plugin
---
[INFO] Installing <https://builds.apache.org/job/maven-plugins-ITs-m3/ws/maven-remote-resources-plugin/target/maven-remote-resources-plugin-1.3-SNAPSHOT.jar>
to /home/hudson/.m2/repository/org/apache/maven/plugins/maven-remote-resources-plugin/1.3-SNAPSHOT/maven-remote-resources-plugin-1.3-SNAPSHOT.jar
[INFO] Installing <https://builds.apache.org/job/maven-plugins-ITs-m3/ws/maven-remote-resources-plugin/pom.xml>
to /home/hudson/.m2/repository/org/apache/maven/plugins/maven-remote-resources-plugin/1.3-SNAPSHOT/maven-remote-resources-plugin-1.3-SNAPSHOT.pom
[INFO] ------------------------------------------------------------------------
[INFO] Reactor Summary:
[INFO] 
[INFO] Maven Plugins ..................................... SUCCESS [8.418s]
[INFO] Maven ACR Plugin .................................. SUCCESS [1:28.615s]
[INFO] Maven Ant Plugin .................................. SUCCESS [2:30.943s]
[INFO] Maven AntRun Plugin ............................... SUCCESS [1:59.792s]
[INFO] Maven Eclipse Plugin .............................. SUCCESS [13:48.634s]
[INFO] Maven Assembly Plugin ............................. FAILURE [15:30.481s]
[INFO] Maven Changelog Plugin ............................ SUCCESS [1:27.205s]
[INFO] Maven Changes Report Plugin ....................... SUCCESS [1:30.450s]
[INFO] Maven Checkstyle Plugin ........................... SUCCESS [1:55.554s]
[INFO] Maven Clean Plugin ................................ SUCCESS [24.263s]
[INFO] Maven Compiler Plugin ............................. SUCCESS [28.016s]
[INFO] Maven Dependency Plugin ........................... SUCCESS [2:42.381s]
[INFO] Maven Deploy Plugin ............................... SUCCESS [2:10.305s]
[INFO] Maven DOAP Plugin ................................. SUCCESS [24.281s]
[INFO] Maven Documentation Checker Plugin ................ SUCCESS [10.159s]
[INFO] Maven EAR Plugin .................................. SUCCESS [4:14.945s]
[INFO] Maven EJB Plugin .................................. SUCCESS [35.473s]
[INFO] Maven GPG Plugin .................................. SUCCESS [48.971s]
[INFO] Maven Help Plugin ................................. SUCCESS [46.230s]
[INFO] Maven IDEA Plugin ................................. SUCCESS [10.300s]
[INFO] Maven Install Plugin .............................. SUCCESS [47.036s]
[INFO] Maven JAR Plugin .................................. SUCCESS [1:20.008s]
[INFO] Maven Jarsigner Plugin ............................ SUCCESS [34.074s]
[INFO] Maven Javadoc Plugin .............................. SUCCESS [8:35.538s]
[INFO] Maven Linkcheck Plugin ............................ SUCCESS [6.300s]
[INFO] Maven One Plugin .................................. SUCCESS [3.294s]
[INFO] Maven Patch Plugin ................................ SUCCESS [14.120s]
[INFO] Maven PDF Plugin .................................. SUCCESS [38.597s]
[INFO] Maven PMD Plugin .................................. SUCCESS [45.817s]
[INFO] Maven RAR Plugin .................................. SUCCESS [8.553s]
[INFO] Maven Reactor Plugin .............................. SUCCESS [4.172s]
[INFO] Maven Repository Plugin ........................... SUCCESS [2:40.884s]
[INFO] Maven Resources Plugin ............................ SUCCESS [59.139s]
[INFO] Maven Shade Plugin ................................ SUCCESS [2:02.499s]
[INFO] Maven Site Plugin 3 ............................... SUCCESS [6:37.771s]
[INFO] Maven Source Plugin ............................... SUCCESS [43.835s]
[INFO] Maven Stage Plugin ................................ SUCCESS [4.548s]
[INFO] Maven Toolchains Plugin ........................... SUCCESS [5.987s]
[INFO] Maven Verifier Plugin ............................. SUCCESS [13.315s]
[INFO] Maven WAR Plugin .................................. SUCCESS [1:32.951s]
[INFO] Maven Invoker Plugin .............................. SUCCESS [4:23.202s]
[INFO] Maven Project Info Reports Plugin ................. SUCCESS [2:15.821s]
[INFO] Maven Remote Resources Plugin ..................... SUCCESS [2:21.106s]
[INFO] Maven Plugins Aggregator .......................... SUCCESS [0.168s]
[INFO] ------------------------------------------------------------------------
[INFO] BUILD FAILURE
[INFO] ------------------------------------------------------------------------
[INFO] Total time: 31:26.100s (Wall Clock)
[INFO] Finished at: Tue Dec 06 11:39:39 UTC 2011
[INFO] Final Memory: 68M/996M
[INFO] ------------------------------------------------------------------------
[WARNING] The requested profile "apache.snapshots" could not be activated because it does
not exist.
[ERROR] Failed to execute goal org.apache.maven.plugins:maven-invoker-plugin:1.5:run (integration-test)
on project maven-assembly-plugin: 1 build failed. -> [Help 1]
[ERROR] 
[ERROR] To see the full stack trace of the errors, re-run Maven with the -e switch.
[ERROR] Re-run Maven using the -X switch to enable full debug logging.
[ERROR] 
[ERROR] For more information about the errors and possible solutions, please read the following
articles:
[ERROR] [Help 1] http://cwiki.apache.org/confluence/display/MAVEN/MojoFailureException
[ERROR] 
[ERROR] After correcting the problems, you can resume the build with the command
[ERROR]   mvn <goals> -rf :maven-assembly-plugin
Build step 'Invoke top-level Maven targets' marked build as failure


Mime
View raw message