maven-notifications mailing list archives

Site index · List index
Message view « Date » · « Thread »
Top « Date » · « Thread »
From Apache Jenkins Server <jenk...@builds.apache.org>
Subject Build failed in Jenkins: maven-plugins-ITs-m3 #294
Date Fri, 02 Dec 2011 13:29:54 GMT
See <https://builds.apache.org/job/maven-plugins-ITs-m3/294/changes>

Changes:

[carlos] [MDEPLOY-46] Add IT for snapshot deployment with altDeploymentRepository

------------------------------------------
[...truncated 7757 lines...]
[INFO] Generating current version: 1.0.0
[INFO] 
[INFO] --- maven-plugin-plugin:2.7:descriptor (default-descriptor) @ maven-remote-resources-plugin
---
[INFO] Using 'UTF-8' encoding to read mojo metadata.
[INFO] Applying mojo extractor for language: java
[INFO] Mojo extractor for language: java found 3 mojo descriptors.
[INFO] Applying mojo extractor for language: bsh
[INFO] Mojo extractor for language: bsh found 0 mojo descriptors.
[INFO] 
[INFO] --- maven-remote-resources-plugin:1.1:process (default) @ maven-remote-resources-plugin
---
[INFO] 
[INFO] --- maven-resources-plugin:2.4.3:resources (default-resources) @ maven-remote-resources-plugin
---
[INFO] Using 'UTF-8' encoding to copy filtered resources.
[INFO] Copying 1 resource
[INFO] Copying 3 resources
[INFO] 
[INFO] --- maven-compiler-plugin:2.3.2:compile (default-compile) @ maven-remote-resources-plugin
---
[INFO] Compiling 11 source files to <https://builds.apache.org/job/maven-plugins-ITs-m3/ws/maven-remote-resources-plugin/target/classes>
[INFO] 
[INFO] --- maven-resources-plugin:2.4.3:testResources (default-testResources) @ maven-remote-resources-plugin
---
[INFO] Using 'UTF-8' encoding to copy filtered resources.
[INFO] Copying 7 resources
[INFO] Copying 42 resources
[INFO] Copying 1 resource
[INFO] Copying 3 resources
[INFO] 
[INFO] --- maven-compiler-plugin:2.3.2:testCompile (default-testCompile) @ maven-remote-resources-plugin
---
[INFO] Compiling 17 source files to <https://builds.apache.org/job/maven-plugins-ITs-m3/ws/maven-remote-resources-plugin/target/test-classes>
[INFO] 
[INFO] --- maven-surefire-plugin:2.7.2:test (default-test) @ maven-remote-resources-plugin
---
[INFO] Surefire report directory: <https://builds.apache.org/job/maven-plugins-ITs-m3/ws/maven-remote-resources-plugin/target/surefire-reports>

-------------------------------------------------------
 T E S T S
-------------------------------------------------------
Running org.apache.maven.plugin.resources.remote.RemoteResourcesMojoTest
[INFO] ..SUCCESS (4.5 s)
[INFO] Building: invoker-report/pom.xml
[INFO] ..SUCCESS (39.3 s)
[INFO] Building: report-changes-generation/pom.xml
Tests run: 8, Failures: 0, Errors: 0, Skipped: 0, Time elapsed: 1.319 sec

Results :

Tests run: 8, Failures: 0, Errors: 0, Skipped: 0

[INFO] 
[INFO] --- maven-jar-plugin:2.3.1:jar (default-jar) @ maven-remote-resources-plugin ---
[INFO] Building jar: <https://builds.apache.org/job/maven-plugins-ITs-m3/ws/maven-remote-resources-plugin/target/maven-remote-resources-plugin-1.3-SNAPSHOT.jar>
[INFO] 
[INFO] --- maven-plugin-plugin:2.7:addPluginArtifactMetadata (default-addPluginArtifactMetadata)
@ maven-remote-resources-plugin ---
[INFO] 
[INFO] --- maven-invoker-plugin:1.5:install (install-descriptor) @ maven-remote-resources-plugin
---
[INFO] Installing <https://builds.apache.org/job/maven-plugins-ITs-m3/ws/maven-remote-resources-plugin/pom.xml>
to <https://builds.apache.org/job/maven-plugins-ITs-m3/ws/maven-remote-resources-plugin/target/it-repo/org/apache/maven/plugins/maven-remote-resources-plugin/1.3-SNAPSHOT/maven-remote-resources-plugin-1.3-SNAPSHOT.pom>
[INFO] Installing <https://builds.apache.org/job/maven-plugins-ITs-m3/ws/maven-remote-resources-plugin/target/maven-remote-resources-plugin-1.3-SNAPSHOT.jar>
to <https://builds.apache.org/job/maven-plugins-ITs-m3/ws/maven-remote-resources-plugin/target/it-repo/org/apache/maven/plugins/maven-remote-resources-plugin/1.3-SNAPSHOT/maven-remote-resources-plugin-1.3-SNAPSHOT.jar>
[INFO] 
[INFO] --- maven-failsafe-plugin:2.9:integration-test (integration-tests) @ maven-remote-resources-plugin
---
[INFO] Failsafe report directory: <https://builds.apache.org/job/maven-plugins-ITs-m3/ws/maven-remote-resources-plugin/target/failsafe-reports>

-------------------------------------------------------
 T E S T S
-------------------------------------------------------
Running org.apache.maven.plugin.resources.remote.it.IT_RunOnlyAtExecutionRoot
[INFO] ..SUCCESS (12.5 s)
[INFO] Building: fail-ignore-with-verify/pom.xml
[INFO] ..SUCCESS (4.3 s)
[INFO] Building: fail-postbuild/pom.xml
[INFO] ..SUCCESS (19.0 s)
[INFO] Building: MSITE-512/pom.xml
[INFO] ..SUCCESS (4.4 s)
[INFO] Building: selector-conditions/pom.xml
[INFO] ..SUCCESS (6.8 s)
[INFO] Building: interpolation/pom.xml
[INFO] ..SUCCESS (7.2 s)
[INFO] Building: invocation-multiple/pom.xml
[INFO] ..SUCCESS (6.8 s)
[INFO] Building: site-attach-descriptor/pom.xml
[INFO] ..SUCCESS (4.7 s)
[INFO] Building: site-skip/pom.xml
[INFO] ..SUCCESS (5.0 s)
[INFO] Building: MSITE-504/pom.xml
[INFO] ..SUCCESS (17.5 s)
[INFO] Building: selector-scripts/pom.xml
[INFO] ..SUCCESS (5.9 s)
[INFO] Building: fail-build/pom.xml
[INFO] ..SUCCESS (4.4 s)
[INFO] Building: staging-pom/pom.xml
[INFO] ..SUCCESS (2.7 s)
[INFO] -------------------------------------------------
[INFO] Build Summary:
[INFO]   Passed: 40, Failed: 0, Errors: 0, Skipped: 0
[INFO] -------------------------------------------------
[INFO] 
[INFO] --- maven-install-plugin:2.3.1:install (default-install) @ maven-invoker-plugin ---
[INFO] Installing <https://builds.apache.org/job/maven-plugins-ITs-m3/ws/maven-invoker-plugin/target/maven-invoker-plugin-1.6-SNAPSHOT.jar>
to /home/jenkins/.m2/repository/org/apache/maven/plugins/maven-invoker-plugin/1.6-SNAPSHOT/maven-invoker-plugin-1.6-SNAPSHOT.jar
[INFO] Installing <https://builds.apache.org/job/maven-plugins-ITs-m3/ws/maven-invoker-plugin/pom.xml>
to /home/jenkins/.m2/repository/org/apache/maven/plugins/maven-invoker-plugin/1.6-SNAPSHOT/maven-invoker-plugin-1.6-SNAPSHOT.pom
[INFO]                                                                         
[INFO] ------------------------------------------------------------------------
[INFO] Building Maven Plugins Aggregator 1-SNAPSHOT
[INFO] ------------------------------------------------------------------------
[WARNING] *****************************************************************
[WARNING] * Your build is requesting parallel execution, but project      *
[WARNING] * contains the following plugin(s) that are not marked as       *
[WARNING] * @threadSafe to support parallel building.                     *
[WARNING] * While this /may/ work fine, please look for plugin updates    *
[WARNING] * and/or request plugins be made thread-safe.                   *
[WARNING] * If reporting an issue, report it against the plugin in        *
[WARNING] * question, not against maven-core                              *
[WARNING] *****************************************************************
[WARNING] The following plugins are not marked @threadSafe in Maven Plugins Aggregator:
[WARNING] org.apache.maven.plugins:maven-remote-resources-plugin:1.1
[WARNING] *****************************************************************
[INFO] 
[INFO] --- maven-clean-plugin:2.4.1:clean (default-clean) @ maven-plugins-aggregator ---
[INFO] Deleting <https://builds.apache.org/job/maven-plugins-ITs-m3/ws/target>
[INFO] 
[INFO] --- maven-remote-resources-plugin:1.1:process (default) @ maven-plugins-aggregator
---
[INFO] 
[INFO] --- maven-install-plugin:2.3.1:install (default-install) @ maven-plugins-aggregator
---
[INFO] Installing <https://builds.apache.org/job/maven-plugins-ITs-m3/ws/pom.xml> to
/home/jenkins/.m2/repository/org/apache/maven/plugins/maven-plugins-aggregator/1-SNAPSHOT/maven-plugins-aggregator-1-SNAPSHOT.pom
[INFO] ..SUCCESS (36.0 s)
[INFO] Building: validate/pom.xml
[INFO] ..SUCCESS (4.7 s)
[INFO] Building: MSITE-322/pom.xml
[INFO] ..SUCCESS (7.1 s)
[INFO] Building: MSITE-550/pom.xml
[INFO] ..SUCCESS (3.0 s)
[INFO] Building: MSITE-458/pom.xml
[INFO] ..SUCCESS (10.3 s)
[INFO] Building: MSITE-312/pom.xml
[INFO] ..SUCCESS (4.8 s)
[INFO] Building: MSITE-507/pom.xml
Tests run: 1, Failures: 0, Errors: 0, Skipped: 0, Time elapsed: 115.599 sec
Running org.apache.maven.plugin.resources.remote.it.IT_CustomFilterDelimiter
Tests run: 1, Failures: 0, Errors: 0, Skipped: 0, Time elapsed: 2.573 sec
Running org.apache.maven.plugin.resources.remote.it.IT_BadDependencyPoms
Tests run: 1, Failures: 0, Errors: 0, Skipped: 0, Time elapsed: 2.937 sec
Running org.apache.maven.plugin.resources.remote.it.IT_GetDependencyProjects
Tests run: 1, Failures: 0, Errors: 0, Skipped: 0, Time elapsed: 6.139 sec
Running org.apache.maven.plugin.resources.remote.it.IT_GenerateFromBundle
Tests run: 1, Failures: 0, Errors: 0, Skipped: 0, Time elapsed: 2.336 sec
Running org.apache.maven.plugin.resources.remote.it.IT_GenerateFromOverride
Tests run: 1, Failures: 0, Errors: 0, Skipped: 0, Time elapsed: 2.442 sec
Running org.apache.maven.plugin.resources.remote.it.IT_SupplementalArtifact
Tests run: 1, Failures: 0, Errors: 0, Skipped: 0, Time elapsed: 6.556 sec
Running org.apache.maven.plugin.resources.remote.it.IT_FilterLocalOverride
Tests run: 1, Failures: 0, Errors: 0, Skipped: 0, Time elapsed: 2.488 sec

Results :

Tests run: 8, Failures: 0, Errors: 0, Skipped: 0

[WARNING] File encoding has not been set, using platform encoding ANSI_X3.4-1968, i.e. build
is platform dependent!
[INFO] 
[INFO] --- maven-failsafe-plugin:2.9:verify (integration-tests) @ maven-remote-resources-plugin
---
[INFO] Failsafe report directory: <https://builds.apache.org/job/maven-plugins-ITs-m3/ws/maven-remote-resources-plugin/target/failsafe-reports>
[WARNING] File encoding has not been set, using platform encoding ANSI_X3.4-1968, i.e. build
is platform dependent!
[INFO] 
[INFO] --- maven-install-plugin:2.3.1:install (default-install) @ maven-remote-resources-plugin
---
[INFO] Installing <https://builds.apache.org/job/maven-plugins-ITs-m3/ws/maven-remote-resources-plugin/target/maven-remote-resources-plugin-1.3-SNAPSHOT.jar>
to /home/jenkins/.m2/repository/org/apache/maven/plugins/maven-remote-resources-plugin/1.3-SNAPSHOT/maven-remote-resources-plugin-1.3-SNAPSHOT.jar
[INFO] Installing <https://builds.apache.org/job/maven-plugins-ITs-m3/ws/maven-remote-resources-plugin/pom.xml>
to /home/jenkins/.m2/repository/org/apache/maven/plugins/maven-remote-resources-plugin/1.3-SNAPSHOT/maven-remote-resources-plugin-1.3-SNAPSHOT.pom
[INFO] ..SUCCESS (49.0 s)
[INFO] Building: no-version/pom.xml
[INFO] ..SUCCESS (5.6 s)
[INFO] Building: MSITE-456/pom.xml
[INFO] ..SUCCESS (4.9 s)
[INFO] Building: surefire-report/pom.xml
[INFO] ..SUCCESS (6.0 s)
[INFO] 
[INFO] --- maven-invoker-plugin:1.5:verify (integration-test) @ maven-site-plugin ---
[INFO] -------------------------------------------------
[INFO] Build Summary:
[INFO]   Passed: 38, Failed: 0, Errors: 0, Skipped: 1
[INFO] -------------------------------------------------
[INFO] 
[INFO] --- maven-install-plugin:2.3.1:install (default-install) @ maven-site-plugin ---
[INFO] Installing <https://builds.apache.org/job/maven-plugins-ITs-m3/ws/maven-site-plugin/target/maven-site-plugin-3.1-SNAPSHOT.jar>
to /home/jenkins/.m2/repository/org/apache/maven/plugins/maven-site-plugin/3.1-SNAPSHOT/maven-site-plugin-3.1-SNAPSHOT.jar
[INFO] Installing <https://builds.apache.org/job/maven-plugins-ITs-m3/ws/maven-site-plugin/dependency-reduced-pom.xml>
to /home/jenkins/.m2/repository/org/apache/maven/plugins/maven-site-plugin/3.1-SNAPSHOT/maven-site-plugin-3.1-SNAPSHOT.pom
[INFO] ------------------------------------------------------------------------
[INFO] Reactor Summary:
[INFO] 
[INFO] Maven Plugins ..................................... SUCCESS [6.288s]
[INFO] Maven ACR Plugin .................................. SUCCESS [30.663s]
[INFO] Maven Ant Plugin .................................. SUCCESS [1:35.425s]
[INFO] Maven AntRun Plugin ............................... SUCCESS [1:08.513s]
[INFO] Maven Eclipse Plugin .............................. SUCCESS [12:06.183s]
[INFO] Maven Assembly Plugin ............................. FAILURE [0.594s]
[INFO] Maven Changelog Plugin ............................ SUCCESS [43.046s]
[INFO] Maven Changes Report Plugin ....................... SUCCESS [1:22.770s]
[INFO] Maven Checkstyle Plugin ........................... SUCCESS [1:36.927s]
[INFO] Maven Clean Plugin ................................ SUCCESS [23.545s]
[INFO] Maven Compiler Plugin ............................. SUCCESS [31.405s]
[INFO] Maven Dependency Plugin ........................... SUCCESS [2:29.273s]
[INFO] Maven Deploy Plugin ............................... SUCCESS [2:18.973s]
[INFO] Maven DOAP Plugin ................................. SUCCESS [22.451s]
[INFO] Maven Documentation Checker Plugin ................ SUCCESS [7.237s]
[INFO] Maven EAR Plugin .................................. SUCCESS [4:09.620s]
[INFO] Maven EJB Plugin .................................. SUCCESS [33.266s]
[INFO] Maven GPG Plugin .................................. SUCCESS [44.877s]
[INFO] Maven Help Plugin ................................. SUCCESS [43.008s]
[INFO] Maven IDEA Plugin ................................. SUCCESS [9.250s]
[INFO] Maven Install Plugin .............................. SUCCESS [42.807s]
[INFO] Maven JAR Plugin .................................. SUCCESS [1:19.519s]
[INFO] Maven Jarsigner Plugin ............................ SUCCESS [28.206s]
[INFO] Maven Javadoc Plugin .............................. FAILURE [5:20.445s]
[INFO] Maven Linkcheck Plugin ............................ SUCCESS [2.248s]
[INFO] Maven One Plugin .................................. SUCCESS [3.794s]
[INFO] Maven Patch Plugin ................................ SUCCESS [13.706s]
[INFO] Maven PDF Plugin .................................. SUCCESS [27.341s]
[INFO] Maven PMD Plugin .................................. SUCCESS [30.534s]
[INFO] Maven RAR Plugin .................................. SUCCESS [7.687s]
[INFO] Maven Reactor Plugin .............................. SUCCESS [2.811s]
[INFO] Maven Repository Plugin ........................... SUCCESS [2:43.927s]
[INFO] Maven Resources Plugin ............................ SUCCESS [55.907s]
[INFO] Maven Shade Plugin ................................ SUCCESS [2:06.915s]
[INFO] Maven Site Plugin 3 ............................... SUCCESS [7:25.837s]
[INFO] Maven Source Plugin ............................... SUCCESS [37.083s]
[INFO] Maven Stage Plugin ................................ SUCCESS [2.277s]
[INFO] Maven Toolchains Plugin ........................... SUCCESS [1.669s]
[INFO] Maven Verifier Plugin ............................. SUCCESS [11.253s]
[INFO] Maven WAR Plugin .................................. SUCCESS [1:16.649s]
[INFO] Maven Invoker Plugin .............................. SUCCESS [4:22.997s]
[INFO] Maven Project Info Reports Plugin ................. SUCCESS [2:04.500s]
[INFO] Maven Remote Resources Plugin ..................... SUCCESS [2:27.383s]
[INFO] Maven Plugins Aggregator .......................... SUCCESS [0.066s]
[INFO] ------------------------------------------------------------------------
[INFO] BUILD FAILURE
[INFO] ------------------------------------------------------------------------
[INFO] Total time: 22:36.990s (Wall Clock)
[INFO] Finished at: Fri Dec 02 13:29:53 UTC 2011
[INFO] Final Memory: 68M/683M
[INFO] ------------------------------------------------------------------------
[WARNING] The requested profile "apache.snapshots" could not be activated because it does
not exist.
[ERROR] Failed to execute goal on project maven-assembly-plugin: Could not resolve dependencies
for project org.apache.maven.plugins:maven-assembly-plugin:maven-plugin:2.2.3-SNAPSHOT: Could
not find artifact org.apache.maven.shared:maven-common-artifact-filters:jar:1.4 in central
(http://repo1.maven.org/maven2) -> [Help 1]
[ERROR] Failed to execute goal org.apache.maven.plugins:maven-surefire-plugin:2.9:test (default-test)
on project maven-javadoc-plugin: There are test failures.
[ERROR] 
[ERROR] Please refer to <https://builds.apache.org/job/maven-plugins-ITs-m3/ws/maven-javadoc-plugin/target/surefire-reports>
for the individual test results.
[ERROR] -> [Help 2]
[ERROR] 
[ERROR] To see the full stack trace of the errors, re-run Maven with the -e switch.
[ERROR] Re-run Maven using the -X switch to enable full debug logging.
[ERROR] 
[ERROR] For more information about the errors and possible solutions, please read the following
articles:
[ERROR] [Help 1] http://cwiki.apache.org/confluence/display/MAVEN/DependencyResolutionException
[ERROR] [Help 2] http://cwiki.apache.org/confluence/display/MAVEN/MojoFailureException
[ERROR] 
[ERROR] After correcting the problems, you can resume the build with the command
[ERROR]   mvn <goals> -rf :maven-assembly-plugin
Build step 'Invoke top-level Maven targets' marked build as failure


Mime
View raw message