maven-notifications mailing list archives

Site index · List index
Message view « Date » · « Thread »
Top « Date » · « Thread »
From Apache Jenkins Server <jenk...@builds.apache.org>
Subject Build failed in Jenkins: maven-plugins #547
Date Fri, 09 Dec 2011 10:32:22 GMT
See <https://builds.apache.org/job/maven-plugins/547/changes>

Changes:

[dennisl] [MEAR-60] Improve support for skinny war files

o Add documentation for this new feature.

------------------------------------------
[...truncated 754 lines...]
[INFO] --- maven-enforcer-plugin:1.0:enforce (ensure-no-container-api) @ maven-changes-plugin
---
[INFO] Using 'UTF-8' encoding to copy filtered resources.
[INFO] Copying 5 resources
[INFO] Copying 3 resources
[INFO] 
[INFO] --- maven-resources-plugin:2.4.3:resources (default-resources) @ maven-changelog-plugin
---
[INFO] Using 'UTF-8' encoding to read mojo metadata.
[INFO] Applying mojo extractor for language: java
[INFO] 
[INFO] --- maven-plugin-plugin:2.7:helpmojo (generated-helpmojo) @ maven-checkstyle-plugin
---
[INFO] Compiling 7 source files to <https://builds.apache.org/job/maven-plugins/ws/maven-changelog-plugin/target/classes>
[INFO] 
[INFO] --- maven-compiler-plugin:2.3.2:compile (default-compile) @ maven-changelog-plugin
---
[INFO] [INFO] Using 'UTF-8' encoding to copy filtered resources.
[INFO] skip non existing resourceDirectory <https://builds.apache.org/job/maven-plugins/ws/maven-changelog-plugin/src/test/resources>
[INFO] Copying 3 resources

[INFO] --- maven-resources-plugin:2.4.3:testResources (default-testResources) @ maven-changelog-plugin
---
[INFO] 
[INFO] --- maven-compiler-plugin:2.3.2:testCompile (default-testCompile) @ maven-changelog-plugin
---
[INFO] Mojo extractor for language: java found 3 mojo descriptors.
[INFO] Applying mojo extractor for language: bsh
[INFO] Mojo extractor for language: bsh found 0 mojo descriptors.
[INFO] [INFO] Using 'UTF-8' encoding to read mojo metadata.
[INFO] Applying mojo extractor for language: java

[INFO] --- maven-plugin-plugin:2.7:descriptor (default-descriptor) @ maven-checkstyle-plugin
---
[INFO] Compiling 16 source files to <https://builds.apache.org/job/maven-plugins/ws/maven-changelog-plugin/target/test-classes>
[INFO] Mojo extractor for language: java found 4 mojo descriptors.
[INFO] Applying mojo extractor for language: bsh
[INFO] Mojo extractor for language: bsh found 0 mojo descriptors.
[INFO] 
[INFO] --- maven-remote-resources-plugin:1.1:process (default) @ maven-checkstyle-plugin ---
[INFO] [INFO] Using 'UTF-8' encoding to read mojo metadata.
[INFO] Applying mojo extractor for language: java

[INFO] --- maven-plugin-plugin:2.7:helpmojo (generated-helpmojo) @ maven-changes-plugin ---
[INFO] [INFO] Using 'UTF-8' encoding to copy filtered resources.

[INFO] --- maven-resources-plugin:2.4.3:resources (default-resources) @ maven-checkstyle-plugin
---
[INFO] Copying 15 resources
[INFO] Copying 3 resources
[INFO] [INFO] Compiling 19 source files to <https://builds.apache.org/job/maven-plugins/ws/maven-checkstyle-plugin/target/classes>

[INFO] --- maven-compiler-plugin:2.3.2:compile (default-compile) @ maven-checkstyle-plugin
---
[INFO] [INFO] Surefire report directory: <https://builds.apache.org/job/maven-plugins/ws/maven-changelog-plugin/target/surefire-reports>
[INFO] Mojo extractor for language: java found 7 mojo descriptors.
[INFO] Applying mojo extractor for language: bsh
[INFO] Mojo extractor for language: bsh found 0 mojo descriptors.

[INFO] --- maven-surefire-plugin:2.7.2:test (default-test) @ maven-changelog-plugin ---
[INFO] 
[INFO] --- modello-maven-plugin:1.0.1:java (standard) @ maven-changes-plugin ---

-------------------------------------------------------
 T E S T S
-------------------------------------------------------
Running org.apache.maven.plugin.changelog.FileActivityReportTest
[INFO] outputDirectory: <https://builds.apache.org/job/maven-plugins/ws/maven-changes-plugin/target/generated-sources/modello>
[INFO] Working on model: src/main/mdo/changes.mdo
[INFO] Generating current version: 1.0.0
[INFO] [INFO] outputDirectory: <https://builds.apache.org/job/maven-plugins/ws/maven-changes-plugin/target/generated-sources/modello>
[INFO] Working on model: src/main/mdo/changes.mdo
[INFO] Generating current version: 1.0.0

[INFO] --- modello-maven-plugin:1.0.1:xpp3-reader (standard) @ maven-changes-plugin ---
[INFO] [INFO] outputDirectory: <https://builds.apache.org/job/maven-plugins/ws/maven-changes-plugin/target/generated-sources/modello>
[INFO] Working on model: src/main/mdo/changes.mdo
[INFO] Generating current version: 1.0.0

[INFO] --- modello-maven-plugin:1.0.1:xpp3-writer (standard) @ maven-changes-plugin ---
[INFO] Using 'UTF-8' encoding to read mojo metadata.
[INFO] [INFO] Applying mojo extractor for language: java

[INFO] --- maven-plugin-plugin:2.7:descriptor (default-descriptor) @ maven-changes-plugin
---
[INFO] 
[INFO] --- plexus-component-metadata:1.5.4:generate-metadata (default) @ maven-checkstyle-plugin
---
[INFO] Mojo extractor for language: java found 8 mojo descriptors.
[INFO] Applying mojo extractor for language: bsh
[INFO] Mojo extractor for language: bsh found 0 mojo descriptors.
[INFO] 
[INFO] --- maven-remote-resources-plugin:1.1:process (default) @ maven-changes-plugin ---
[INFO] Discovered 2 component descriptors(s)
[INFO] [INFO] Using 'UTF-8' encoding to copy filtered resources.
[INFO] skip non existing resourceDirectory <https://builds.apache.org/job/maven-plugins/ws/maven-checkstyle-plugin/src/test/resources>
[INFO] Copying 3 resources

[INFO] --- maven-resources-plugin:2.4.3:testResources (default-testResources) @ maven-checkstyle-plugin
---
[INFO] 
[INFO] --- maven-compiler-plugin:2.3.2:testCompile (default-testCompile) @ maven-checkstyle-plugin
---
[INFO] Compiling 12 source files to <https://builds.apache.org/job/maven-plugins/ws/maven-checkstyle-plugin/target/test-classes>
[INFO] [INFO] outputDirectory: <https://builds.apache.org/job/maven-plugins/ws/maven-changes-plugin/target/classes/META-INF/changes/xsd>
[INFO] Working on model: src/main/mdo/changes.mdo
[INFO] Generating current version: 1.0.0

[INFO] --- modello-maven-plugin:1.0.1:xsd (generate-xsd) @ maven-changes-plugin ---
[INFO] Using existing changelog.xml...
[INFO] 
[INFO] --- plexus-maven-plugin:1.3.8:descriptor (create-component-descriptor) @ maven-changes-plugin
---
Tests run: 2, Failures: 0, Errors: 0, Skipped: 0, Time elapsed: 2.133 sec
Running org.apache.maven.plugin.changelog.ChangeLogTest
Tests run: 1, Failures: 0, Errors: 0, Skipped: 0, Time elapsed: 0.008 sec
Running org.apache.maven.plugin.changelog.FileActivityComparatorTest
Tests run: 3, Failures: 0, Errors: 0, Skipped: 0, Time elapsed: 0.002 sec
Running org.apache.maven.plugin.changelog.DeveloperActivityReportTest
[INFO] Using existing changelog.xml...
[INFO] Discovered 1 component descriptors(s)
Tests run: 2, Failures: 0, Errors: 0, Skipped: 0, Time elapsed: 0.927 sec
Running org.apache.maven.plugin.changelog.ChangeLogReportTest
[INFO] Generating changed sets xml to: <https://builds.apache.org/job/maven-plugins/ws/maven-changelog-plugin/target/test-harness/6/changelog.xml>
[INFO] Generating changed sets xml to: <https://builds.apache.org/job/maven-plugins/ws/maven-changelog-plugin/target/test-harness/7/changelog.xml>
[ERROR] Provider message:
[ERROR] Provider Stub Error Message
[ERROR] Command output:
[ERROR] Provider Stub Commandline
[INFO] Using existing changelog.xml...
[INFO] Generating changed sets xml to: <https://builds.apache.org/job/maven-plugins/ws/maven-changelog-plugin/target/test-harness/10/changelog.xml>
[INFO] Generating changed sets xml to: <https://builds.apache.org/job/maven-plugins/ws/maven-changelog-plugin/target/test-harness/11/changelog.xml>
[INFO] Generating changed sets xml to: <https://builds.apache.org/job/maven-plugins/ws/maven-changelog-plugin/target/test-harness/12/changelog.xml>
[INFO] Generating changed sets xml to: <https://builds.apache.org/job/maven-plugins/ws/maven-changelog-plugin/target/test-harness/13/changelog.xml>
[INFO] Generating changed sets xml to: <https://builds.apache.org/job/maven-plugins/ws/maven-changelog-plugin/target/test-harness/14/changelog.xml>
[INFO] Generating changed sets xml to: <https://builds.apache.org/job/maven-plugins/ws/maven-changelog-plugin/target/test-harness/15/changelog.xml>
[INFO] Generating changed sets xml to: <https://builds.apache.org/job/maven-plugins/ws/maven-changelog-plugin/target/test-harness/16/changelog.xml>
[INFO] Generating changed sets xml to: <https://builds.apache.org/job/maven-plugins/ws/maven-changelog-plugin/target/test-harness/17/changelog.xml>
Tests run: 13, Failures: 0, Errors: 0, Skipped: 0, Time elapsed: 1.501 sec

Results :

Tests run: 21, Failures: 0, Errors: 0, Skipped: 0

[INFO] Surefire report directory: <https://builds.apache.org/job/maven-plugins/ws/maven-checkstyle-plugin/target/surefire-reports>
[INFO] 
[INFO] --- maven-surefire-plugin:2.7.2:test (default-test) @ maven-checkstyle-plugin ---
[INFO] 
[INFO] --- plexus-maven-plugin:1.3.8:merge-descriptors (merge) @ maven-changes-plugin ---
[JENKINS] Recording test results

-------------------------------------------------------
 T E S T S
-------------------------------------------------------
Running org.apache.maven.plugin.checkstyle.CheckstyleReportTest
[INFO] Using 'UTF-8' encoding to copy filtered resources.
[INFO] 
[INFO] --- maven-resources-plugin:2.4.3:resources (default-resources) @ maven-changes-plugin
---
[INFO] Copying 27 resources
[INFO] Copying 3 resources
[INFO] 
[INFO] --- maven-jar-plugin:2.3.1:jar (default-jar) @ maven-changelog-plugin ---
[INFO] 
[INFO] --- maven-compiler-plugin:2.3.2:compile (default-compile) @ maven-changes-plugin ---
[INFO] Compiling 47 source files to <https://builds.apache.org/job/maven-plugins/ws/maven-changes-plugin/target/classes>
[INFO] Building jar: <https://builds.apache.org/job/maven-plugins/ws/maven-changelog-plugin/target/maven-changelog-plugin-2.3-SNAPSHOT.jar>
[INFO] 
[INFO] --- maven-plugin-plugin:2.7:addPluginArtifactMetadata (default-addPluginArtifactMetadata)
@ maven-changelog-plugin ---
[INFO] Installing <https://builds.apache.org/job/maven-plugins/ws/maven-changelog-plugin/target/maven-changelog-plugin-2.3-SNAPSHOT.jar>
to /home/jenkins/.m2/repository/org/apache/maven/plugins/maven-changelog-plugin/2.3-SNAPSHOT/maven-changelog-plugin-2.3-SNAPSHOT.jar
[INFO] 
[INFO] --- maven-install-plugin:2.3.1:install (default-install) @ maven-changelog-plugin ---
[INFO] Installing <https://builds.apache.org/job/maven-plugins/ws/maven-changelog-plugin/pom.xml>
to /home/jenkins/.m2/repository/org/apache/maven/plugins/maven-changelog-plugin/2.3-SNAPSHOT/maven-changelog-plugin-2.3-SNAPSHOT.pom
[JENKINS] Archiving <https://builds.apache.org/job/maven-plugins/ws/maven-changelog-plugin/pom.xml>
to /home/hudson/hudson/jobs/maven-plugins/modules/org.apache.maven.plugins$maven-changelog-plugin/builds/2011-12-09_10-00-21/archive/org.apache.maven.plugins/maven-changelog-plugin/2.3-SNAPSHOT/maven-changelog-plugin-2.3-SNAPSHOT.pom
[JENKINS] Archiving <https://builds.apache.org/job/maven-plugins/ws/maven-changelog-plugin/target/maven-changelog-plugin-2.3-SNAPSHOT.jar>
to /home/hudson/hudson/jobs/maven-plugins/modules/org.apache.maven.plugins$maven-changelog-plugin/builds/2011-12-09_10-00-21/archive/org.apache.maven.plugins/maven-changelog-plugin/2.3-SNAPSHOT/maven-changelog-plugin-2.3-SNAPSHOT.jar
[INFO] 
[INFO] There are 5 checkstyle errors.
[WARNING] <https://builds.apache.org/job/maven-plugins/ws/maven-changes-plugin/src/main/java/org/apache/maven/plugin/changes/ReleaseUtils.java>:[164,52]
[unchecked] unchecked call to addAll(java.util.Collection<? extends E>) as a member
of the raw type java.util.List
[WARNING] <https://builds.apache.org/job/maven-plugins/ws/maven-changes-plugin/target/generated-sources/modello/org/apache/maven/plugins/changes/model/Release.java>:[69,24]
[unchecked] unchecked call to add(E) as a member of the raw type java.util.List
[WARNING] <https://builds.apache.org/job/maven-plugins/ws/maven-changes-plugin/target/generated-sources/modello/org/apache/maven/plugins/changes/model/Release.java>:[184,33]
[unchecked] unchecked call to add(E) as a member of the raw type java.util.List
[WARNING] <https://builds.apache.org/job/maven-plugins/ws/maven-changes-plugin/target/generated-sources/modello/org/apache/maven/plugins/changes/model/Action.java>:[146,23]
[unchecked] unchecked call to add(E) as a member of the raw type java.util.List
[WARNING] <https://builds.apache.org/job/maven-plugins/ws/maven-changes-plugin/target/generated-sources/modello/org/apache/maven/plugins/changes/model/Action.java>:[160,28]
[unchecked] unchecked call to add(E) as a member of the raw type java.util.List
[WARNING] <https://builds.apache.org/job/maven-plugins/ws/maven-changes-plugin/target/generated-sources/modello/org/apache/maven/plugins/changes/model/Body.java>:[44,25]
[unchecked] unchecked call to add(E) as a member of the raw type java.util.List
[WARNING] <https://builds.apache.org/job/maven-plugins/ws/maven-changes-plugin/src/main/java/org/apache/maven/plugin/changes/AbstractChangesReport.java>:[187,12]
[deprecation] generate(org.codehaus.doxia.sink.Sink,java.util.Locale) in org.apache.maven.reporting.AbstractMavenReport
has been deprecated
[WARNING] <https://builds.apache.org/job/maven-plugins/ws/maven-changes-plugin/target/generated-sources/plugin/org/apache/maven/plugin/changes/HelpMojo.java>:[717,29]
[unchecked] unchecked call to add(E) as a member of the raw type java.util.List
[WARNING] <https://builds.apache.org/job/maven-plugins/ws/maven-changes-plugin/target/generated-sources/plugin/org/apache/maven/plugin/changes/HelpMojo.java>:[743,17]
[unchecked] unchecked call to add(E) as a member of the raw type java.util.List
[WARNING] <https://builds.apache.org/job/maven-plugins/ws/maven-changes-plugin/target/generated-sources/modello/org/apache/maven/plugins/changes/model/io/xpp3/ChangesXpp3Reader.java>:[82,18]
[unchecked] unchecked call to add(E) as a member of the raw type java.util.Set
[WARNING] <https://builds.apache.org/job/maven-plugins/ws/maven-changes-plugin/target/generated-sources/modello/org/apache/maven/plugins/changes/model/io/xpp3/ChangesXpp3Reader.java>:[492,31]
[unchecked] unchecked call to add(E) as a member of the raw type java.util.List
[WARNING] <https://builds.apache.org/job/maven-plugins/ws/maven-changes-plugin/target/generated-sources/modello/org/apache/maven/plugins/changes/model/io/xpp3/ChangesXpp3Reader.java>:[502,26]
[unchecked] unchecked call to add(E) as a member of the raw type java.util.List
[WARNING] <https://builds.apache.org/job/maven-plugins/ws/maven-changes-plugin/target/generated-sources/modello/org/apache/maven/plugins/changes/model/io/xpp3/ChangesXpp3Reader.java>:[587,28]
[unchecked] unchecked call to add(E) as a member of the raw type java.util.List
[WARNING] <https://builds.apache.org/job/maven-plugins/ws/maven-changes-plugin/target/generated-sources/modello/org/apache/maven/plugins/changes/model/io/xpp3/ChangesXpp3Reader.java>:[802,27]
[unchecked] unchecked call to add(E) as a member of the raw type java.util.List
[WARNING] <https://builds.apache.org/job/maven-plugins/ws/maven-changes-plugin/src/main/java/org/apache/maven/plugin/changes/schema/DefaultChangesSchemaValidator.java>:[106,32]
[unchecked] unchecked call to put(K,V) as a member of the raw type java.util.Map
[INFO] Using 'UTF-8' encoding to copy filtered resources.
[INFO] [WARNING] *****************************************************************
[WARNING] * Your build is requesting parallel execution, but project      *
[WARNING] * contains the following plugin(s) that are not marked as       *
[WARNING] * @threadSafe to support parallel building.                     *
[WARNING] * While this /may/ work fine, please look for plugin updates    *
[WARNING] * and/or request plugins be made thread-safe.                   *
[WARNING] * If reporting an issue, report it against the plugin in        *
[WARNING] * question, not against maven-core                              *
[WARNING] *****************************************************************
[WARNING] The following plugins are not marked @threadSafe in Maven Clean Plugin:
[WARNING] org.apache.maven.plugins:maven-remote-resources-plugin:1.1
[WARNING] org.apache.maven.plugins:maven-enforcer-plugin:1.0
[WARNING] *****************************************************************

[INFO] --- maven-resources-plugin:2.4.3:testResources (default-testResources) @ maven-changes-plugin
---
[INFO] Deleting <https://builds.apache.org/job/maven-plugins/ws/maven-clean-plugin/target>
[INFO]                                                                         
[INFO] ------------------------------------------------------------------------
[INFO] Building Maven Clean Plugin 2.5-SNAPSHOT
[INFO] ------------------------------------------------------------------------
[INFO] 
[INFO] --- maven-clean-plugin:2.4.1:clean (default-clean) @ maven-clean-plugin ---
[INFO] Copying 4 resources
[INFO] Copying 3 resources
[INFO] 
[INFO] --- maven-enforcer-plugin:1.0:enforce (ensure-no-container-api) @ maven-clean-plugin
---
[INFO] 
[INFO] --- maven-compiler-plugin:2.3.2:testCompile (default-testCompile) @ maven-changes-plugin
---
[INFO] Compiling 14 source files to <https://builds.apache.org/job/maven-plugins/ws/maven-changes-plugin/target/test-classes>
[INFO] [INFO] Using 'UTF-8' encoding to read mojo metadata.
[INFO] Applying mojo extractor for language: java

[INFO] --- maven-plugin-plugin:2.7:helpmojo (generated-helpmojo) @ maven-clean-plugin ---
[INFO] 
[INFO] There are 5 checkstyle errors.
[INFO] Mojo extractor for language: java found 1 mojo descriptors.
[INFO] Applying mojo extractor for language: bsh
[INFO] Mojo extractor for language: bsh found 0 mojo descriptors.
[INFO] [INFO] Using 'UTF-8' encoding to read mojo metadata.

[INFO] Applying mojo extractor for language: java
[INFO] --- maven-plugin-plugin:2.7:descriptor (default-descriptor) @ maven-clean-plugin ---
[INFO] Mojo extractor for language: java found 2 mojo descriptors.
[INFO] Applying mojo extractor for language: bsh
[INFO] Mojo extractor for language: bsh found 0 mojo descriptors.
[INFO] 
[INFO] --- maven-remote-resources-plugin:1.1:process (default) @ maven-clean-plugin ---
[INFO] Using 'UTF-8' encoding to copy filtered resources.
[INFO] skip non existing resourceDirectory <https://builds.apache.org/job/maven-plugins/ws/maven-clean-plugin/src/main/resources>
[INFO] Copying 3 resources
[INFO] 
[INFO] --- maven-resources-plugin:2.4.3:resources (default-resources) @ maven-clean-plugin
---
[INFO] [INFO] Compiling 6 source files to <https://builds.apache.org/job/maven-plugins/ws/maven-clean-plugin/target/classes>

[INFO] --- maven-compiler-plugin:2.3.2:compile (default-compile) @ maven-clean-plugin ---
[INFO] Surefire report directory: <https://builds.apache.org/job/maven-plugins/ws/maven-changes-plugin/target/surefire-reports>
[INFO] 
[INFO] --- maven-surefire-plugin:2.7.2:test (default-test) @ maven-changes-plugin ---
Dec 9, 2011 10:32:08 AM hudson.remoting.Channel$ReaderThread run
SEVERE: I/O error in channel channel
java.io.StreamCorruptedException
	at java.io.ObjectInputStream.readObject0(ObjectInputStream.java:1332)
	at java.io.ObjectInputStream.readObject(ObjectInputStream.java:348)
	at hudson.remoting.Channel$ReaderThread.run(Channel.java:1087)
channel stopped
Destroying 2 processes
Destroying process..
Destroying process..
Destroyed 2 processes
ERROR: Maven JVM terminated unexpectedly with exit code 0



Mime
View raw message