maven-notifications mailing list archives

Site index · List index
Message view « Date » · « Thread »
Top « Date » · « Thread »
From Apache Jenkins Server <jenk...@builds.apache.org>
Subject Build failed in Jenkins: core-integration-testing-maven-3-windows #79
Date Sun, 04 Dec 2011 22:42:07 GMT
See <https://builds.apache.org/job/core-integration-testing-maven-3-windows/79/changes>

Changes:

[bentmann] o Revised fix from r1151426 which broke the appassembler-maven-plugin

------------------------------------------
[...truncated 4720 lines...]
mng0781PluginConfigVsExecConfig(itMNG0781)..................OK (1.9 s)
mng0773SettingsProfileReactorPollution(itMNG773)............OK (1.8 s)
mng0768OfflineMode(itMNG768)................................OK (5.9 s)
mng0761MissingSnapshotDistRepo(itMNG761)....................OK (2.1 s)
mng0731LegacyRepoLayout(itMNG731)...........................SKIPPED - version 3.0.4-SNAPSHOT
not in range [2.0,3.0-alpha-3)
mng0680ParentBasedir(itMNG680)..............................OK (1.7 s)
mng0674PluginParameterAlias(itLifecycle)....................OK (1.9 s)
mng0674PluginParameterAlias(itCli)..........................OK (1.7 s)
mng0666IgnoreLegacyPom(itMNG666)............................OK (2.3 s)
mng0557UserSettingsCliOption(itMNG557)......................OK (1.9 s)
mng0553SettingsAuthzEncryption(itBasic).....................OK (2.8 s)
mng0553SettingsAuthzEncryption(itRelocation)................OK (2.7 s)
mng0553SettingsAuthzEncryption(itEncryption)................OK (3.4 s)
mng0522InheritedPluginMgmtConfig(itMNG522)..................OK (2.0 s)
mng0507ArtifactRelocation(itMNG507).........................OK (3.2 s)
mng0505VersionRange(itMNG505)...............................OK (2.5 s)
mng0496IgnoreUnknownPluginParameters(itMNG496)..............OK (1.7 s)
mng0479OverrideCentralRepo(itModel).........................OK (3.4 s)
mng0479OverrideCentralRepo(itResolution)....................OK (7.5 s)
mng0471CustomLifecycle(itMNG471)............................OK (1.7 s)
mng0469ReportConfig(itReportConfigOverridesBuildDefaults)...SKIPPED - version 3.0.4-SNAPSHOT
not in range [2.0.0,3.0-alpha-1)
mng0469ReportConfig(itBuildConfigDominantDuringBuild).......OK (1.8 s)
mng0469ReportConfig(itBuildConfigIrrelevantForReports)......OK (1.7 s)
mng0461TolerateMissingDependencyPom(it).....................OK (2.0 s)
mng0449PluginVersionResolution(itLifecycleInvocation).......OK (2.1 s)
mng0449PluginVersionResolution(itCliInvocation).............OK (1.8 s)
mng0377PluginLookupFromPrefix(itMNG377).....................OK (3.4 s)
mng0294MergeGlobalAndUserSettings(itMNG294).................OK (2.1 s)
mng0282NonReactorExecWhenProjectIndependent(itMNG282).......OK (1.7 s)
mng0249ResolveDepsFromReactor(itMNG0249)....................OK (2.1 s)
mng0187CollectedProjects(it)................................OK (1.7 s)
mng0095ReactorFailureBehavior(itFailFast)...................OK (1.9 s)
mng0095ReactorFailureBehavior(itFailNever)..................OK (2.4 s)
mng0095ReactorFailureBehavior(itFailAtEnd)..................OK (2.0 s)
0145ReactorWithIncludesExcludes(itDefaultIncludesExcludes)..SKIPPED - version 3.0.4-SNAPSHOT
not in range [2.0,3.0-alpha-1)
0145ReactorWithIncludesExcludes(itCustomIncludes)...........SKIPPED - version 3.0.4-SNAPSHOT
not in range [2.0,3.0-alpha-1)
0145ReactorWithIncludesExcludes(itCustomExcludes)...........SKIPPED - version 3.0.4-SNAPSHOT
not in range [2.0,3.0-alpha-1)
0144LifecycleExecutionOrder(it0144).........................OK (2.6 s)
0143TransitiveDependencyScopes(itCompileScope)..............OK (2.2 s)
0143TransitiveDependencyScopes(itProvidedScope).............OK (2.8 s)
0143TransitiveDependencyScopes(itRuntimeScope)..............OK (2.2 s)
0143TransitiveDependencyScopes(itTestScope).................OK (2.8 s)
0142DirectDependencyScopes(it0142)..........................OK (2.8 s)
0140InterpolationWithPomPrefix(it0140)......................OK (1.7 s)
0139InterpolationWithProjectPrefix(it0139)..................OK (1.7 s)
0138PluginLifecycle(it0138).................................OK (2.3 s)
0137EarLifecycle(it0137)....................................OK (2.4 s)
0136RarLifecycle(it0136)....................................OK (2.6 s)
0135EjbLifecycle(it0135)....................................OK (2.2 s)
0134WarLifecycle(it0134)....................................OK (2.1 s)
0133JarLifecycle(it0133)....................................OK (2.2 s)
0132PomLifecycle(it0132)....................................OK (2.1 s)
0131SiteLifecycle(it0131)...................................OK (1.8 s)
0130CleanLifecycle(it0130)..................................OK (1.9 s)
0113ServerAuthzAvailableToWagonMgrInPlugin(it0113)..........OK (2.4 s)
0090EnvVarInterpolation(it0090).............................OK (1.8 s)
0087PluginRealmWithProjectLevelDeps(it0087).................OK (2.1 s)
0086PluginRealm(it0086).....................................OK (2.5 s)
0085TransitiveSystemScope(it0085)...........................OK (2.0 s)
0072InterpolationWithDottedProperty(it0072).................OK (1.7 s)
0071PluginConfigWithDottedProperty(it0071)..................OK (2.1 s)
0064MojoConfigViaSetters(it0064)............................OK (1.8 s)
0063SystemScopeDependency(it0063)...........................OK (1.9 s)
0056MultipleGoalExecutions(it0056)..........................OK (1.7 s)
0052ReleaseProfile(it0052)..................................OK (2.1 s)
0051ReleaseProfile(it0051)..................................OK (2.5 s)
0041ArtifactTypeFromPluginExtension(it0041).................OK (2.7 s)
0040PackagingFromPluginExtension(it0040)....................OK (2.1 s)
0039ReleasePomInReactor(it0039).............................SKIPPED - version 3.0.4-SNAPSHOT
not in range [2.0,3.0-alpha-1)
0038AlternatePomFileDifferentDir(it0038)....................OK (1.7 s)
0037AlternatePomFileSameDir(it0037).........................OK (1.7 s)
0036ReleasePom(it0036)......................................SKIPPED - version 3.0.4-SNAPSHOT
not in range (2.0,3.0-alpha-1)
0032MavenPrerequisite(it0032)...............................OK (1.9 s)
0030DepPomDepMngtInheritance(it0030)........................OK (5.0 s)
0025MultipleExecutionLevelConfigs(it0025)...................OK (2.0 s)
0024MultipleGoalExecutions(it0024)..........................OK (1.7 s)
0023SettingsProfile(it0023).................................OK (2.0 s)
0021PomProfile(it0021)......................................OK (2.3 s)
0019PluginVersionMngtBySuperPom(it0019).....................OK (2.8 s)
0018DependencyManagement(it0018)............................OK (2.3 s)
0012PomInterpolation(it0012)................................OK (2.2 s)
0011DefaultVersionByDependencyManagement(it0011)............OK (2.3 s)
0010DependencyClosureResolution(it0010).....................OK (2.2 s)
0009GoalConfiguration(it0009)...............................OK (1.8 s)
0008SimplePlugin(it0008)....................................OK (2.2 s)
Tests run: 707, Failures: 0, Errors: 1, Skipped: 0, Time elapsed: 1,649.859 sec <<<
FAILURE!
testBootstrap(org.apache.maven.it.MavenITBootstrapTest)  Time elapsed: 0.113 sec  <<<
ERROR!
org.apache.maven.it.VerificationException: Exit code was non-zero: 1; command line and log
= 
<https://builds.apache.org/job/core-integration-testing-maven-3-windows/ws/apache-maven-3.0-SNAPSHOT\bin\mvn>
--global-settings F:\hudson\hudson-slave\workspace\core-integration-testing-maven-3-windows\core-it\core-it-suite\target\test-classes\settings-remote.xml
--settings settings.xml -e --batch-mode -Dmaven.repo.local=<https://builds.apache.org/job/core-integration-testing-maven-3-windows/ws/.repository>
test-compile
Error occurred during initialization of VM
Could not reserve enough space for object heap

	at org.apache.maven.it.Verifier.executeGoals(Verifier.java:1397)
	at org.apache.maven.it.Verifier.executeGoal(Verifier.java:1240)
	at org.apache.maven.it.Verifier.executeGoal(Verifier.java:1234)
	at org.apache.maven.it.MavenITBootstrapTest.testBootstrap(MavenITBootstrapTest.java:52)
	at sun.reflect.NativeMethodAccessorImpl.invoke0(Native Method)
	at sun.reflect.NativeMethodAccessorImpl.invoke(NativeMethodAccessorImpl.java:39)
	at sun.reflect.DelegatingMethodAccessorImpl.invoke(DelegatingMethodAccessorImpl.java:25)
	at java.lang.reflect.Method.invoke(Method.java:592)
	at junit.framework.TestCase.runTest(TestCase.java:168)
	at org.apache.maven.it.AbstractMavenIntegrationTestCase.runTest(AbstractMavenIntegrationTestCase.java:220)
	at junit.framework.TestCase.runBare(TestCase.java:134)
	at junit.framework.TestResult$1.protect(TestResult.java:110)
	at junit.framework.TestResult.runProtected(TestResult.java:128)
	at junit.framework.TestResult.run(TestResult.java:113)
	at junit.framework.TestCase.run(TestCase.java:124)
	at junit.framework.TestSuite.runTest(TestSuite.java:243)
	at junit.framework.TestSuite.run(TestSuite.java:238)
	at junit.framework.TestSuite.runTest(TestSuite.java:243)
	at junit.framework.TestSuite.run(TestSuite.java:238)
	at org.junit.internal.runners.JUnit38ClassRunner.run(JUnit38ClassRunner.java:83)
	at org.apache.maven.surefire.junit4.JUnit4TestSet.execute(JUnit4TestSet.java:53)
	at org.apache.maven.surefire.junit4.JUnit4Provider.executeTestSet(JUnit4Provider.java:123)
	at org.apache.maven.surefire.junit4.JUnit4Provider.invoke(JUnit4Provider.java:104)
	at sun.reflect.NativeMethodAccessorImpl.invoke0(Native Method)
	at sun.reflect.NativeMethodAccessorImpl.invoke(NativeMethodAccessorImpl.java:39)
	at sun.reflect.DelegatingMethodAccessorImpl.invoke(DelegatingMethodAccessorImpl.java:25)
	at java.lang.reflect.Method.invoke(Method.java:592)
	at org.apache.maven.surefire.util.ReflectionUtils.invokeMethodWithArray(ReflectionUtils.java:164)
	at org.apache.maven.surefire.booter.ProviderFactory$ProviderProxy.invoke(ProviderFactory.java:110)
	at org.apache.maven.surefire.booter.SurefireStarter.invokeProvider(SurefireStarter.java:172)
	at org.apache.maven.surefire.booter.SurefireStarter.runSuitesInProcess(SurefireStarter.java:120)
	at org.apache.maven.plugin.surefire.AbstractSurefireMojo.executeProvider(AbstractSurefireMojo.java:194)
	at org.apache.maven.plugin.surefire.AbstractSurefireMojo.executeAllProviders(AbstractSurefireMojo.java:176)
	at org.apache.maven.plugin.surefire.AbstractSurefireMojo.executeAfterPreconditionsChecked(AbstractSurefireMojo.java:134)
	at org.apache.maven.plugin.surefire.AbstractSurefireMojo.execute(AbstractSurefireMojo.java:97)
	at org.apache.maven.plugin.DefaultBuildPluginManager.executeMojo(DefaultBuildPluginManager.java:101)
	at org.apache.maven.lifecycle.internal.MojoExecutor.execute(MojoExecutor.java:209)
	at org.apache.maven.lifecycle.internal.MojoExecutor.execute(MojoExecutor.java:153)
	at org.apache.maven.lifecycle.internal.MojoExecutor.execute(MojoExecutor.java:145)
	at org.apache.maven.lifecycle.internal.LifecycleModuleBuilder.buildProject(LifecycleModuleBuilder.java:84)
	at org.apache.maven.lifecycle.internal.LifecycleModuleBuilder.buildProject(LifecycleModuleBuilder.java:59)
	at org.apache.maven.lifecycle.internal.LifecycleStarter.singleThreadedBuild(LifecycleStarter.java:183)
	at org.apache.maven.lifecycle.internal.LifecycleStarter.execute(LifecycleStarter.java:161)
	at org.apache.maven.DefaultMaven.doExecute(DefaultMaven.java:319)
	at org.apache.maven.DefaultMaven.execute(DefaultMaven.java:156)
	at org.apache.maven.cli.MavenCli.execute(MavenCli.java:537)
	at org.apache.maven.cli.MavenCli.doMain(MavenCli.java:196)
	at org.apache.maven.cli.MavenCli.main(MavenCli.java:141)
	at sun.reflect.NativeMethodAccessorImpl.invoke0(Native Method)
	at sun.reflect.NativeMethodAccessorImpl.invoke(NativeMethodAccessorImpl.java:39)
	at sun.reflect.DelegatingMethodAccessorImpl.invoke(DelegatingMethodAccessorImpl.java:25)
	at java.lang.reflect.Method.invoke(Method.java:592)
	at org.codehaus.plexus.classworlds.launcher.Launcher.launchEnhanced(Launcher.java:290)
	at org.codehaus.plexus.classworlds.launcher.Launcher.launch(Launcher.java:230)
	at org.codehaus.plexus.classworlds.launcher.Launcher.mainWithExitCode(Launcher.java:409)
	at org.codehaus.plexus.classworlds.launcher.Launcher.main(Launcher.java:352)

Results :

Tests in error: 
  testBootstrap(org.apache.maven.it.MavenITBootstrapTest): Exit code was non-zero: 1; command
line and log = 

Tests run: 707, Failures: 0, Errors: 1, Skipped: 0

[INFO] ------------------------------------------------------------------------
[INFO] Reactor Summary:
[INFO] 
[INFO] Maven Core ITs .................................... SUCCESS [3.163s]
[INFO] Maven IT Support .................................. SUCCESS [0.084s]
[INFO] Maven IT :: Plugins ............................... SUCCESS [0.044s]
[INFO] Maven IT Plugin :: Active Collection .............. SUCCESS [2.142s]
[INFO] Maven IT Plugin :: Ant-Based ...................... SUCCESS [1.059s]
[INFO] Maven IT Plugin :: Artifact ....................... SUCCESS [1.167s]
[INFO] Maven IT Plugin :: Class Loader :: Dependency A ... SUCCESS [0.426s]
[INFO] Maven IT Plugin :: Class Loader :: Dependency B ... SUCCESS [0.505s]
[INFO] Maven IT Plugin :: Class Loader :: Dependency C ... SUCCESS [0.162s]
[INFO] Maven IT Plugin :: Class Loader ................... SUCCESS [2.128s]
[INFO] Maven IT Plugin :: Class Loader :: Aggregator ..... SUCCESS [0.039s]
[INFO] Maven IT Plugin :: Configuration .................. SUCCESS [1.113s]
[INFO] Maven IT Plugin :: Context Passing ................ SUCCESS [0.497s]
[INFO] Maven ITs :: Core Plugin Stubs .................... SUCCESS [0.026s]
[INFO] Maven IT Clean Plugin Stub ........................ SUCCESS [0.547s]
[INFO] Maven IT Compiler Plugin Stub ..................... SUCCESS [0.734s]
[INFO] Maven IT Deploy Plugin Stub ....................... SUCCESS [0.490s]
[INFO] Maven IT EAR Plugin Stub .......................... SUCCESS [0.530s]
[INFO] Maven IT EJB Plugin Stub .......................... SUCCESS [0.491s]
[INFO] Maven IT Install Plugin Stub ...................... SUCCESS [0.609s]
[INFO] Maven IT JAR Plugin Stub .......................... SUCCESS [0.611s]
[INFO] Maven IT Javadoc Plugin Stub ...................... SUCCESS [0.490s]
[INFO] Maven IT Plugin Plugin Stub ....................... SUCCESS [0.537s]
[INFO] Maven IT RAR Plugin Stub .......................... SUCCESS [0.458s]
[INFO] Maven IT Resources Plugin Stub .................... SUCCESS [0.466s]
[INFO] Maven IT Site Plugin Stub ......................... SUCCESS [0.589s]
[INFO] Maven IT Source Plugin Stub ....................... SUCCESS [0.454s]
[INFO] Maven IT Surefire Plugin Stub ..................... SUCCESS [0.526s]
[INFO] Maven IT WAR Plugin Stub .......................... SUCCESS [0.429s]
[INFO] Maven IT Plugin :: Dependency Collection .......... SUCCESS [0.925s]
[INFO] Maven IT Plugin :: Dependency Resolution .......... SUCCESS [0.741s]
[INFO] Maven IT Plugin :: Expression ..................... SUCCESS [1.251s]
[INFO] Maven IT Plugin :: Error Mojos .................... SUCCESS [0.845s]
[INFO] Maven IT Component ................................ SUCCESS [0.667s]
[INFO] Maven IT Plugin :: Extension Consumer ............. SUCCESS [0.438s]
[INFO] Maven IT Plugin :: Extension Provider ............. SUCCESS [0.479s]
[INFO] Maven IT Plugin :: Fork ........................... SUCCESS [0.666s]
[INFO] Maven IT Plugin :: Invalid Descriptor ............. SUCCESS [0.583s]
[INFO] Maven IT Plugin :: Log File ....................... SUCCESS [0.494s]
[INFO] Maven IT Plugin :: No Default Component ........... SUCCESS [0.501s]
[INFO] Maven IT Plugin :: No Project ..................... SUCCESS [0.946s]
[INFO] Maven IT Plugin :: Online ......................... SUCCESS [0.391s]
[INFO] Maven IT Plugin :: Optional Mojos ................. SUCCESS [0.459s]
[INFO] Maven IT Plugin :: Packaging ...................... SUCCESS [0.406s]
[INFO] Maven IT Plugin :: Parameter Implementation ....... SUCCESS [0.450s]
[INFO] Maven IT Plugin :: Plugin Dependency .............. SUCCESS [0.631s]
[INFO] Maven IT Plugin :: Project ........................ SUCCESS [0.512s]
[INFO] Maven IT Helper Library ........................... SUCCESS [1.499s]
[INFO] Maven IT Plugin :: Project Interpolation .......... SUCCESS [0.989s]
[INFO] Maven IT Plugin :: Setter ......................... SUCCESS [0.432s]
[INFO] Maven IT Plugin :: Singleton Component ............ SUCCESS [0.498s]
[INFO] Maven IT Plugin :: Site ........................... SUCCESS [0.609s]
[INFO] Maven IT Plugin :: Toolchain ...................... SUCCESS [1.945s]
[INFO] Maven IT Plugin :: Touch .......................... SUCCESS [0.854s]
[INFO] Maven IT Plugin :: Uses Properties Plugin ......... SUCCESS [0.453s]
[INFO] Maven IT Plugin :: Uses Wagon Plugin .............. SUCCESS [1.231s]
[INFO] Maven IT Plugin :: This plugin should contain the mojos needed by all tests.  SUCCESS
[0.441s]
[INFO] Maven IT Plugin :: Plexus Utils 1.1 ............... SUCCESS [0.566s]
[INFO] Maven IT Plugin :: Plexus Utils New ............... SUCCESS [0.662s]
[INFO] Maven IT Plugin :: Plexus Component API ........... SUCCESS [0.846s]
[INFO] Maven IT Plugin :: Log4J Client ................... SUCCESS [0.539s]
[INFO] maven-it-plugin-extension1 ........................ SUCCESS [0.392s]
[INFO] maven-it-plugin-extension2 ........................ SUCCESS [0.394s]
[INFO] Maven IT Toolchain ................................ SUCCESS [0.862s]
[INFO] Maven IT Wagon .................................... SUCCESS [1.203s]
[INFO] Maven IT Support Artifacts ........................ SUCCESS [0.405s]
[INFO] Maven IT Extension ................................ SUCCESS [0.347s]
[INFO] Maven ITs ......................................... FAILURE [29:13.800s]
[INFO] ------------------------------------------------------------------------
[INFO] BUILD FAILURE
[INFO] ------------------------------------------------------------------------
[INFO] Total time: 30:02.903s
[INFO] Finished at: Sun Dec 04 22:42:04 GMT 2011
[INFO] Final Memory: 35M/674M
[INFO] ------------------------------------------------------------------------
[ERROR] Failed to execute goal org.apache.maven.plugins:maven-surefire-plugin:2.9:test (default-test)
on project core-it-suite: There are test failures.
[ERROR] 
[ERROR] Please refer to F:\hudson\hudson-slave\workspace\core-integration-testing-maven-3-windows\core-it\core-it-suite\target\surefire-reports
for the individual test results.
[ERROR] -> [Help 1]
[ERROR] 
[ERROR] To see the full stack trace of the errors, re-run Maven with the -e switch.
[ERROR] Re-run Maven using the -X switch to enable full debug logging.
[ERROR] 
[ERROR] For more information about the errors and possible solutions, please read the following
articles:
[ERROR] [Help 1] http://cwiki.apache.org/confluence/display/MAVEN/MojoFailureException
[ERROR] 
[ERROR] After correcting the problems, you can resume the build with the command
[ERROR]   mvn <goals> -rf :core-it-suite
Build step 'Invoke top-level Maven targets' marked build as failure
Recording test results


Mime
View raw message