maven-notifications mailing list archives

Site index · List index
Message view « Date » · « Thread »
Top « Date » · « Thread »
From Apache Jenkins Server <jenk...@builds.apache.org>
Subject Build failed in Jenkins: maven-plugins-ITs-m3 #353
Date Mon, 30 Jan 2012 22:33:07 GMT
See <https://builds.apache.org/job/maven-plugins-ITs-m3/353/changes>

Changes:

[dennisl] [MPMD-141] Add Italian Resource Bundle

- Add it to the l10n report as well

------------------------------------------
[...truncated 7538 lines...]
[INFO] --- maven-resources-plugin:2.4.3:resources (default-resources) @ maven-remote-resources-plugin
---
[INFO] Using 'UTF-8' encoding to copy filtered resources.
[INFO] Copying 1 resource
[INFO] Copying 3 resources
[INFO] 
[INFO] --- maven-compiler-plugin:2.3.2:compile (default-compile) @ maven-remote-resources-plugin
---
[INFO] Compiling 11 source files to <https://builds.apache.org/job/maven-plugins-ITs-m3/ws/maven-remote-resources-plugin/target/classes>
[INFO] 
[INFO] --- maven-resources-plugin:2.4.3:testResources (default-testResources) @ maven-remote-resources-plugin
---
[INFO] Using 'UTF-8' encoding to copy filtered resources.
[INFO] ..SUCCESS (4.0 s)
[INFO] Building: script-context/pom.xml
[INFO] Copying 7 resources
[INFO] ..SUCCESS (16.2 s)
[INFO] Building: MSITE-456/pom.xml
[INFO] Copying 46 resources
[INFO] Copying 1 resource
[INFO] Copying 3 resources
[INFO] 
[INFO] --- maven-compiler-plugin:2.3.2:testCompile (default-testCompile) @ maven-remote-resources-plugin
---
[INFO] Compiling 18 source files to <https://builds.apache.org/job/maven-plugins-ITs-m3/ws/maven-remote-resources-plugin/target/test-classes>
[INFO] 
[INFO] --- maven-surefire-plugin:2.7.2:test (default-test) @ maven-remote-resources-plugin
---
[INFO] Surefire report directory: <https://builds.apache.org/job/maven-plugins-ITs-m3/ws/maven-remote-resources-plugin/target/surefire-reports>

-------------------------------------------------------
 T E S T S
-------------------------------------------------------
Running org.apache.maven.plugin.resources.remote.RemoteResourcesMojoTest
Tests run: 10, Failures: 0, Errors: 0, Skipped: 0, Time elapsed: 1.608 sec

Results :

Tests run: 10, Failures: 0, Errors: 0, Skipped: 0

[INFO] 
[INFO] --- maven-jar-plugin:2.3.1:jar (default-jar) @ maven-remote-resources-plugin ---
[INFO] Building jar: <https://builds.apache.org/job/maven-plugins-ITs-m3/ws/maven-remote-resources-plugin/target/maven-remote-resources-plugin-1.3-SNAPSHOT.jar>
[INFO] 
[INFO] --- maven-plugin-plugin:2.7:addPluginArtifactMetadata (default-addPluginArtifactMetadata)
@ maven-remote-resources-plugin ---
[INFO] 
[INFO] --- maven-invoker-plugin:1.5:install (install-descriptor) @ maven-remote-resources-plugin
---
[INFO] ..SUCCESS (6.8 s)
[INFO] Building: invocation-spaces/pom.xml
[INFO] Installing <https://builds.apache.org/job/maven-plugins-ITs-m3/ws/maven-remote-resources-plugin/pom.xml>
to <https://builds.apache.org/job/maven-plugins-ITs-m3/ws/maven-remote-resources-plugin/target/it-repo/org/apache/maven/plugins/maven-remote-resources-plugin/1.3-SNAPSHOT/maven-remote-resources-plugin-1.3-SNAPSHOT.pom>
[INFO] Installing <https://builds.apache.org/job/maven-plugins-ITs-m3/ws/maven-remote-resources-plugin/target/maven-remote-resources-plugin-1.3-SNAPSHOT.jar>
to <https://builds.apache.org/job/maven-plugins-ITs-m3/ws/maven-remote-resources-plugin/target/it-repo/org/apache/maven/plugins/maven-remote-resources-plugin/1.3-SNAPSHOT/maven-remote-resources-plugin-1.3-SNAPSHOT.jar>
[INFO] 
[INFO] --- maven-failsafe-plugin:2.9:integration-test (integration-tests) @ maven-remote-resources-plugin
---
[INFO] Failsafe report directory: <https://builds.apache.org/job/maven-plugins-ITs-m3/ws/maven-remote-resources-plugin/target/failsafe-reports>

-------------------------------------------------------
 T E S T S
-------------------------------------------------------
Running org.apache.maven.plugin.resources.remote.it.IT_RunOnlyAtExecutionRoot
[INFO] ..SUCCESS (5.6 s)
[INFO] Building: interpolation/pom.xml
[INFO] ..SUCCESS (5.8 s)
[INFO] Building: skip-run/pom.xml
[INFO] ..SUCCESS (7.1 s)
[INFO] Building: MSITE-507/pom.xml
[INFO] ..SUCCESS (2.8 s)
[INFO] Building: pom-filtering-reactor/pom.xml
[INFO] ..SUCCESS (4.2 s)
[INFO] Building: local-repo-isolated/pom.xml
[INFO] ..SUCCESS (4.8 s)
[INFO] Building: invocation-multiple/pom.xml
[INFO] ..SUCCESS (10.3 s)
[INFO] Building: staging-pom/pom.xml
[INFO] ..SUCCESS (2.7 s)
[INFO] Building: script-global-vars/pom.xml
[INFO] ..SUCCESS (6.7 s)
[INFO] Building: integration-test-never-fails/pom.xml
[INFO] ..SUCCESS (4.1 s)
[INFO] Building: project-cloning/pom.xml
[INFO] ..SUCCESS (6.8 s)
[INFO] Building: pom-less-invocation/pom.xml
[INFO] ..SUCCESS (3.0 s)
[INFO] Building: local-repo-path/pom.xml
[INFO] ..SUCCESS (4.8 s)
[INFO] Building: invocation-offline/pom.xml
[INFO] ..SUCCESS (50.3 s)
[INFO] Building: it-plugin-test/pom.xml
[INFO] ..SUCCESS (5.9 s)
[INFO] Building: settings-auto-exclude/pom.xml
[INFO] ..SUCCESS (6.1 s)
[INFO] Building: MSITE-548/pom.xml
[INFO] ..SUCCESS (4.0 s)
[INFO] Building: staging-reactor/pom.xml
[INFO] ..SUCCESS (4.3 s)
[INFO] Building: script-accessibility/pom.xml
[INFO] ..SUCCESS (7.4 s)
[INFO] Building: top-parent-different-site/pom.xml
[INFO] ..SUCCESS (5.1 s)
[INFO] Building: MSITE-537/pom.xml
[INFO] ..SUCCESS (7.2 s)
[INFO] -------------------------------------------------
[INFO] Build Summary:
[INFO]   Passed: 40, Failed: 0, Errors: 0, Skipped: 0
[INFO] -------------------------------------------------
[INFO] 
[INFO] --- maven-install-plugin:2.3.1:install (default-install) @ maven-invoker-plugin ---
[INFO] Installing <https://builds.apache.org/job/maven-plugins-ITs-m3/ws/maven-invoker-plugin/target/maven-invoker-plugin-1.6-SNAPSHOT.jar>
to /home/hudson/.m2/repository/org/apache/maven/plugins/maven-invoker-plugin/1.6-SNAPSHOT/maven-invoker-plugin-1.6-SNAPSHOT.jar
[INFO] Installing <https://builds.apache.org/job/maven-plugins-ITs-m3/ws/maven-invoker-plugin/pom.xml>
to /home/hudson/.m2/repository/org/apache/maven/plugins/maven-invoker-plugin/1.6-SNAPSHOT/maven-invoker-plugin-1.6-SNAPSHOT.pom
[INFO]                                                                         
[INFO] ------------------------------------------------------------------------
[INFO] Building Maven Plugins Aggregator 1-SNAPSHOT
[INFO] ------------------------------------------------------------------------
[WARNING] *****************************************************************
[WARNING] * Your build is requesting parallel execution, but project      *
[WARNING] * contains the following plugin(s) that are not marked as       *
[WARNING] * @threadSafe to support parallel building.                     *
[WARNING] * While this /may/ work fine, please look for plugin updates    *
[WARNING] * and/or request plugins be made thread-safe.                   *
[WARNING] * If reporting an issue, report it against the plugin in        *
[WARNING] * question, not against maven-core                              *
[WARNING] *****************************************************************
[WARNING] The following plugins are not marked @threadSafe in Maven Plugins Aggregator:
[WARNING] org.apache.maven.plugins:maven-remote-resources-plugin:1.1
[WARNING] *****************************************************************
[INFO] 
[INFO] --- maven-clean-plugin:2.4.1:clean (default-clean) @ maven-plugins-aggregator ---
[INFO] Deleting <https://builds.apache.org/job/maven-plugins-ITs-m3/ws/target>
[INFO] 
[INFO] --- maven-remote-resources-plugin:1.1:process (default) @ maven-plugins-aggregator
---
[INFO] 
[INFO] --- maven-install-plugin:2.3.1:install (default-install) @ maven-plugins-aggregator
---
[INFO] Installing <https://builds.apache.org/job/maven-plugins-ITs-m3/ws/pom.xml> to
/home/hudson/.m2/repository/org/apache/maven/plugins/maven-plugins-aggregator/1-SNAPSHOT/maven-plugins-aggregator-1-SNAPSHOT.pom
[INFO] ..SUCCESS (6.6 s)
[INFO] Building: emma-plugin-it/pom.xml
[INFO] ..SUCCESS (9.1 s)
[INFO] Building: surefire-report/pom.xml
[INFO] ..SUCCESS (6.0 s)
[INFO] Building: MSITE-627/pom.xml
[INFO] ..SUCCESS (11.8 s)
[INFO] Building: inheritedReports/pom.xml
[INFO] ..SKIPPED 
[INFO] Building: MSITE-504/pom.xml
Tests run: 1, Failures: 0, Errors: 0, Skipped: 0, Time elapsed: 111.806 sec
Running org.apache.maven.plugin.resources.remote.it.IT_GenerateFromOverride
Tests run: 1, Failures: 0, Errors: 0, Skipped: 0, Time elapsed: 2.448 sec
Running org.apache.maven.plugin.resources.remote.it.IT_GetDependencyProjects
Tests run: 1, Failures: 0, Errors: 0, Skipped: 0, Time elapsed: 5.995 sec
Running org.apache.maven.plugin.resources.remote.it.IT_SupplementalArtifact
Tests run: 1, Failures: 0, Errors: 0, Skipped: 0, Time elapsed: 6.077 sec
Running org.apache.maven.plugin.resources.remote.it.IT_GenerateFromBundleWithTypeAndClassifier
Tests run: 1, Failures: 0, Errors: 0, Skipped: 0, Time elapsed: 2.325 sec
Running org.apache.maven.plugin.resources.remote.it.IT_CustomFilterDelimiter
Tests run: 1, Failures: 0, Errors: 0, Skipped: 0, Time elapsed: 2.379 sec
Running org.apache.maven.plugin.resources.remote.it.IT_FilterLocalOverride
[INFO] ..SUCCESS (22.8 s)
[INFO] Building: site-jar/pom.xml
Tests run: 1, Failures: 0, Errors: 0, Skipped: 0, Time elapsed: 2.389 sec
Running org.apache.maven.plugin.resources.remote.it.IT_BadDependencyPoms
Tests run: 1, Failures: 0, Errors: 0, Skipped: 0, Time elapsed: 2.686 sec
Running org.apache.maven.plugin.resources.remote.it.IT_GenerateFromBundle
[INFO] ..SUCCESS (5.2 s)
[INFO] 
[INFO] --- maven-invoker-plugin:1.5:verify (integration-test) @ maven-site-plugin ---
[INFO] -------------------------------------------------
[INFO] Build Summary:
[INFO]   Passed: 39, Failed: 0, Errors: 0, Skipped: 1
[INFO] -------------------------------------------------
[INFO] 
[INFO] --- maven-install-plugin:2.3.1:install (default-install) @ maven-site-plugin ---
[INFO] Installing <https://builds.apache.org/job/maven-plugins-ITs-m3/ws/maven-site-plugin/target/maven-site-plugin-3.1-SNAPSHOT.jar>
to /home/hudson/.m2/repository/org/apache/maven/plugins/maven-site-plugin/3.1-SNAPSHOT/maven-site-plugin-3.1-SNAPSHOT.jar
[INFO] Installing <https://builds.apache.org/job/maven-plugins-ITs-m3/ws/maven-site-plugin/dependency-reduced-pom.xml>
to /home/hudson/.m2/repository/org/apache/maven/plugins/maven-site-plugin/3.1-SNAPSHOT/maven-site-plugin-3.1-SNAPSHOT.pom
Tests run: 1, Failures: 0, Errors: 0, Skipped: 0, Time elapsed: 2.43 sec

Results :

Tests run: 9, Failures: 0, Errors: 0, Skipped: 0

[WARNING] File encoding has not been set, using platform encoding ANSI_X3.4-1968, i.e. build
is platform dependent!
[INFO] 
[INFO] --- maven-failsafe-plugin:2.9:verify (integration-tests) @ maven-remote-resources-plugin
---
[INFO] Failsafe report directory: <https://builds.apache.org/job/maven-plugins-ITs-m3/ws/maven-remote-resources-plugin/target/failsafe-reports>
[WARNING] File encoding has not been set, using platform encoding ANSI_X3.4-1968, i.e. build
is platform dependent!
[INFO] 
[INFO] --- maven-install-plugin:2.3.1:install (default-install) @ maven-remote-resources-plugin
---
[INFO] Installing <https://builds.apache.org/job/maven-plugins-ITs-m3/ws/maven-remote-resources-plugin/target/maven-remote-resources-plugin-1.3-SNAPSHOT.jar>
to /home/hudson/.m2/repository/org/apache/maven/plugins/maven-remote-resources-plugin/1.3-SNAPSHOT/maven-remote-resources-plugin-1.3-SNAPSHOT.jar
[INFO] Installing <https://builds.apache.org/job/maven-plugins-ITs-m3/ws/maven-remote-resources-plugin/pom.xml>
to /home/hudson/.m2/repository/org/apache/maven/plugins/maven-remote-resources-plugin/1.3-SNAPSHOT/maven-remote-resources-plugin-1.3-SNAPSHOT.pom
[INFO] ------------------------------------------------------------------------
[INFO] Reactor Summary:
[INFO] 
[INFO] Maven Plugins ..................................... SUCCESS [5.657s]
[INFO] Maven ACR Plugin .................................. SUCCESS [51.030s]
[INFO] Maven Ant Plugin .................................. SUCCESS [2:04.925s]
[INFO] Maven AntRun Plugin ............................... SUCCESS [1:24.581s]
[INFO] Maven Eclipse Plugin .............................. SUCCESS [15:04.308s]
[INFO] Maven Assembly Plugin ............................. FAILURE [1.034s]
[INFO] Maven Changelog Plugin ............................ SUCCESS [1:23.161s]
[INFO] Maven Changes Report Plugin ....................... SUCCESS [2:10.288s]
[INFO] Maven Checkstyle Plugin ........................... SUCCESS [1:59.699s]
[INFO] Maven Clean Plugin ................................ SUCCESS [25.649s]
[INFO] Maven Compiler Plugin ............................. SUCCESS [33.778s]
[INFO] Maven Dependency Plugin ........................... SUCCESS [3:24.438s]
[INFO] Maven Deploy Plugin ............................... SUCCESS [2:52.645s]
[INFO] Maven DOAP Plugin ................................. SUCCESS [27.350s]
[INFO] Maven Documentation Checker Plugin ................ SUCCESS [8.922s]
[INFO] Maven EAR Plugin .................................. SUCCESS [5:34.695s]
[INFO] Maven EJB Plugin .................................. SUCCESS [40.456s]
[INFO] Maven GPG Plugin .................................. SUCCESS [55.513s]
[INFO] Maven Help Plugin ................................. SUCCESS [48.741s]
[INFO] Maven IDEA Plugin ................................. SUCCESS [10.339s]
[INFO] Maven Install Plugin .............................. SUCCESS [48.454s]
[INFO] Maven JAR Plugin .................................. FAILURE [0.246s]
[INFO] Maven Jarsigner Plugin ............................ SUCCESS [31.055s]
[INFO] Maven Javadoc Plugin .............................. SUCCESS [8:51.019s]
[INFO] Maven Linkcheck Plugin ............................ SUCCESS [1.883s]
[INFO] Maven One Plugin .................................. SUCCESS [1.878s]
[INFO] Maven Patch Plugin ................................ SUCCESS [13.146s]
[INFO] Maven PDF Plugin .................................. SUCCESS [2:02.555s]
[INFO] Maven PMD Plugin .................................. SUCCESS [33.372s]
[INFO] Maven RAR Plugin .................................. SUCCESS [9.202s]
[INFO] Maven Reactor Plugin .............................. SUCCESS [7.861s]
[INFO] Maven Repository Plugin ........................... SUCCESS [2:22.474s]
[INFO] Maven Resources Plugin ............................ SUCCESS [55.048s]
[INFO] Maven Shade Plugin ................................ SUCCESS [2:00.939s]
[INFO] Maven Site Plugin 3 ............................... SUCCESS [6:54.460s]
[INFO] Maven Source Plugin ............................... SUCCESS [45.613s]
[INFO] Maven Stage Plugin ................................ SUCCESS [4.227s]
[INFO] Maven Toolchains Plugin ........................... SUCCESS [1.777s]
[INFO] Maven Verifier Plugin ............................. SUCCESS [12.003s]
[INFO] Maven WAR Plugin .................................. FAILURE [0.143s]
[INFO] Maven Invoker Plugin .............................. SUCCESS [4:10.610s]
[INFO] Maven Project Info Reports Plugin ................. SUCCESS [1:55.414s]
[INFO] Maven Remote Resources Plugin ..................... SUCCESS [2:32.726s]
[INFO] Maven Plugins Aggregator .......................... SUCCESS [0.056s]
[INFO] ------------------------------------------------------------------------
[INFO] BUILD FAILURE
[INFO] ------------------------------------------------------------------------
[INFO] Total time: 25:56.191s (Wall Clock)
[INFO] Finished at: Mon Jan 30 22:33:04 UTC 2012
[INFO] Final Memory: 64M/667M
[INFO] ------------------------------------------------------------------------
[WARNING] The requested profile "apache.snapshots" could not be activated because it does
not exist.
[ERROR] Failed to execute goal on project maven-assembly-plugin: Could not resolve dependencies
for project org.apache.maven.plugins:maven-assembly-plugin:maven-plugin:2.4-SNAPSHOT: Could
not find artifact org.apache.maven:maven-archiver:jar:2.5 in central (http://repo1.maven.org/maven2)
-> [Help 1]
[ERROR] Failed to execute goal on project maven-jar-plugin: Could not resolve dependencies
for project org.apache.maven.plugins:maven-jar-plugin:maven-plugin:2.5-SNAPSHOT: Could not
find artifact org.apache.maven:maven-archiver:jar:2.5 in central (http://repo1.maven.org/maven2)
-> [Help 1]
[ERROR] Failed to execute goal on project maven-war-plugin: Could not resolve dependencies
for project org.apache.maven.plugins:maven-war-plugin:maven-plugin:2.3-SNAPSHOT: Could not
find artifact org.apache.maven:maven-archiver:jar:2.5 in central (http://repo1.maven.org/maven2)
-> [Help 1]
[ERROR] 
[ERROR] To see the full stack trace of the errors, re-run Maven with the -e switch.
[ERROR] Re-run Maven using the -X switch to enable full debug logging.
[ERROR] 
[ERROR] For more information about the errors and possible solutions, please read the following
articles:
[ERROR] [Help 1] http://cwiki.apache.org/confluence/display/MAVEN/DependencyResolutionException
[ERROR] 
[ERROR] After correcting the problems, you can resume the build with the command
[ERROR]   mvn <goals> -rf :maven-assembly-plugin
Build step 'Invoke top-level Maven targets' marked build as failure


Mime
View raw message