maven-notifications mailing list archives

Site index · List index
Message view « Date » · « Thread »
Top « Date » · « Thread »
From Apache Jenkins Server <jenk...@builds.apache.org>
Subject Build failed in Jenkins: maven-plugins-ITs-m3 #351
Date Thu, 26 Jan 2012 23:28:40 GMT
See <https://builds.apache.org/job/maven-plugins-ITs-m3/351/changes>

Changes:

[simonetripodi] more elegant Italian :)

[simonetripodi] [MPMD-141] Add Italian Resource Bundle

------------------------------------------
[...truncated 7342 lines...]
[INFO] --- modello-maven-plugin:1.4.1:xpp3-reader (supplemental-models) @ maven-remote-resources-plugin
---
[INFO] outputDirectory: /x1/jenkins/jenkins-slave/workspace/maven-plugins-ITs-m3/maven-remote-resources-plugin/target/generated-sources/modello
[INFO] Working on model: src/main/mdo/supplemental-model.mdo
[INFO] Generating current version: 1.0.0
[INFO] 
[INFO] --- maven-plugin-plugin:2.7:descriptor (default-descriptor) @ maven-remote-resources-plugin
---
[INFO] Using 'UTF-8' encoding to read mojo metadata.
[INFO] Applying mojo extractor for language: java
[INFO] Mojo extractor for language: java found 3 mojo descriptors.
[INFO] Applying mojo extractor for language: bsh
[INFO] Mojo extractor for language: bsh found 0 mojo descriptors.
[INFO] 
[INFO] --- maven-remote-resources-plugin:1.1:process (default) @ maven-remote-resources-plugin
---
[INFO] 
[INFO] --- maven-resources-plugin:2.4.3:resources (default-resources) @ maven-remote-resources-plugin
---
[INFO] Using 'UTF-8' encoding to copy filtered resources.
[INFO] Copying 1 resource
[INFO] Copying 3 resources
[INFO] 
[INFO] --- maven-compiler-plugin:2.3.2:compile (default-compile) @ maven-remote-resources-plugin
---
[INFO] Compiling 11 source files to /x1/jenkins/jenkins-slave/workspace/maven-plugins-ITs-m3/maven-remote-resources-plugin/target/classes
[INFO] 
[INFO] --- maven-resources-plugin:2.4.3:testResources (default-testResources) @ maven-remote-resources-plugin
---
[INFO] Using 'UTF-8' encoding to copy filtered resources.
[INFO] Copying 7 resources
[INFO] Copying 46 resources
[INFO] Copying 1 resource
[INFO] Copying 3 resources
[INFO] 
[INFO] --- maven-compiler-plugin:2.3.2:testCompile (default-testCompile) @ maven-remote-resources-plugin
---
[INFO] Compiling 18 source files to /x1/jenkins/jenkins-slave/workspace/maven-plugins-ITs-m3/maven-remote-resources-plugin/target/test-classes
[INFO] 
[INFO] --- maven-surefire-plugin:2.7.2:test (default-test) @ maven-remote-resources-plugin
---
[INFO] Surefire report directory: /x1/jenkins/jenkins-slave/workspace/maven-plugins-ITs-m3/maven-remote-resources-plugin/target/surefire-reports

-------------------------------------------------------
 T E S T S
-------------------------------------------------------
Running org.apache.maven.plugin.resources.remote.RemoteResourcesMojoTest
[INFO] ..SUCCESS (3.8 s)
[INFO] Building: staging-reactor/pom.xml
Tests run: 10, Failures: 0, Errors: 0, Skipped: 0, Time elapsed: 0.945 sec

Results :

Tests run: 10, Failures: 0, Errors: 0, Skipped: 0

[INFO] 
[INFO] --- maven-jar-plugin:2.3.1:jar (default-jar) @ maven-remote-resources-plugin ---
[INFO] Building jar: /x1/jenkins/jenkins-slave/workspace/maven-plugins-ITs-m3/maven-remote-resources-plugin/target/maven-remote-resources-plugin-1.3-SNAPSHOT.jar
[INFO] 
[INFO] --- maven-plugin-plugin:2.7:addPluginArtifactMetadata (default-addPluginArtifactMetadata)
@ maven-remote-resources-plugin ---
[INFO] 
[INFO] --- maven-invoker-plugin:1.5:install (install-descriptor) @ maven-remote-resources-plugin
---
[INFO] Installing /x1/jenkins/jenkins-slave/workspace/maven-plugins-ITs-m3/maven-remote-resources-plugin/pom.xml
to /x1/jenkins/jenkins-slave/workspace/maven-plugins-ITs-m3/maven-remote-resources-plugin/target/it-repo/org/apache/maven/plugins/maven-remote-resources-plugin/1.3-SNAPSHOT/maven-remote-resources-plugin-1.3-SNAPSHOT.pom
[INFO] Installing /x1/jenkins/jenkins-slave/workspace/maven-plugins-ITs-m3/maven-remote-resources-plugin/target/maven-remote-resources-plugin-1.3-SNAPSHOT.jar
to /x1/jenkins/jenkins-slave/workspace/maven-plugins-ITs-m3/maven-remote-resources-plugin/target/it-repo/org/apache/maven/plugins/maven-remote-resources-plugin/1.3-SNAPSHOT/maven-remote-resources-plugin-1.3-SNAPSHOT.jar
[INFO] 
[INFO] --- maven-failsafe-plugin:2.9:integration-test (integration-tests) @ maven-remote-resources-plugin
---
[INFO] Failsafe report directory: /x1/jenkins/jenkins-slave/workspace/maven-plugins-ITs-m3/maven-remote-resources-plugin/target/failsafe-reports

-------------------------------------------------------
 T E S T S
-------------------------------------------------------
Running org.apache.maven.plugin.resources.remote.it.IT_CustomFilterDelimiter
[INFO] ..SUCCESS (3.6 s)
[INFO] Building: invoker-report/pom.xml
[INFO] ..SUCCESS (9.2 s)
[INFO] Building: local-repo-default/pom.xml
[INFO] ..SUCCESS (6.8 s)
[INFO] Building: install-extra-artifacts/pom.xml
[INFO] ..SUCCESS (6.5 s)
[INFO] Building: staging-dependencies/pom.xml
[INFO] ..SUCCESS (3.4 s)
[INFO] Building: script-global-vars/pom.xml
[INFO] ..SUCCESS (5.0 s)
[INFO] Building: fail-postbuild/pom.xml
[INFO] ..SUCCESS (3.7 s)
[INFO] Building: selector-conditions/pom.xml
[INFO] ..SUCCESS (6.1 s)
[INFO] Building: script-classpath-duplicates/pom.xml
[INFO] ..SUCCESS (79.8 s)
[INFO] Building: MSITE-159/pom.xml
[INFO] ..SUCCESS (5.2 s)
[INFO] Building: pom-filtering-reactor/pom.xml
[INFO] ..SUCCESS (3.5 s)
[INFO] Building: site-jar/pom.xml
[INFO] ..SUCCESS (3.3 s)
[INFO] Building: fail-build/pom.xml
[INFO] ..SUCCESS (3.2 s)
[INFO] Building: local-repo-url/pom.xml
[INFO] ..SUCCESS (3.8 s)
[INFO] Building: inheritedMenus/pom.xml
[INFO] ..SUCCESS (3.5 s)
[INFO] Building: fail-ignore-with-verify/pom.xml
[INFO] ..SUCCESS (4.9 s)
[INFO] Building: MSITE-456/pom.xml
[INFO] ..SUCCESS (3.2 s)
[INFO] Building: local-repo-isolated/pom.xml
[INFO] ..SUCCESS (3.9 s)
[INFO] Building: site-inheritance/pom.xml
[INFO] ..SUCCESS (3.7 s)
[INFO] -------------------------------------------------
[INFO] Build Summary:
[INFO]   Passed: 40, Failed: 0, Errors: 0, Skipped: 0
[INFO] -------------------------------------------------
[INFO] 
[INFO] --- maven-install-plugin:2.3.1:install (default-install) @ maven-invoker-plugin ---
[INFO] Installing /x1/jenkins/jenkins-slave/workspace/maven-plugins-ITs-m3/maven-invoker-plugin/target/maven-invoker-plugin-1.6-SNAPSHOT.jar
to /home/jenkins/.m2/repository/org/apache/maven/plugins/maven-invoker-plugin/1.6-SNAPSHOT/maven-invoker-plugin-1.6-SNAPSHOT.jar
[INFO] Installing /x1/jenkins/jenkins-slave/workspace/maven-plugins-ITs-m3/maven-invoker-plugin/pom.xml
to /home/jenkins/.m2/repository/org/apache/maven/plugins/maven-invoker-plugin/1.6-SNAPSHOT/maven-invoker-plugin-1.6-SNAPSHOT.pom
[INFO]                                                                         
[INFO] ------------------------------------------------------------------------
[INFO] Building Maven Plugins Aggregator 1-SNAPSHOT
[INFO] ------------------------------------------------------------------------
[WARNING] *****************************************************************
[WARNING] * Your build is requesting parallel execution, but project      *
[WARNING] * contains the following plugin(s) that are not marked as       *
[WARNING] * @threadSafe to support parallel building.                     *
[WARNING] * While this /may/ work fine, please look for plugin updates    *
[WARNING] * and/or request plugins be made thread-safe.                   *
[WARNING] * If reporting an issue, report it against the plugin in        *
[WARNING] * question, not against maven-core                              *
[WARNING] *****************************************************************
[WARNING] The following plugins are not marked @threadSafe in Maven Plugins Aggregator:
[WARNING] org.apache.maven.plugins:maven-remote-resources-plugin:1.1
[WARNING] *****************************************************************
[INFO] 
[INFO] --- maven-clean-plugin:2.4.1:clean (default-clean) @ maven-plugins-aggregator ---
[INFO] Deleting /x1/jenkins/jenkins-slave/workspace/maven-plugins-ITs-m3/target
[INFO] 
[INFO] --- maven-remote-resources-plugin:1.1:process (default) @ maven-plugins-aggregator
---
[INFO] 
[INFO] --- maven-install-plugin:2.3.1:install (default-install) @ maven-plugins-aggregator
---
[INFO] Installing /x1/jenkins/jenkins-slave/workspace/maven-plugins-ITs-m3/pom.xml to /home/jenkins/.m2/repository/org/apache/maven/plugins/maven-plugins-aggregator/1-SNAPSHOT/maven-plugins-aggregator-1-SNAPSHOT.pom
[INFO] ..SUCCESS (6.1 s)
[INFO] Building: MSITE-504/pom.xml
[INFO] ..SUCCESS (30.1 s)
[INFO] Building: MSITE-512/pom.xml
[INFO] ..SUCCESS (5.3 s)
[INFO] Building: top-parent-no-site/pom.xml
[INFO] ..SUCCESS (5.9 s)
[INFO] 
[INFO] --- maven-invoker-plugin:1.5:verify (integration-test) @ maven-site-plugin ---
[INFO] -------------------------------------------------
[INFO] Build Summary:
[INFO]   Passed: 39, Failed: 0, Errors: 0, Skipped: 1
[INFO] -------------------------------------------------
[INFO] 
[INFO] --- maven-install-plugin:2.3.1:install (default-install) @ maven-site-plugin ---
[INFO] Installing /x1/jenkins/jenkins-slave/workspace/maven-plugins-ITs-m3/maven-site-plugin/target/maven-site-plugin-3.1-SNAPSHOT.jar
to /home/jenkins/.m2/repository/org/apache/maven/plugins/maven-site-plugin/3.1-SNAPSHOT/maven-site-plugin-3.1-SNAPSHOT.jar
[INFO] Installing /x1/jenkins/jenkins-slave/workspace/maven-plugins-ITs-m3/maven-site-plugin/dependency-reduced-pom.xml
to /home/jenkins/.m2/repository/org/apache/maven/plugins/maven-site-plugin/3.1-SNAPSHOT/maven-site-plugin-3.1-SNAPSHOT.pom
Tests run: 1, Failures: 0, Errors: 0, Skipped: 0, Time elapsed: 114.085 sec
Running org.apache.maven.plugin.resources.remote.it.IT_FilterLocalOverride
Tests run: 1, Failures: 0, Errors: 0, Skipped: 0, Time elapsed: 2.05 sec
Running org.apache.maven.plugin.resources.remote.it.IT_GenerateFromOverride
Tests run: 1, Failures: 0, Errors: 0, Skipped: 0, Time elapsed: 2.17 sec
Running org.apache.maven.plugin.resources.remote.it.IT_GenerateFromBundleWithTypeAndClassifier
Tests run: 1, Failures: 0, Errors: 0, Skipped: 0, Time elapsed: 2 sec
Running org.apache.maven.plugin.resources.remote.it.IT_SupplementalArtifact
Tests run: 1, Failures: 0, Errors: 0, Skipped: 0, Time elapsed: 5.616 sec
Running org.apache.maven.plugin.resources.remote.it.IT_RunOnlyAtExecutionRoot
Tests run: 1, Failures: 0, Errors: 0, Skipped: 0, Time elapsed: 5.309 sec
Running org.apache.maven.plugin.resources.remote.it.IT_GetDependencyProjects
Tests run: 1, Failures: 0, Errors: 0, Skipped: 0, Time elapsed: 5.224 sec
Running org.apache.maven.plugin.resources.remote.it.IT_GenerateFromBundle
Tests run: 1, Failures: 0, Errors: 0, Skipped: 0, Time elapsed: 2.111 sec
Running org.apache.maven.plugin.resources.remote.it.IT_BadDependencyPoms
Tests run: 1, Failures: 0, Errors: 0, Skipped: 0, Time elapsed: 2.303 sec

Results :

Tests run: 9, Failures: 0, Errors: 0, Skipped: 0

[WARNING] File encoding has not been set, using platform encoding ANSI_X3.4-1968, i.e. build
is platform dependent!
[INFO] 
[INFO] --- maven-failsafe-plugin:2.9:verify (integration-tests) @ maven-remote-resources-plugin
---
[INFO] Failsafe report directory: /x1/jenkins/jenkins-slave/workspace/maven-plugins-ITs-m3/maven-remote-resources-plugin/target/failsafe-reports
[WARNING] File encoding has not been set, using platform encoding ANSI_X3.4-1968, i.e. build
is platform dependent!
[INFO] 
[INFO] --- maven-install-plugin:2.3.1:install (default-install) @ maven-remote-resources-plugin
---
[INFO] Installing /x1/jenkins/jenkins-slave/workspace/maven-plugins-ITs-m3/maven-remote-resources-plugin/target/maven-remote-resources-plugin-1.3-SNAPSHOT.jar
to /home/jenkins/.m2/repository/org/apache/maven/plugins/maven-remote-resources-plugin/1.3-SNAPSHOT/maven-remote-resources-plugin-1.3-SNAPSHOT.jar
[INFO] Installing /x1/jenkins/jenkins-slave/workspace/maven-plugins-ITs-m3/maven-remote-resources-plugin/pom.xml
to /home/jenkins/.m2/repository/org/apache/maven/plugins/maven-remote-resources-plugin/1.3-SNAPSHOT/maven-remote-resources-plugin-1.3-SNAPSHOT.pom
[INFO] ------------------------------------------------------------------------
[INFO] Reactor Summary:
[INFO] 
[INFO] Maven Plugins ..................................... SUCCESS [2.615s]
[INFO] Maven ACR Plugin .................................. SUCCESS [17.985s]
[INFO] Maven Ant Plugin .................................. SUCCESS [1:12.144s]
[INFO] Maven AntRun Plugin ............................... SUCCESS [46.387s]
[INFO] Maven Eclipse Plugin .............................. SUCCESS [11:15.540s]
[INFO] Maven Assembly Plugin ............................. FAILURE [0.831s]
[INFO] Maven Changelog Plugin ............................ SUCCESS [25.424s]
[INFO] Maven Changes Report Plugin ....................... SUCCESS [56.120s]
[INFO] Maven Checkstyle Plugin ........................... SUCCESS [1:18.891s]
[INFO] Maven Clean Plugin ................................ SUCCESS [14.914s]
[INFO] Maven Compiler Plugin ............................. SUCCESS [18.875s]
[INFO] Maven Dependency Plugin ........................... SUCCESS [1:41.542s]
[INFO] Maven Deploy Plugin ............................... SUCCESS [1:35.694s]
[INFO] Maven DOAP Plugin ................................. SUCCESS [15.596s]
[INFO] Maven Documentation Checker Plugin ................ SUCCESS [6.072s]
[INFO] Maven EAR Plugin .................................. SUCCESS [3:40.023s]
[INFO] Maven EJB Plugin .................................. SUCCESS [20.263s]
[INFO] Maven GPG Plugin .................................. SUCCESS [30.757s]
[INFO] Maven Help Plugin ................................. SUCCESS [34.551s]
[INFO] Maven IDEA Plugin ................................. SUCCESS [5.083s]
[INFO] Maven Install Plugin .............................. SUCCESS [31.065s]
[INFO] Maven JAR Plugin .................................. FAILURE [0.118s]
[INFO] Maven Jarsigner Plugin ............................ SUCCESS [18.819s]
[INFO] Maven Javadoc Plugin .............................. SUCCESS [8:06.485s]
[INFO] Maven Linkcheck Plugin ............................ SUCCESS [1.439s]
[INFO] Maven One Plugin .................................. SUCCESS [1.567s]
[INFO] Maven Patch Plugin ................................ SUCCESS [10.767s]
[INFO] Maven PDF Plugin .................................. SUCCESS [20.138s]
[INFO] Maven PMD Plugin .................................. SUCCESS [20.966s]
[INFO] Maven RAR Plugin .................................. SUCCESS [5.714s]
[INFO] Maven Reactor Plugin .............................. SUCCESS [1.932s]
[INFO] Maven Repository Plugin ........................... SUCCESS [3:12.467s]
[INFO] Maven Resources Plugin ............................ SUCCESS [43.015s]
[INFO] Maven Shade Plugin ................................ SUCCESS [1:29.679s]
[INFO] Maven Site Plugin 3 ............................... SUCCESS [5:55.357s]
[INFO] Maven Source Plugin ............................... SUCCESS [24.290s]
[INFO] Maven Stage Plugin ................................ SUCCESS [1.477s]
[INFO] Maven Toolchains Plugin ........................... SUCCESS [1.122s]
[INFO] Maven Verifier Plugin ............................. SUCCESS [7.379s]
[INFO] Maven WAR Plugin .................................. FAILURE [0.136s]
[INFO] Maven Invoker Plugin .............................. SUCCESS [3:07.400s]
[INFO] Maven Project Info Reports Plugin ................. SUCCESS [1:19.624s]
[INFO] Maven Remote Resources Plugin ..................... SUCCESS [2:26.017s]
[INFO] Maven Plugins Aggregator .......................... SUCCESS [0.030s]
[INFO] ------------------------------------------------------------------------
[INFO] BUILD FAILURE
[INFO] ------------------------------------------------------------------------
[INFO] Total time: 18:47.593s (Wall Clock)
[INFO] Finished at: Thu Jan 26 23:28:39 GMT 2012
[INFO] Final Memory: 62M/992M
[INFO] ------------------------------------------------------------------------
[WARNING] The requested profile "apache.snapshots" could not be activated because it does
not exist.
[ERROR] Failed to execute goal on project maven-assembly-plugin: Could not resolve dependencies
for project org.apache.maven.plugins:maven-assembly-plugin:maven-plugin:2.4-SNAPSHOT: Could
not find artifact org.apache.maven:maven-archiver:jar:2.5 in central (http://repo1.maven.org/maven2)
-> [Help 1]
[ERROR] Failed to execute goal on project maven-jar-plugin: Could not resolve dependencies
for project org.apache.maven.plugins:maven-jar-plugin:maven-plugin:2.5-SNAPSHOT: Could not
find artifact org.apache.maven:maven-archiver:jar:2.5 in central (http://repo1.maven.org/maven2)
-> [Help 1]
[ERROR] Failed to execute goal on project maven-war-plugin: Could not resolve dependencies
for project org.apache.maven.plugins:maven-war-plugin:maven-plugin:2.3-SNAPSHOT: Could not
find artifact org.apache.maven:maven-archiver:jar:2.5 in central (http://repo1.maven.org/maven2)
-> [Help 1]
[ERROR] 
[ERROR] To see the full stack trace of the errors, re-run Maven with the -e switch.
[ERROR] Re-run Maven using the -X switch to enable full debug logging.
[ERROR] 
[ERROR] For more information about the errors and possible solutions, please read the following
articles:
[ERROR] [Help 1] http://cwiki.apache.org/confluence/display/MAVEN/DependencyResolutionException
[ERROR] 
[ERROR] After correcting the problems, you can resume the build with the command
[ERROR]   mvn <goals> -rf :maven-assembly-plugin
Build step 'Invoke top-level Maven targets' marked build as failure


Mime
View raw message