maven-notifications mailing list archives

Site index · List index
Message view « Date » · « Thread »
Top « Date » · « Thread »
From Apache Jenkins Server <jenk...@builds.apache.org>
Subject Build failed in Jenkins: maven-enforcer #7
Date Sat, 21 Jan 2012 12:01:33 GMT
See <https://builds.apache.org/job/maven-enforcer/7/changes>

Changes:

[rfscholte] format code, no changes

[rfscholte] format code, no changes

------------------------------------------
[...truncated 614 lines...]
	at org.apache.maven.surefire.booter.SurefireStarter.runSuitesInProcess(SurefireStarter.java:91)
	at org.apache.maven.surefire.booter.ForkedBooter.main(ForkedBooter.java:69)

[debug] Executing rule: org.apache.maven.plugins.enforcer.MockEnforcerRule
[debug] Adding failure due to exception

org.apache.maven.enforcer.rule.api.EnforcerRuleException:  this condition is not allowed.
	at org.apache.maven.plugins.enforcer.MockEnforcerRule.execute(MockEnforcerRule.java:62)
	at org.apache.maven.plugins.enforcer.EnforceMojo.execute(EnforceMojo.java:190)
	at org.apache.maven.plugins.enforcer.TestEnforceMojo.testEnforceMojo(TestEnforceMojo.java:60)
	at sun.reflect.NativeMethodAccessorImpl.invoke0(Native Method)
	at sun.reflect.NativeMethodAccessorImpl.invoke(NativeMethodAccessorImpl.java:39)
	at sun.reflect.DelegatingMethodAccessorImpl.invoke(DelegatingMethodAccessorImpl.java:25)
	at java.lang.reflect.Method.invoke(Method.java:592)
	at junit.framework.TestCase.runTest(TestCase.java:164)
	at junit.framework.TestCase.runBare(TestCase.java:130)
	at junit.framework.TestResult$1.protect(TestResult.java:106)
	at junit.framework.TestResult.runProtected(TestResult.java:124)
	at junit.framework.TestResult.run(TestResult.java:109)
	at junit.framework.TestCase.run(TestCase.java:120)
	at junit.framework.TestSuite.runTest(TestSuite.java:230)
	at junit.framework.TestSuite.run(TestSuite.java:225)
	at sun.reflect.NativeMethodAccessorImpl.invoke0(Native Method)
	at sun.reflect.NativeMethodAccessorImpl.invoke(NativeMethodAccessorImpl.java:39)
	at sun.reflect.DelegatingMethodAccessorImpl.invoke(DelegatingMethodAccessorImpl.java:25)
	at java.lang.reflect.Method.invoke(Method.java:592)
	at org.apache.maven.surefire.junit.JUnitTestSet.execute(JUnitTestSet.java:98)
	at org.apache.maven.surefire.junit.JUnit3Provider.executeTestSet(JUnit3Provider.java:107)
	at org.apache.maven.surefire.junit.JUnit3Provider.invoke(JUnit3Provider.java:84)
	at sun.reflect.NativeMethodAccessorImpl.invoke0(Native Method)
	at sun.reflect.NativeMethodAccessorImpl.invoke(NativeMethodAccessorImpl.java:39)
	at sun.reflect.DelegatingMethodAccessorImpl.invoke(DelegatingMethodAccessorImpl.java:25)
	at java.lang.reflect.Method.invoke(Method.java:592)
	at org.apache.maven.surefire.booter.ProviderFactory$ClassLoaderProxy.invoke(ProviderFactory.java:103)
	at $Proxy0.invoke(Unknown Source)
	at org.apache.maven.surefire.booter.SurefireStarter.invokeProvider(SurefireStarter.java:150)
	at org.apache.maven.surefire.booter.SurefireStarter.runSuitesInProcess(SurefireStarter.java:91)
	at org.apache.maven.surefire.booter.ForkedBooter.main(ForkedBooter.java:69)

[warn] Rule 0: org.apache.maven.plugins.enforcer.MockEnforcerRule failed with message:
 this condition is not allowed.
[warn] Rule 1: org.apache.maven.plugins.enforcer.MockEnforcerRule failed with message:
 this condition is not allowed.
[debug] Executing rule: org.apache.maven.plugins.enforcer.MockEnforcerRule
[debug] Adding failure due to exception

org.apache.maven.enforcer.rule.api.EnforcerRuleException:  this condition is not allowed.
	at org.apache.maven.plugins.enforcer.MockEnforcerRule.execute(MockEnforcerRule.java:62)
	at org.apache.maven.plugins.enforcer.EnforceMojo.execute(EnforceMojo.java:190)
	at org.apache.maven.plugins.enforcer.TestEnforceMojo.testEnforceMojo(TestEnforceMojo.java:66)
	at sun.reflect.NativeMethodAccessorImpl.invoke0(Native Method)
	at sun.reflect.NativeMethodAccessorImpl.invoke(NativeMethodAccessorImpl.java:39)
	at sun.reflect.DelegatingMethodAccessorImpl.invoke(DelegatingMethodAccessorImpl.java:25)
	at java.lang.reflect.Method.invoke(Method.java:592)
	at junit.framework.TestCase.runTest(TestCase.java:164)
	at junit.framework.TestCase.runBare(TestCase.java:130)
	at junit.framework.TestResult$1.protect(TestResult.java:106)
	at junit.framework.TestResult.runProtected(TestResult.java:124)
	at junit.framework.TestResult.run(TestResult.java:109)
	at junit.framework.TestCase.run(TestCase.java:120)
	at junit.framework.TestSuite.runTest(TestSuite.java:230)
	at junit.framework.TestSuite.run(TestSuite.java:225)
	at sun.reflect.NativeMethodAccessorImpl.invoke0(Native Method)
	at sun.reflect.NativeMethodAccessorImpl.invoke(NativeMethodAccessorImpl.java:39)
	at sun.reflect.DelegatingMethodAccessorImpl.invoke(DelegatingMethodAccessorImpl.java:25)
	at java.lang.reflect.Method.invoke(Method.java:592)
	at org.apache.maven.surefire.junit.JUnitTestSet.execute(JUnitTestSet.java:98)
	at org.apache.maven.surefire.junit.JUnit3Provider.executeTestSet(JUnit3Provider.java:107)
	at org.apache.maven.surefire.junit.JUnit3Provider.invoke(JUnit3Provider.java:84)
	at sun.reflect.NativeMethodAccessorImpl.invoke0(Native Method)
	at sun.reflect.NativeMethodAccessorImpl.invoke(NativeMethodAccessorImpl.java:39)
	at sun.reflect.DelegatingMethodAccessorImpl.invoke(DelegatingMethodAccessorImpl.java:25)
	at java.lang.reflect.Method.invoke(Method.java:592)
	at org.apache.maven.surefire.booter.ProviderFactory$ClassLoaderProxy.invoke(ProviderFactory.java:103)
	at $Proxy0.invoke(Unknown Source)
	at org.apache.maven.surefire.booter.SurefireStarter.invokeProvider(SurefireStarter.java:150)
	at org.apache.maven.surefire.booter.SurefireStarter.runSuitesInProcess(SurefireStarter.java:91)
	at org.apache.maven.surefire.booter.ForkedBooter.main(ForkedBooter.java:69)

[debug] Executing rule: org.apache.maven.plugins.enforcer.MockEnforcerRule
[debug] Adding failure due to exception

org.apache.maven.enforcer.rule.api.EnforcerRuleException:  this condition is not allowed.
	at org.apache.maven.plugins.enforcer.MockEnforcerRule.execute(MockEnforcerRule.java:62)
	at org.apache.maven.plugins.enforcer.EnforceMojo.execute(EnforceMojo.java:190)
	at org.apache.maven.plugins.enforcer.TestEnforceMojo.testEnforceMojo(TestEnforceMojo.java:66)
	at sun.reflect.NativeMethodAccessorImpl.invoke0(Native Method)
	at sun.reflect.NativeMethodAccessorImpl.invoke(NativeMethodAccessorImpl.java:39)
	at sun.reflect.DelegatingMethodAccessorImpl.invoke(DelegatingMethodAccessorImpl.java:25)
	at java.lang.reflect.Method.invoke(Method.java:592)
	at junit.framework.TestCase.runTest(TestCase.java:164)
	at junit.framework.TestCase.runBare(TestCase.java:130)
	at junit.framework.TestResult$1.protect(TestResult.java:106)
	at junit.framework.TestResult.runProtected(TestResult.java:124)
	at junit.framework.TestResult.run(TestResult.java:109)
	at junit.framework.TestCase.run(TestCase.java:120)
	at junit.framework.TestSuite.runTest(TestSuite.java:230)
	at junit.framework.TestSuite.run(TestSuite.java:225)
	at sun.reflect.NativeMethodAccessorImpl.invoke0(Native Method)
	at sun.reflect.NativeMethodAccessorImpl.invoke(NativeMethodAccessorImpl.java:39)
	at sun.reflect.DelegatingMethodAccessorImpl.invoke(DelegatingMethodAccessorImpl.java:25)
	at java.lang.reflect.Method.invoke(Method.java:592)
	at org.apache.maven.surefire.junit.JUnitTestSet.execute(JUnitTestSet.java:98)
	at org.apache.maven.surefire.junit.JUnit3Provider.executeTestSet(JUnit3Provider.java:107)
	at org.apache.maven.surefire.junit.JUnit3Provider.invoke(JUnit3Provider.java:84)
	at sun.reflect.NativeMethodAccessorImpl.invoke0(Native Method)
	at sun.reflect.NativeMethodAccessorImpl.invoke(NativeMethodAccessorImpl.java:39)
	at sun.reflect.DelegatingMethodAccessorImpl.invoke(DelegatingMethodAccessorImpl.java:25)
	at java.lang.reflect.Method.invoke(Method.java:592)
	at org.apache.maven.surefire.booter.ProviderFactory$ClassLoaderProxy.invoke(ProviderFactory.java:103)
	at $Proxy0.invoke(Unknown Source)
	at org.apache.maven.surefire.booter.SurefireStarter.invokeProvider(SurefireStarter.java:150)
	at org.apache.maven.surefire.booter.SurefireStarter.runSuitesInProcess(SurefireStarter.java:91)
	at org.apache.maven.surefire.booter.ForkedBooter.main(ForkedBooter.java:69)

[warn] Rule 0: org.apache.maven.plugins.enforcer.MockEnforcerRule failed with message:
 this condition is not allowed.
[warn] Rule 1: org.apache.maven.plugins.enforcer.MockEnforcerRule failed with message:
 this condition is not allowed.
Caught Expected Exception:Some Enforcer rules have failed. Look above for specific messages
explaining why the rule failed.
[debug] Executing rule: org.apache.maven.plugins.enforcer.MockEnforcerRule
Caught Expected Exception:org.apache.maven.plugins.enforcer.MockEnforcerRule failed with message:
 this condition is not allowed.
[debug] Executing rule: org.apache.maven.plugins.enforcer.MockEnforcerRule
[debug] Executing rule: org.apache.maven.plugins.enforcer.MockEnforcerRule
[debug] Executing rule: org.apache.maven.plugins.enforcer.MockEnforcerRule
[debug] Rule org.apache.maven.plugins.enforcer.MockEnforcerRule is cacheable.
[debug] Executing rule: org.apache.maven.plugins.enforcer.MockEnforcerRule
[debug] Rule org.apache.maven.plugins.enforcer.MockEnforcerRule is cacheable.
[debug] Key org.apache.maven.plugins.enforcer.MockEnforcerRule  was found in the cache
[debug] The cached results are still valid. Skipping the rule: org.apache.maven.plugins.enforcer.MockEnforcerRule
[debug] Executing rule: org.apache.maven.plugins.enforcer.MockEnforcerRule
[debug] Executing rule: org.apache.maven.plugins.enforcer.MockEnforcerRule
[debug] Executing rule: org.apache.maven.plugins.enforcer.MockEnforcerRule
[debug] Rule org.apache.maven.plugins.enforcer.MockEnforcerRule is cacheable.
[debug] Executing rule: org.apache.maven.plugins.enforcer.MockEnforcerRule
[debug] Rule org.apache.maven.plugins.enforcer.MockEnforcerRule is cacheable.
[debug] Executing rule: org.apache.maven.plugins.enforcer.MockEnforcerRule
[debug] Rule org.apache.maven.plugins.enforcer.MockEnforcerRule is cacheable.
[debug] Key org.apache.maven.plugins.enforcer.MockEnforcerRule 2 was found in the cache
[debug] The cached results are still valid. Skipping the rule: org.apache.maven.plugins.enforcer.MockEnforcerRule
[debug] Executing rule: org.apache.maven.plugins.enforcer.MockEnforcerRule
[debug] Rule org.apache.maven.plugins.enforcer.MockEnforcerRule is cacheable.
[debug] Executing rule: org.apache.maven.plugins.enforcer.MockEnforcerRule
[debug] Executing rule: org.apache.maven.plugins.enforcer.MockEnforcerRule
[debug] Rule org.apache.maven.plugins.enforcer.MockEnforcerRule is cacheable.
[debug] Executing rule: org.apache.maven.plugins.enforcer.MockEnforcerRule
[debug] Rule org.apache.maven.plugins.enforcer.MockEnforcerRule is cacheable.
[debug] Key org.apache.maven.plugins.enforcer.MockEnforcerRule 1 was found in the cache
[debug] Executing rule: org.apache.maven.plugins.enforcer.MockEnforcerRule
[debug] Rule org.apache.maven.plugins.enforcer.MockEnforcerRule is cacheable.
[debug] Executing rule: org.apache.maven.plugins.enforcer.MockEnforcerRule
[debug] Rule org.apache.maven.plugins.enforcer.MockEnforcerRule is cacheable.
[debug] Key org.apache.maven.plugins.enforcer.MockEnforcerRule  was found in the cache
[debug] The cached results are still valid. Skipping the rule: org.apache.maven.plugins.enforcer.MockEnforcerRule
[debug] Executing rule: org.apache.maven.plugins.enforcer.MockEnforcerRule
[debug] Rule org.apache.maven.plugins.enforcer.MockEnforcerRule is cacheable.
[debug] Key org.apache.maven.plugins.enforcer.MockEnforcerRule  was found in the cache
[debug] The cached results are still valid. Skipping the rule: org.apache.maven.plugins.enforcer.MockEnforcerRule
[debug] Executing rule: org.apache.maven.plugins.enforcer.MockEnforcerRule
[debug] Rule org.apache.maven.plugins.enforcer.MockEnforcerRule is cacheable.
[debug] Key org.apache.maven.plugins.enforcer.MockEnforcerRule  was found in the cache
[debug] The cached results are still valid. Skipping the rule: org.apache.maven.plugins.enforcer.MockEnforcerRule
[debug] Executing rule: org.apache.maven.plugins.enforcer.MockEnforcerRule
[debug] Rule org.apache.maven.plugins.enforcer.MockEnforcerRule is cacheable.
[debug] Key org.apache.maven.plugins.enforcer.MockEnforcerRule  was found in the cache
[debug] The cached results are still valid. Skipping the rule: org.apache.maven.plugins.enforcer.MockEnforcerRule
[debug] Executing rule: org.apache.maven.plugins.enforcer.MockEnforcerRule
[debug] Rule org.apache.maven.plugins.enforcer.MockEnforcerRule is cacheable.
[debug] Key org.apache.maven.plugins.enforcer.MockEnforcerRule  was found in the cache
[debug] The cached results are still valid. Skipping the rule: org.apache.maven.plugins.enforcer.MockEnforcerRule
Tests run: 5, Failures: 0, Errors: 0, Skipped: 0, Time elapsed: 1.058 sec
Running org.apache.maven.plugins.enforcer.TestDefaultEnforcementRuleHelper
Tests run: 1, Failures: 0, Errors: 0, Skipped: 0, Time elapsed: 0.004 sec

Results :

Tests run: 6, Failures: 0, Errors: 0, Skipped: 0

[JENKINS] Recording test results
[INFO] 
[INFO] --- maven-jar-plugin:2.3.1:jar (default-jar) @ maven-enforcer-plugin ---
[INFO] Building jar: <https://builds.apache.org/job/maven-enforcer/ws/maven-enforcer-plugin/target/maven-enforcer-plugin-1.1-SNAPSHOT.jar>
[INFO] 
[INFO] --- maven-plugin-plugin:2.7:addPluginArtifactMetadata (default-addPluginArtifactMetadata)
@ maven-enforcer-plugin ---
[INFO] [INFO] Installing <https://builds.apache.org/job/maven-enforcer/ws/maven-enforcer-plugin/target/maven-enforcer-plugin-1.1-SNAPSHOT.jar>
to /home/jenkins/.m2/repository/org/apache/maven/plugins/maven-enforcer-plugin/1.1-SNAPSHOT/maven-enforcer-plugin-1.1-SNAPSHOT.jar
[INFO] Installing <https://builds.apache.org/job/maven-enforcer/ws/maven-enforcer-plugin/pom.xml>
to /home/jenkins/.m2/repository/org/apache/maven/plugins/maven-enforcer-plugin/1.1-SNAPSHOT/maven-enforcer-plugin-1.1-SNAPSHOT.pom

[INFO] --- maven-install-plugin:2.3.1:install (default-install) @ maven-enforcer-plugin ---
[JENKINS] Archiving <https://builds.apache.org/job/maven-enforcer/ws/maven-enforcer-plugin/pom.xml>
to /home/hudson/hudson/jobs/maven-enforcer/modules/org.apache.maven.plugins$maven-enforcer-plugin/builds/2012-01-21_12-01-03/archive/org.apache.maven.plugins/maven-enforcer-plugin/1.1-SNAPSHOT/maven-enforcer-plugin-1.1-SNAPSHOT.pom
[JENKINS] Archiving <https://builds.apache.org/job/maven-enforcer/ws/maven-enforcer-plugin/target/maven-enforcer-plugin-1.1-SNAPSHOT.jar>
to /home/hudson/hudson/jobs/maven-enforcer/modules/org.apache.maven.plugins$maven-enforcer-plugin/builds/2012-01-21_12-01-03/archive/org.apache.maven.plugins/maven-enforcer-plugin/1.1-SNAPSHOT/maven-enforcer-plugin-1.1-SNAPSHOT.jar
[INFO] ------------------------------------------------------------------------
[INFO] Reactor Summary:
[INFO] 
[INFO] Enforcer .......................................... SUCCESS [7.838s]
[INFO] Enforcer API ...................................... SUCCESS [2.567s]
[INFO] Enforcer Rules .................................... SUCCESS [6.493s]
[INFO] Maven Enforcer Plugin ............................. SUCCESS [5.618s]
[INFO] ------------------------------------------------------------------------
[INFO] BUILD SUCCESS
[INFO] ------------------------------------------------------------------------
[INFO] Total time: 24.254s
[INFO] Finished at: Sat Jan 21 12:01:31 GMT 2012
[INFO] Final Memory: 17M/439M
[INFO] ------------------------------------------------------------------------
Waiting for Jenkins to finish collecting data
channel stopped
Maven RedeployPublished use remote ubuntu3 maven settings from : /home/jenkins/.m2/settings.xml
[INFO] Deployment in https://repository.apache.org/content/repositories/snapshots (id=,uniqueVersion=true)
Deploying the main artifact enforcer-1.1-SNAPSHOT.pom
Downloading: https://repository.apache.org/content/repositories/snapshots/org/apache/maven/enforcer/enforcer/1.1-SNAPSHOT/maven-metadata.xml
Downloaded: https://repository.apache.org/content/repositories/snapshots/org/apache/maven/enforcer/enforcer/1.1-SNAPSHOT/maven-metadata.xml
(606 B at 0.6 KB/sec)
Uploading: https://repository.apache.org/content/repositories/snapshots/org/apache/maven/enforcer/enforcer/1.1-SNAPSHOT/enforcer-1.1-20120121.120133-7.pom
Uploading: https://repository.apache.org/content/repositories/snapshots/org/apache/maven/enforcer/enforcer/1.1-SNAPSHOT/enforcer-1.1-20120121.120133-7.pom
ERROR: Failed to deploy artifacts: Could not transfer artifact org.apache.maven.enforcer:enforcer:pom:1.1-20120121.120133-7
from/to  (https://repository.apache.org/content/repositories/snapshots): Failed to transfer
file: https://repository.apache.org/content/repositories/snapshots/org/apache/maven/enforcer/enforcer/1.1-SNAPSHOT/enforcer-1.1-20120121.120133-7.pom.
Return code is: 401, ReasonPhrase:Unauthorized.
org.apache.maven.artifact.deployer.ArtifactDeploymentException: Failed to deploy artifacts:
Could not transfer artifact org.apache.maven.enforcer:enforcer:pom:1.1-20120121.120133-7 from/to
 (https://repository.apache.org/content/repositories/snapshots): Failed to transfer file:
https://repository.apache.org/content/repositories/snapshots/org/apache/maven/enforcer/enforcer/1.1-SNAPSHOT/enforcer-1.1-20120121.120133-7.pom.
Return code is: 401, ReasonPhrase:Unauthorized.
	at org.apache.maven.artifact.deployer.DefaultArtifactDeployer.deploy(DefaultArtifactDeployer.java:141)
	at hudson.maven.reporters.MavenArtifactRecord.deploy(MavenArtifactRecord.java:182)
	at hudson.maven.RedeployPublisher.perform(RedeployPublisher.java:158)
	at hudson.tasks.BuildStepMonitor$1.perform(BuildStepMonitor.java:19)
	at hudson.model.AbstractBuild$AbstractRunner.perform(AbstractBuild.java:697)
	at hudson.model.AbstractBuild$AbstractRunner.performAllBuildSteps(AbstractBuild.java:672)
	at hudson.maven.MavenModuleSetBuild$RunnerImpl.post2(MavenModuleSetBuild.java:997)
	at hudson.model.AbstractBuild$AbstractRunner.post(AbstractBuild.java:619)
	at hudson.model.Run.run(Run.java:1429)
	at hudson.maven.MavenModuleSetBuild.run(MavenModuleSetBuild.java:481)
	at hudson.model.ResourceController.execute(ResourceController.java:88)
	at hudson.model.Executor.run(Executor.java:238)
Caused by: org.sonatype.aether.deployment.DeploymentException: Failed to deploy artifacts:
Could not transfer artifact org.apache.maven.enforcer:enforcer:pom:1.1-20120121.120133-7 from/to
 (https://repository.apache.org/content/repositories/snapshots): Failed to transfer file:
https://repository.apache.org/content/repositories/snapshots/org/apache/maven/enforcer/enforcer/1.1-SNAPSHOT/enforcer-1.1-20120121.120133-7.pom.
Return code is: 401, ReasonPhrase:Unauthorized.
	at org.sonatype.aether.impl.internal.DefaultDeployer.deploy(DefaultDeployer.java:280)
	at org.sonatype.aether.impl.internal.DefaultDeployer.deploy(DefaultDeployer.java:211)
	at org.sonatype.aether.impl.internal.DefaultRepositorySystem.deploy(DefaultRepositorySystem.java:443)
	at org.apache.maven.artifact.deployer.DefaultArtifactDeployer.deploy(DefaultArtifactDeployer.java:137)
	... 11 more
Caused by: org.sonatype.aether.transfer.ArtifactTransferException: Could not transfer artifact
org.apache.maven.enforcer:enforcer:pom:1.1-20120121.120133-7 from/to  (https://repository.apache.org/content/repositories/snapshots):
Failed to transfer file: https://repository.apache.org/content/repositories/snapshots/org/apache/maven/enforcer/enforcer/1.1-SNAPSHOT/enforcer-1.1-20120121.120133-7.pom.
Return code is: 401, ReasonPhrase:Unauthorized.
	at org.sonatype.aether.connector.wagon.WagonRepositoryConnector$4.wrap(WagonRepositoryConnector.java:950)
	at org.sonatype.aether.connector.wagon.WagonRepositoryConnector$4.wrap(WagonRepositoryConnector.java:940)
	at org.sonatype.aether.connector.wagon.WagonRepositoryConnector$PutTask.run(WagonRepositoryConnector.java:837)
	at org.sonatype.aether.connector.wagon.WagonRepositoryConnector.put(WagonRepositoryConnector.java:467)
	at org.sonatype.aether.impl.internal.DefaultDeployer.deploy(DefaultDeployer.java:274)
	... 14 more
Caused by: org.apache.maven.wagon.TransferFailedException: Failed to transfer file: https://repository.apache.org/content/repositories/snapshots/org/apache/maven/enforcer/enforcer/1.1-SNAPSHOT/enforcer-1.1-20120121.120133-7.pom.
Return code is: 401, ReasonPhrase:Unauthorized.
	at org.apache.maven.wagon.shared.http4.AbstractHttpClientWagon.put(AbstractHttpClientWagon.java:562)
	at org.apache.maven.wagon.shared.http4.AbstractHttpClientWagon.put(AbstractHttpClientWagon.java:471)
	at org.apache.maven.wagon.shared.http4.AbstractHttpClientWagon.put(AbstractHttpClientWagon.java:451)
	at org.sonatype.aether.connector.wagon.WagonRepositoryConnector$PutTask.run(WagonRepositoryConnector.java:811)
	... 16 more
[INFO] Deployment failed after 1.5 sec
Build step 'Deploy artifacts to Maven repository' changed build result to FAILURE


Mime
View raw message