maven-notifications mailing list archives

Site index · List index
Message view « Date » · « Thread »
Top « Date » · « Thread »
From Apache Jenkins Server <jenk...@builds.apache.org>
Subject Build failed in Jenkins: maven-plugins-ITs-m3 #348
Date Wed, 25 Jan 2012 21:26:54 GMT
See <https://builds.apache.org/job/maven-plugins-ITs-m3/348/changes>

Changes:

[dennisl] [MEJB-56] Add Maven version used to Created-By entry in manifest
Submitted by: Anders Hammar
Reviewed by: Dennis Lundberg

- Add more checks to the IT

[dennisl] [MEJB-56] Add Maven version used to Created-By entry in manifest
Submitted by: Anders Hammar
Reviewed by: Dennis Lundberg

------------------------------------------
[...truncated 7436 lines...]
[INFO] Compiling 18 source files to /x1/jenkins/jenkins-slave/workspace/maven-plugins-ITs-m3/maven-remote-resources-plugin/target/test-classes
[INFO] 
[INFO] --- maven-surefire-plugin:2.7.2:test (default-test) @ maven-remote-resources-plugin
---
[INFO] Surefire report directory: /x1/jenkins/jenkins-slave/workspace/maven-plugins-ITs-m3/maven-remote-resources-plugin/target/surefire-reports

-------------------------------------------------------
 T E S T S
-------------------------------------------------------
Running org.apache.maven.plugin.resources.remote.RemoteResourcesMojoTest
[INFO] ..SUCCESS (3.3 s)
[INFO] Building: fail-ignore/pom.xml
Tests run: 10, Failures: 0, Errors: 0, Skipped: 0, Time elapsed: 0.926 sec

Results :

Tests run: 10, Failures: 0, Errors: 0, Skipped: 0

[INFO] 
[INFO] --- maven-jar-plugin:2.3.1:jar (default-jar) @ maven-remote-resources-plugin ---
[INFO] Building jar: /x1/jenkins/jenkins-slave/workspace/maven-plugins-ITs-m3/maven-remote-resources-plugin/target/maven-remote-resources-plugin-1.3-SNAPSHOT.jar
[INFO] 
[INFO] --- maven-plugin-plugin:2.7:addPluginArtifactMetadata (default-addPluginArtifactMetadata)
@ maven-remote-resources-plugin ---
[INFO] 
[INFO] --- maven-invoker-plugin:1.5:install (install-descriptor) @ maven-remote-resources-plugin
---
[INFO] Installing /x1/jenkins/jenkins-slave/workspace/maven-plugins-ITs-m3/maven-remote-resources-plugin/pom.xml
to /x1/jenkins/jenkins-slave/workspace/maven-plugins-ITs-m3/maven-remote-resources-plugin/target/it-repo/org/apache/maven/plugins/maven-remote-resources-plugin/1.3-SNAPSHOT/maven-remote-resources-plugin-1.3-SNAPSHOT.pom
[INFO] Installing /x1/jenkins/jenkins-slave/workspace/maven-plugins-ITs-m3/maven-remote-resources-plugin/target/maven-remote-resources-plugin-1.3-SNAPSHOT.jar
to /x1/jenkins/jenkins-slave/workspace/maven-plugins-ITs-m3/maven-remote-resources-plugin/target/it-repo/org/apache/maven/plugins/maven-remote-resources-plugin/1.3-SNAPSHOT/maven-remote-resources-plugin-1.3-SNAPSHOT.jar
[INFO] 
[INFO] --- maven-failsafe-plugin:2.9:integration-test (integration-tests) @ maven-remote-resources-plugin
---
[INFO] Failsafe report directory: /x1/jenkins/jenkins-slave/workspace/maven-plugins-ITs-m3/maven-remote-resources-plugin/target/failsafe-reports

-------------------------------------------------------
 T E S T S
-------------------------------------------------------
Running org.apache.maven.plugin.resources.remote.it.IT_CustomFilterDelimiter
[INFO] ..SUCCESS (3.2 s)
[INFO] Building: invocation-project/pom.xml
[INFO] ..SUCCESS (10.6 s)
[INFO] Building: MSITE-458/pom.xml
[INFO] ..SUCCESS (4.5 s)
[INFO] Building: script-class-loading/pom.xml
[INFO] ..SUCCESS (5.5 s)
[INFO] Building: pom-filtering/pom.xml
[INFO] ..SUCCESS (8.1 s)
[INFO] Building: no-version/pom.xml
[INFO] ..SUCCESS (3.2 s)
[INFO] Building: staging-reactor/pom.xml
[INFO] ..SUCCESS (4.2 s)
[INFO] Building: MSITE-627/pom.xml
[INFO] ..SUCCESS (3.3 s)
[INFO] Building: invoker-report/pom.xml
[INFO] ..SUCCESS (8.4 s)
[INFO] Building: MSITE-322/pom.xml
[INFO] ..SUCCESS (9.9 s)
[INFO] Building: local-repo-default/pom.xml
[INFO] ..SUCCESS (5.3 s)
[INFO] Building: validate/pom.xml
[INFO] ..SUCCESS (6.6 s)
[INFO] Building: install-extra-artifacts/pom.xml
[INFO] ..SUCCESS (3.7 s)
[INFO] Building: MSITE-312/pom.xml
[INFO] ..SUCCESS (3.5 s)
[INFO] Building: site-deploy/pom.xml
[INFO] ..SUCCESS (5.8 s)
[INFO] Building: staging-dependencies/pom.xml
[INFO] ..SUCCESS (3.5 s)
[INFO] Building: top-parent-different-site/pom.xml
[INFO] ..SUCCESS (4.9 s)
[INFO] Building: script-global-vars/pom.xml
[INFO] ..SUCCESS (4.0 s)
[INFO] Building: MSITE-550/pom.xml
[INFO] ..SUCCESS (2.5 s)
[INFO] Building: MSITE-507/pom.xml
[INFO] ..SUCCESS (5.2 s)
[INFO] Building: fail-postbuild/pom.xml
[INFO] ..SUCCESS (3.6 s)
[INFO] Building: selector-conditions/pom.xml
[INFO] ..SUCCESS (6.1 s)
[INFO] Building: script-classpath-duplicates/pom.xml
[INFO] ..SUCCESS (5.0 s)
[INFO] Building: pom-filtering-reactor/pom.xml
[INFO] ..SUCCESS (3.2 s)
[INFO] Building: fail-build/pom.xml
[INFO] ..SUCCESS (3.2 s)
[INFO] Building: local-repo-url/pom.xml
[INFO] ..SUCCESS (3.8 s)
[INFO] Building: fail-ignore-with-verify/pom.xml
[INFO] ..SUCCESS (3.3 s)
[INFO] Building: local-repo-isolated/pom.xml
[INFO] ..SUCCESS (4.1 s)
[INFO] -------------------------------------------------
[INFO] Build Summary:
[INFO]   Passed: 40, Failed: 0, Errors: 0, Skipped: 0
[INFO] -------------------------------------------------
[INFO] 
[INFO] --- maven-install-plugin:2.3.1:install (default-install) @ maven-invoker-plugin ---
[INFO] Installing /x1/jenkins/jenkins-slave/workspace/maven-plugins-ITs-m3/maven-invoker-plugin/target/maven-invoker-plugin-1.6-SNAPSHOT.jar
to /home/jenkins/.m2/repository/org/apache/maven/plugins/maven-invoker-plugin/1.6-SNAPSHOT/maven-invoker-plugin-1.6-SNAPSHOT.jar
[INFO] Installing /x1/jenkins/jenkins-slave/workspace/maven-plugins-ITs-m3/maven-invoker-plugin/pom.xml
to /home/jenkins/.m2/repository/org/apache/maven/plugins/maven-invoker-plugin/1.6-SNAPSHOT/maven-invoker-plugin-1.6-SNAPSHOT.pom
[INFO]                                                                         
[INFO] ------------------------------------------------------------------------
[INFO] Building Maven Plugins Aggregator 1-SNAPSHOT
[INFO] ------------------------------------------------------------------------
[WARNING] *****************************************************************
[WARNING] * Your build is requesting parallel execution, but project      *
[WARNING] * contains the following plugin(s) that are not marked as       *
[WARNING] * @threadSafe to support parallel building.                     *
[WARNING] * While this /may/ work fine, please look for plugin updates    *
[WARNING] * and/or request plugins be made thread-safe.                   *
[WARNING] * If reporting an issue, report it against the plugin in        *
[WARNING] * question, not against maven-core                              *
[WARNING] *****************************************************************
[WARNING] The following plugins are not marked @threadSafe in Maven Plugins Aggregator:
[WARNING] org.apache.maven.plugins:maven-remote-resources-plugin:1.1
[WARNING] *****************************************************************
[INFO] 
[INFO] --- maven-clean-plugin:2.4.1:clean (default-clean) @ maven-plugins-aggregator ---
[INFO] Deleting /x1/jenkins/jenkins-slave/workspace/maven-plugins-ITs-m3/target
[INFO] 
[INFO] --- maven-remote-resources-plugin:1.1:process (default) @ maven-plugins-aggregator
---
[INFO] 
[INFO] --- maven-install-plugin:2.3.1:install (default-install) @ maven-plugins-aggregator
---
[INFO] Installing /x1/jenkins/jenkins-slave/workspace/maven-plugins-ITs-m3/pom.xml to /home/jenkins/.m2/repository/org/apache/maven/plugins/maven-plugins-aggregator/1-SNAPSHOT/maven-plugins-aggregator-1-SNAPSHOT.pom
[INFO] ..SUCCESS (128.8 s)
[INFO] Building: MSITE-159/pom.xml
[INFO] ..SUCCESS (3.9 s)
[INFO] Building: site-jar/pom.xml
Tests run: 1, Failures: 0, Errors: 0, Skipped: 0, Time elapsed: 184.478 sec
Running org.apache.maven.plugin.resources.remote.it.IT_FilterLocalOverride
Tests run: 1, Failures: 0, Errors: 0, Skipped: 0, Time elapsed: 1.865 sec
Running org.apache.maven.plugin.resources.remote.it.IT_GenerateFromOverride
[INFO] ..SUCCESS (4.1 s)
[INFO] Building: inheritedMenus/pom.xml
Tests run: 1, Failures: 0, Errors: 0, Skipped: 0, Time elapsed: 1.926 sec
Running org.apache.maven.plugin.resources.remote.it.IT_GenerateFromBundleWithTypeAndClassifier
Tests run: 1, Failures: 0, Errors: 0, Skipped: 0, Time elapsed: 1.759 sec
Running org.apache.maven.plugin.resources.remote.it.IT_SupplementalArtifact
[INFO] ..SUCCESS (4.2 s)
[INFO] Building: MSITE-456/pom.xml
[INFO] ..SUCCESS (3.7 s)
[INFO] Building: site-inheritance/pom.xml
Tests run: 1, Failures: 0, Errors: 0, Skipped: 0, Time elapsed: 4.908 sec
Running org.apache.maven.plugin.resources.remote.it.IT_RunOnlyAtExecutionRoot
Tests run: 1, Failures: 0, Errors: 0, Skipped: 0, Time elapsed: 4.666 sec
Running org.apache.maven.plugin.resources.remote.it.IT_GetDependencyProjects
[INFO] ..SUCCESS (6.2 s)
[INFO] Building: MSITE-504/pom.xml
Tests run: 1, Failures: 0, Errors: 0, Skipped: 0, Time elapsed: 4.68 sec
Running org.apache.maven.plugin.resources.remote.it.IT_GenerateFromBundle
Tests run: 1, Failures: 0, Errors: 0, Skipped: 0, Time elapsed: 1.791 sec
Running org.apache.maven.plugin.resources.remote.it.IT_BadDependencyPoms
Tests run: 1, Failures: 0, Errors: 0, Skipped: 0, Time elapsed: 2.884 sec

Results :

Tests run: 9, Failures: 0, Errors: 0, Skipped: 0

[WARNING] File encoding has not been set, using platform encoding ANSI_X3.4-1968, i.e. build
is platform dependent!
[INFO] 
[INFO] --- maven-failsafe-plugin:2.9:verify (integration-tests) @ maven-remote-resources-plugin
---
[INFO] Failsafe report directory: /x1/jenkins/jenkins-slave/workspace/maven-plugins-ITs-m3/maven-remote-resources-plugin/target/failsafe-reports
[WARNING] File encoding has not been set, using platform encoding ANSI_X3.4-1968, i.e. build
is platform dependent!
[INFO] 
[INFO] --- maven-install-plugin:2.3.1:install (default-install) @ maven-remote-resources-plugin
---
[INFO] Installing /x1/jenkins/jenkins-slave/workspace/maven-plugins-ITs-m3/maven-remote-resources-plugin/target/maven-remote-resources-plugin-1.3-SNAPSHOT.jar
to /home/jenkins/.m2/repository/org/apache/maven/plugins/maven-remote-resources-plugin/1.3-SNAPSHOT/maven-remote-resources-plugin-1.3-SNAPSHOT.jar
[INFO] Installing /x1/jenkins/jenkins-slave/workspace/maven-plugins-ITs-m3/maven-remote-resources-plugin/pom.xml
to /home/jenkins/.m2/repository/org/apache/maven/plugins/maven-remote-resources-plugin/1.3-SNAPSHOT/maven-remote-resources-plugin-1.3-SNAPSHOT.pom
[INFO] ..SUCCESS (33.9 s)
[INFO] Building: MSITE-512/pom.xml
[INFO] ..SUCCESS (5.0 s)
[INFO] Building: top-parent-no-site/pom.xml
[INFO] ..SUCCESS (4.9 s)
[INFO] 
[INFO] --- maven-invoker-plugin:1.5:verify (integration-test) @ maven-site-plugin ---
[INFO] -------------------------------------------------
[INFO] Build Summary:
[INFO]   Passed: 39, Failed: 0, Errors: 0, Skipped: 1
[INFO] -------------------------------------------------
[INFO] 
[INFO] --- maven-install-plugin:2.3.1:install (default-install) @ maven-site-plugin ---
[INFO] Installing /x1/jenkins/jenkins-slave/workspace/maven-plugins-ITs-m3/maven-site-plugin/target/maven-site-plugin-3.1-SNAPSHOT.jar
to /home/jenkins/.m2/repository/org/apache/maven/plugins/maven-site-plugin/3.1-SNAPSHOT/maven-site-plugin-3.1-SNAPSHOT.jar
[INFO] Installing /x1/jenkins/jenkins-slave/workspace/maven-plugins-ITs-m3/maven-site-plugin/dependency-reduced-pom.xml
to /home/jenkins/.m2/repository/org/apache/maven/plugins/maven-site-plugin/3.1-SNAPSHOT/maven-site-plugin-3.1-SNAPSHOT.pom
[INFO] ------------------------------------------------------------------------
[INFO] Reactor Summary:
[INFO] 
[INFO] Maven Plugins ..................................... SUCCESS [22.698s]
[INFO] Maven ACR Plugin .................................. SUCCESS [43.968s]
[INFO] Maven Ant Plugin .................................. SUCCESS [1:37.263s]
[INFO] Maven AntRun Plugin ............................... SUCCESS [53.210s]
[INFO] Maven Eclipse Plugin .............................. SUCCESS [11:43.984s]
[INFO] Maven Assembly Plugin ............................. FAILURE [2.383s]
[INFO] Maven Changelog Plugin ............................ SUCCESS [31.312s]
[INFO] Maven Changes Report Plugin ....................... SUCCESS [58.595s]
[INFO] Maven Checkstyle Plugin ........................... SUCCESS [1:09.370s]
[INFO] Maven Clean Plugin ................................ SUCCESS [12.635s]
[INFO] Maven Compiler Plugin ............................. SUCCESS [18.739s]
[INFO] Maven Dependency Plugin ........................... SUCCESS [1:45.242s]
[INFO] Maven Deploy Plugin ............................... SUCCESS [1:37.741s]
[INFO] Maven DOAP Plugin ................................. SUCCESS [15.612s]
[INFO] Maven Documentation Checker Plugin ................ SUCCESS [6.215s]
[INFO] Maven EAR Plugin .................................. SUCCESS [3:33.922s]
[INFO] Maven EJB Plugin .................................. SUCCESS [21.903s]
[INFO] Maven GPG Plugin .................................. SUCCESS [31.956s]
[INFO] Maven Help Plugin ................................. SUCCESS [34.325s]
[INFO] Maven IDEA Plugin ................................. SUCCESS [5.933s]
[INFO] Maven Install Plugin .............................. SUCCESS [31.223s]
[INFO] Maven JAR Plugin .................................. FAILURE [0.377s]
[INFO] Maven Jarsigner Plugin ............................ SUCCESS [21.030s]
[INFO] Maven Javadoc Plugin .............................. SUCCESS [8:19.995s]
[INFO] Maven Linkcheck Plugin ............................ SUCCESS [1.311s]
[INFO] Maven One Plugin .................................. SUCCESS [3.089s]
[INFO] Maven Patch Plugin ................................ SUCCESS [10.152s]
[INFO] Maven PDF Plugin .................................. FAILURE [3:19.032s]
[INFO] Maven PMD Plugin .................................. SUCCESS [19.908s]
[INFO] Maven RAR Plugin .................................. SUCCESS [4.888s]
[INFO] Maven Reactor Plugin .............................. SUCCESS [1.846s]
[INFO] Maven Repository Plugin ........................... SUCCESS [3:10.693s]
[INFO] Maven Resources Plugin ............................ SUCCESS [40.114s]
[INFO] Maven Shade Plugin ................................ SUCCESS [1:35.535s]
[INFO] Maven Site Plugin 3 ............................... SUCCESS [7:12.291s]
[INFO] Maven Source Plugin ............................... SUCCESS [24.448s]
[INFO] Maven Stage Plugin ................................ SUCCESS [1.289s]
[INFO] Maven Toolchains Plugin ........................... SUCCESS [0.949s]
[INFO] Maven Verifier Plugin ............................. SUCCESS [6.887s]
[INFO] Maven WAR Plugin .................................. FAILURE [0.141s]
[INFO] Maven Invoker Plugin .............................. SUCCESS [3:19.237s]
[INFO] Maven Project Info Reports Plugin ................. SUCCESS [1:46.090s]
[INFO] Maven Remote Resources Plugin ..................... SUCCESS [3:33.744s]
[INFO] Maven Plugins Aggregator .......................... SUCCESS [0.053s]
[INFO] ------------------------------------------------------------------------
[INFO] BUILD FAILURE
[INFO] ------------------------------------------------------------------------
[INFO] Total time: 22:00.762s (Wall Clock)
[INFO] Finished at: Wed Jan 25 21:26:53 GMT 2012
[INFO] Final Memory: 62M/983M
[INFO] ------------------------------------------------------------------------
[WARNING] The requested profile "apache.snapshots" could not be activated because it does
not exist.
[ERROR] Failed to execute goal on project maven-assembly-plugin: Could not resolve dependencies
for project org.apache.maven.plugins:maven-assembly-plugin:maven-plugin:2.4-SNAPSHOT: Could
not find artifact org.apache.maven:maven-archiver:jar:2.5 in central (http://repo1.maven.org/maven2)
-> [Help 1]
[ERROR] Failed to execute goal on project maven-jar-plugin: Could not resolve dependencies
for project org.apache.maven.plugins:maven-jar-plugin:maven-plugin:2.5-SNAPSHOT: Could not
find artifact org.apache.maven:maven-archiver:jar:2.5 in central (http://repo1.maven.org/maven2)
-> [Help 1]
[ERROR] Failed to execute goal org.apache.maven.plugins:maven-invoker-plugin:1.5:run (integration-test)
on project maven-pdf-plugin: 1 build failed. -> [Help 2]
[ERROR] Failed to execute goal on project maven-war-plugin: Could not resolve dependencies
for project org.apache.maven.plugins:maven-war-plugin:maven-plugin:2.3-SNAPSHOT: Could not
find artifact org.apache.maven:maven-archiver:jar:2.5 in central (http://repo1.maven.org/maven2)
-> [Help 1]
[ERROR] 
[ERROR] To see the full stack trace of the errors, re-run Maven with the -e switch.
[ERROR] Re-run Maven using the -X switch to enable full debug logging.
[ERROR] 
[ERROR] For more information about the errors and possible solutions, please read the following
articles:
[ERROR] [Help 1] http://cwiki.apache.org/confluence/display/MAVEN/DependencyResolutionException
[ERROR] [Help 2] http://cwiki.apache.org/confluence/display/MAVEN/MojoFailureException
[ERROR] 
[ERROR] After correcting the problems, you can resume the build with the command
[ERROR]   mvn <goals> -rf :maven-assembly-plugin
Build step 'Invoke top-level Maven targets' marked build as failure


Mime
View raw message