maven-notifications mailing list archives

Site index · List index
Message view « Date » · « Thread »
Top « Date » · « Thread »
From Apache Jenkins Server <jenk...@builds.apache.org>
Subject Build failed in Jenkins: maven-plugins #595
Date Tue, 24 Jan 2012 23:33:15 GMT
See <https://builds.apache.org/job/maven-plugins/595/changes>

Changes:

[krosenvold] [maven-release-plugin] prepare for next development iteration

[krosenvold] [maven-release-plugin] prepare release maven-assembly-plugin-2.3

[krosenvold] o Updated deps

[krosenvold] [maven-release-plugin] prepare for next development iteration

[krosenvold] [maven-release-plugin] prepare release maven-war-plugin-2.2

[krosenvold] Revert "[maven-release-plugin] prepare release maven-war-plugin-2.1.2"

This reverts commit 3dad71640ca70ba8841b148c4dc5066548a67214.

[krosenvold] [maven-release-plugin] prepare release maven-war-plugin-2.1.2

[krosenvold] o Upped all versions for release

[krosenvold] [maven-release-plugin] prepare for next development iteration

[krosenvold] [maven-release-plugin] prepare release maven-jar-plugin-2.4

[krosenvold] o Removed mjar-96 project that was committed in error

[krosenvold] [MJAR-69] FIxed by upgrading deps

[krosenvold] [MJAR-139] New option to avoid empty jar creation

Patch by Mark Rekveld, IT by me

------------------------------------------
[...truncated 5830 lines...]
Running org.apache.maven.report.projectinfo.DependencyConvergenceReportTest
Tests run: 1, Failures: 0, Errors: 0, Skipped: 0, Time elapsed: 0.207 sec
Running org.apache.maven.report.projectinfo.LicenseReportTest
Tests run: 2, Failures: 0, Errors: 0, Skipped: 0, Time elapsed: 0.664 sec
Running org.apache.maven.report.projectinfo.MailingListsReportTest
Tests run: 3, Failures: 0, Errors: 0, Skipped: 0, Time elapsed: 0.663 sec
Running org.apache.maven.report.projectinfo.DependencyManagementReportTest
[INFO] artifact junit:junit: checking for updates from central
Tests run: 1, Failures: 0, Errors: 0, Skipped: 0, Time elapsed: 1.074 sec
Running org.apache.maven.report.projectinfo.ProjectSummaryReportTest
Tests run: 1, Failures: 0, Errors: 0, Skipped: 0, Time elapsed: 0.153 sec
Running org.apache.maven.report.projectinfo.ProjectInfoReportUtilsTest
2012-01-24 23:32:48.315::INFO:  Logging to STDERR via org.mortbay.log.StdErrLog
2012-01-24 23:32:48.365::INFO:  jetty-6.1.5
2012-01-24 23:32:48.532::INFO:  NO JSP Support for /, did not find org.apache.jasper.servlet.JspServlet
2012-01-24 23:32:48.566:/:INFO:  default: init
2012-01-24 23:32:48.568:/:INFO:  jsp: init
2012-01-24 23:32:48.580::INFO:  Started SelectChannelConnector@0.0.0.0:52400
2012-01-24 23:32:48.640:/:INFO:  jsp: destroy
2012-01-24 23:32:48.640:/:INFO:  default: destroy
2012-01-24 23:32:48.747::INFO:  jetty-6.1.5
2012-01-24 23:32:48.768::INFO:  NO JSP Support for /, did not find org.apache.jasper.servlet.JspServlet
2012-01-24 23:32:48.773:/:INFO:  default: init
2012-01-24 23:32:48.773:/:INFO:  jsp: init
2012-01-24 23:32:48.773::INFO:  Started SelectChannelConnector@0.0.0.0:59811
2012-01-24 23:32:48.792:/:INFO:  jsp: destroy
2012-01-24 23:32:48.792:/:INFO:  default: destroy
2012-01-24 23:32:48.900::INFO:  jetty-6.1.5
2012-01-24 23:32:48.916::INFO:  NO JSP Support for /, did not find org.apache.jasper.servlet.JspServlet
2012-01-24 23:32:48.920:/:INFO:  default: init
2012-01-24 23:32:48.920:/:INFO:  jsp: init
2012-01-24 23:32:48.121::INFO:  Started SslSocketConnector@0.0.0.0:59082
2012-01-24 23:32:48.215:/:INFO:  jsp: destroy
2012-01-24 23:32:48.215:/:INFO:  default: destroy
2012-01-24 23:32:49.317::INFO:  jetty-6.1.5
2012-01-24 23:32:49.330::INFO:  NO JSP Support for /, did not find org.apache.jasper.servlet.JspServlet
2012-01-24 23:32:49.334:/:INFO:  default: init
2012-01-24 23:32:49.335:/:INFO:  jsp: init
2012-01-24 23:32:49.336::INFO:  Started SslSocketConnector@0.0.0.0:49656
2012-01-24 23:32:49.350:/:INFO:  jsp: destroy
2012-01-24 23:32:49.350:/:INFO:  default: destroy
Tests run: 1, Failures: 0, Errors: 0, Skipped: 0, Time elapsed: 1.222 sec
Running org.apache.maven.report.projectinfo.PluginManagementReportTest
Tests run: 1, Failures: 0, Errors: 0, Skipped: 0, Time elapsed: 0.161 sec
Running org.apache.maven.report.projectinfo.DependenciesReportTest
[INFO] snapshot org.apache.maven.plugin.projectinfo.tests:dependencies:1.0-SNAPSHOT: checking
for updates from central
[INFO] Unable to find resource 'org.apache.maven.plugin.projectinfo.tests:dependencies:pom:1.0-SNAPSHOT'
in repository central (http://repo1.maven.org/maven2)
Tests run: 1, Failures: 0, Errors: 0, Skipped: 0, Time elapsed: 0.523 sec
Running org.apache.maven.report.projectinfo.ModulesReportTest
Tests run: 1, Failures: 0, Errors: 0, Skipped: 0, Time elapsed: 1.089 sec
Running org.apache.maven.report.projectinfo.CimReportTest
Tests run: 1, Failures: 0, Errors: 0, Skipped: 0, Time elapsed: 0.125 sec
2012-01-24 23:32:51.260::INFO:  Shutdown hook executing
2012-01-24 23:32:51.260::INFO:  Shutdown hook complete
2012-01-24 23:32:52.260::INFO:  Shutdown hook complete
2012-01-24 23:32:53.261::INFO:  Shutdown hook complete
2012-01-24 23:32:54.165::INFO:  Shutdown hook complete

Results :

Tests run: 18, Failures: 0, Errors: 0, Skipped: 0

[JENKINS] Recording test results
[INFO] 
[INFO] --- maven-jar-plugin:2.3.1:jar (default-jar) @ maven-project-info-reports-plugin ---
[INFO] Building jar: <https://builds.apache.org/job/maven-plugins/ws/maven-project-info-reports-plugin/target/maven-project-info-reports-plugin-2.4.1-SNAPSHOT.jar>
[INFO] 
[INFO] --- maven-plugin-plugin:2.8:addPluginArtifactMetadata (default-addPluginArtifactMetadata)
@ maven-project-info-reports-plugin ---
[INFO] 
[INFO] --- maven-jarsigner-plugin:1.2:sign (sign) @ maven-project-info-reports-plugin ---
[INFO] 1 archive(s) processed
[INFO] 
[INFO] --- maven-jarsigner-plugin:1.2:verify (verify) @ maven-project-info-reports-plugin
---
[INFO] 1 archive(s) processed
[INFO] [INFO] Installing <https://builds.apache.org/job/maven-plugins/ws/maven-project-info-reports-plugin/target/maven-project-info-reports-plugin-2.4.1-SNAPSHOT.jar>
to /home/hudson/.m2/repository/org/apache/maven/plugins/maven-project-info-reports-plugin/2.4.1-SNAPSHOT/maven-project-info-reports-plugin-2.4.1-SNAPSHOT.jar

[INFO] --- maven-install-plugin:2.3.1:install (default-install) @ maven-project-info-reports-plugin
---
[INFO] Installing <https://builds.apache.org/job/maven-plugins/ws/maven-project-info-reports-plugin/pom.xml>
to /home/hudson/.m2/repository/org/apache/maven/plugins/maven-project-info-reports-plugin/2.4.1-SNAPSHOT/maven-project-info-reports-plugin-2.4.1-SNAPSHOT.pom
[JENKINS] Archiving <https://builds.apache.org/job/maven-plugins/ws/maven-project-info-reports-plugin/pom.xml>
to /home/hudson/hudson/jobs/maven-plugins/modules/org.apache.maven.plugins$maven-project-info-reports-plugin/builds/2012-01-24_23-13-16/archive/org.apache.maven.plugins/maven-project-info-reports-plugin/2.4.1-SNAPSHOT/maven-project-info-reports-plugin-2.4.1-SNAPSHOT.pom
[JENKINS] Archiving <https://builds.apache.org/job/maven-plugins/ws/maven-project-info-reports-plugin/target/maven-project-info-reports-plugin-2.4.1-SNAPSHOT.jar>
to /home/hudson/hudson/jobs/maven-plugins/modules/org.apache.maven.plugins$maven-project-info-reports-plugin/builds/2012-01-24_23-13-16/archive/org.apache.maven.plugins/maven-project-info-reports-plugin/2.4.1-SNAPSHOT/maven-project-info-reports-plugin-2.4.1-SNAPSHOT.jar
[INFO] ------------------------------------------------------------------------
[INFO] Reactor Summary:
[INFO] 
[INFO] Maven Plugins ..................................... SUCCESS [4:26.621s]
[INFO] Maven ACR Plugin .................................. SUCCESS [5:06.789s]
[INFO] Maven Ant Plugin .................................. SUCCESS [6:57.075s]
[INFO] Maven AntRun Plugin ............................... SUCCESS [39.261s]
[INFO] Maven Eclipse Plugin .............................. SUCCESS [1:36.928s]
[INFO] Maven Assembly Plugin ............................. FAILURE [0.614s]
[INFO] Maven Changelog Plugin ............................ SUCCESS [1:03.966s]
[INFO] Maven Changes Report Plugin ....................... SUCCESS [1:01.797s]
[INFO] Maven Checkstyle Plugin ........................... SUCCESS [55.326s]
[INFO] Maven Clean Plugin ................................ SUCCESS [15.987s]
[INFO] Maven Compiler Plugin ............................. SUCCESS [58.175s]
[INFO] Maven Dependency Plugin ........................... SUCCESS [2:19.025s]
[INFO] Maven Deploy Plugin ............................... SUCCESS [1:02.816s]
[INFO] Maven DOAP Plugin ................................. SUCCESS [43.444s]
[INFO] Maven Documentation Checker Plugin ................ SUCCESS [10.032s]
[INFO] Maven EAR Plugin .................................. SUCCESS [46.041s]
[INFO] Maven EJB Plugin .................................. SUCCESS [46.275s]
[INFO] Maven GPG Plugin .................................. SUCCESS [1:07.864s]
[INFO] Maven Help Plugin ................................. SUCCESS [1:01.316s]
[INFO] Maven IDEA Plugin ................................. SUCCESS [1:01.010s]
[INFO] Maven Install Plugin .............................. SUCCESS [19.534s]
[INFO] Maven JAR Plugin .................................. FAILURE [0.286s]
[INFO] Maven Jarsigner Plugin ............................ SUCCESS [10.944s]
[INFO] Maven Javadoc Plugin .............................. SUCCESS [4:37.021s]
[INFO] Maven Linkcheck Plugin ............................ SUCCESS [9.360s]
[INFO] Maven One Plugin .................................. SUCCESS [15.867s]
[INFO] Maven Patch Plugin ................................ SUCCESS [38.193s]
[INFO] Maven PDF Plugin .................................. SUCCESS [40.017s]
[INFO] Maven PMD Plugin .................................. SUCCESS [43.944s]
[INFO] Maven RAR Plugin .................................. SUCCESS [34.405s]
[INFO] Maven Reactor Plugin .............................. SUCCESS [27.932s]
[INFO] Maven Repository Plugin ........................... SUCCESS [34.333s]
[INFO] Maven Resources Plugin ............................ SUCCESS [34.329s]
[INFO] Maven Shade Plugin ................................ SUCCESS [40.095s]
[INFO] Maven Site Plugin 3 ............................... SUCCESS [1:18.539s]
[INFO] Maven Source Plugin ............................... SUCCESS [39.029s]
[INFO] Maven Stage Plugin ................................ SUCCESS [4.816s]
[INFO] Maven Toolchains Plugin ........................... SUCCESS [3.297s]
[INFO] Maven Verifier Plugin ............................. SUCCESS [16.275s]
[INFO] Maven WAR Plugin .................................. FAILURE [5.952s]
[INFO] Maven Invoker Plugin .............................. SUCCESS [13.635s]
[INFO] Maven Project Info Reports Plugin ................. SUCCESS [30.984s]
[INFO] Maven Remote Resources Plugin ..................... SUCCESS [8.567s]
[INFO] Maven Plugins Aggregator .......................... SUCCESS [0.464s]
[INFO] ------------------------------------------------------------------------
[INFO] BUILD FAILURE
[INFO] ------------------------------------------------------------------------
[INFO] Total time: 18:43.564s (Wall Clock)
[INFO] Finished at: Tue Jan 24 23:33:06 UTC 2012
[INFO] Final Memory: 78M/653M
[INFO] ------------------------------------------------------------------------
Waiting for Jenkins to finish collecting data
mavenExecutionResult exceptions not empty
message : Failed to execute goal on project maven-assembly-plugin: Could not resolve dependencies
for project org.apache.maven.plugins:maven-assembly-plugin:maven-plugin:2.4-SNAPSHOT: Could
not find artifact org.apache.maven:maven-archiver:jar:2.5 in central (http://repo.maven.apache.org/maven2)
cause : Could not resolve dependencies for project org.apache.maven.plugins:maven-assembly-plugin:maven-plugin:2.4-SNAPSHOT:
Could not find artifact org.apache.maven:maven-archiver:jar:2.5 in central (http://repo.maven.apache.org/maven2)
Stack trace : 
org.apache.maven.lifecycle.LifecycleExecutionException: Failed to execute goal on project
maven-assembly-plugin: Could not resolve dependencies for project org.apache.maven.plugins:maven-assembly-plugin:maven-plugin:2.4-SNAPSHOT:
Could not find artifact org.apache.maven:maven-archiver:jar:2.5 in central (http://repo.maven.apache.org/maven2)
	at org.apache.maven.lifecycle.internal.LifecycleDependencyResolver.getDependencies(LifecycleDependencyResolver.java:210)
	at org.apache.maven.lifecycle.internal.LifecycleDependencyResolver.resolveProjectDependencies(LifecycleDependencyResolver.java:117)
	at org.apache.maven.lifecycle.internal.MojoExecutor.ensureDependenciesAreResolved(MojoExecutor.java:258)
	at org.apache.maven.lifecycle.internal.MojoExecutor.execute(MojoExecutor.java:201)
	at org.apache.maven.lifecycle.internal.MojoExecutor.execute(MojoExecutor.java:153)
	at org.apache.maven.lifecycle.internal.MojoExecutor.execute(MojoExecutor.java:145)
	at org.apache.maven.lifecycle.internal.LifecycleModuleBuilder.buildProject(LifecycleModuleBuilder.java:84)
	at org.apache.maven.lifecycle.internal.LifecycleThreadedBuilder$1.call(LifecycleThreadedBuilder.java:167)
	at org.apache.maven.lifecycle.internal.LifecycleThreadedBuilder$1.call(LifecycleThreadedBuilder.java:163)
	at java.util.concurrent.FutureTask$Sync.innerRun(FutureTask.java:269)
	at java.util.concurrent.FutureTask.run(FutureTask.java:123)
	at java.util.concurrent.ThreadPoolExecutor$Worker.runTask(ThreadPoolExecutor.java:651)
	at java.util.concurrent.ThreadPoolExecutor$Worker.run(ThreadPoolExecutor.java:676)
	at java.lang.Thread.run(Thread.java:595)
Caused by: org.apache.maven.project.DependencyResolutionException: Could not resolve dependencies
for project org.apache.maven.plugins:maven-assembly-plugin:maven-plugin:2.4-SNAPSHOT: Could
not find artifact org.apache.maven:maven-archiver:jar:2.5 in central (http://repo.maven.apache.org/maven2)
	at org.apache.maven.project.DefaultProjectDependenciesResolver.resolve(DefaultProjectDependenciesResolver.java:189)
	at org.apache.maven.lifecycle.internal.LifecycleDependencyResolver.getDependencies(LifecycleDependencyResolver.java:185)
	... 13 more
Caused by: org.sonatype.aether.resolution.DependencyResolutionException: Could not find artifact
org.apache.maven:maven-archiver:jar:2.5 in central (http://repo.maven.apache.org/maven2)
	at org.sonatype.aether.impl.internal.DefaultRepositorySystem.resolveDependencies(DefaultRepositorySystem.java:375)
	at org.apache.maven.project.DefaultProjectDependenciesResolver.resolve(DefaultProjectDependenciesResolver.java:183)
	... 14 more
Caused by: org.sonatype.aether.resolution.ArtifactResolutionException: Could not find artifact
org.apache.maven:maven-archiver:jar:2.5 in central (http://repo.maven.apache.org/maven2)
	at org.sonatype.aether.impl.internal.DefaultArtifactResolver.resolve(DefaultArtifactResolver.java:538)
	at org.sonatype.aether.impl.internal.DefaultArtifactResolver.resolveArtifacts(DefaultArtifactResolver.java:216)
	at org.sonatype.aether.impl.internal.DefaultRepositorySystem.resolveDependencies(DefaultRepositorySystem.java:358)
	... 15 more
Caused by: org.sonatype.aether.transfer.ArtifactNotFoundException: Could not find artifact
org.apache.maven:maven-archiver:jar:2.5 in central (http://repo.maven.apache.org/maven2)
	at org.sonatype.aether.connector.wagon.WagonRepositoryConnector$4.wrap(WagonRepositoryConnector.java:947)
	at org.sonatype.aether.connector.wagon.WagonRepositoryConnector$4.wrap(WagonRepositoryConnector.java:941)
	at org.sonatype.aether.connector.wagon.WagonRepositoryConnector$GetTask.run(WagonRepositoryConnector.java:669)
	at org.sonatype.aether.util.concurrency.RunnableErrorForwarder$1.run(RunnableErrorForwarder.java:60)
	... 3 more
message : Failed to execute goal on project maven-jar-plugin: Could not resolve dependencies
for project org.apache.maven.plugins:maven-jar-plugin:maven-plugin:2.5-SNAPSHOT: Could not
find artifact org.apache.maven:maven-archiver:jar:2.5 in central (http://repo.maven.apache.org/maven2)
cause : Could not resolve dependencies for project org.apache.maven.plugins:maven-jar-plugin:maven-plugin:2.5-SNAPSHOT:
Could not find artifact org.apache.maven:maven-archiver:jar:2.5 in central (http://repo.maven.apache.org/maven2)
Stack trace : 
org.apache.maven.lifecycle.LifecycleExecutionException: Failed to execute goal on project
maven-jar-plugin: Could not resolve dependencies for project org.apache.maven.plugins:maven-jar-plugin:maven-plugin:2.5-SNAPSHOT:
Could not find artifact org.apache.maven:maven-archiver:jar:2.5 in central (http://repo.maven.apache.org/maven2)
	at org.apache.maven.lifecycle.internal.LifecycleDependencyResolver.getDependencies(LifecycleDependencyResolver.java:210)
	at org.apache.maven.lifecycle.internal.LifecycleDependencyResolver.resolveProjectDependencies(LifecycleDependencyResolver.java:117)
	at org.apache.maven.lifecycle.internal.MojoExecutor.ensureDependenciesAreResolved(MojoExecutor.java:258)
	at org.apache.maven.lifecycle.internal.MojoExecutor.execute(MojoExecutor.java:201)
	at org.apache.maven.lifecycle.internal.MojoExecutor.execute(MojoExecutor.java:153)
	at org.apache.maven.lifecycle.internal.MojoExecutor.execute(MojoExecutor.java:145)
	at org.apache.maven.lifecycle.internal.LifecycleModuleBuilder.buildProject(LifecycleModuleBuilder.java:84)
	at org.apache.maven.lifecycle.internal.LifecycleThreadedBuilder$1.call(LifecycleThreadedBuilder.java:167)
	at org.apache.maven.lifecycle.internal.LifecycleThreadedBuilder$1.call(LifecycleThreadedBuilder.java:163)
	at java.util.concurrent.FutureTask$Sync.innerRun(FutureTask.java:269)
	at java.util.concurrent.FutureTask.run(FutureTask.java:123)
	at java.util.concurrent.ThreadPoolExecutor$Worker.runTask(ThreadPoolExecutor.java:651)
	at java.util.concurrent.ThreadPoolExecutor$Worker.run(ThreadPoolExecutor.java:676)
	at java.lang.Thread.run(Thread.java:595)
Caused by: org.apache.maven.project.DependencyResolutionException: Could not resolve dependencies
for project org.apache.maven.plugins:maven-jar-plugin:maven-plugin:2.5-SNAPSHOT: Could not
find artifact org.apache.maven:maven-archiver:jar:2.5 in central (http://repo.maven.apache.org/maven2)
	at org.apache.maven.project.DefaultProjectDependenciesResolver.resolve(DefaultProjectDependenciesResolver.java:189)
	at org.apache.maven.lifecycle.internal.LifecycleDependencyResolver.getDependencies(LifecycleDependencyResolver.java:185)
	... 13 more
Caused by: org.sonatype.aether.resolution.DependencyResolutionException: Could not find artifact
org.apache.maven:maven-archiver:jar:2.5 in central (http://repo.maven.apache.org/maven2)
	at org.sonatype.aether.impl.internal.DefaultRepositorySystem.resolveDependencies(DefaultRepositorySystem.java:375)
	at org.apache.maven.project.DefaultProjectDependenciesResolver.resolve(DefaultProjectDependenciesResolver.java:183)
	... 14 more
Caused by: org.sonatype.aether.resolution.ArtifactResolutionException: Could not find artifact
org.apache.maven:maven-archiver:jar:2.5 in central (http://repo.maven.apache.org/maven2)
	at org.sonatype.aether.impl.internal.DefaultArtifactResolver.resolve(DefaultArtifactResolver.java:538)
	at org.sonatype.aether.impl.internal.DefaultArtifactResolver.resolveArtifacts(DefaultArtifactResolver.java:216)
	at org.sonatype.aether.impl.internal.DefaultRepositorySystem.resolveDependencies(DefaultRepositorySystem.java:358)
	... 15 more
Caused by: org.sonatype.aether.transfer.ArtifactNotFoundException: Could not find artifact
org.apache.maven:maven-archiver:jar:2.5 in central (http://repo.maven.apache.org/maven2)
	at org.sonatype.aether.connector.wagon.WagonRepositoryConnector$4.wrap(WagonRepositoryConnector.java:947)
	at org.sonatype.aether.connector.wagon.WagonRepositoryConnector$4.wrap(WagonRepositoryConnector.java:941)
	at org.sonatype.aether.connector.wagon.WagonRepositoryConnector$GetTask.run(WagonRepositoryConnector.java:669)
	at org.sonatype.aether.util.concurrency.RunnableErrorForwarder$1.run(RunnableErrorForwarder.java:60)
	... 3 more
message : Failed to execute goal on project maven-war-plugin: Could not resolve dependencies
for project org.apache.maven.plugins:maven-war-plugin:maven-plugin:2.3-SNAPSHOT: Could not
find artifact org.apache.maven:maven-archiver:jar:2.5 in central (http://repo.maven.apache.org/maven2)
cause : Could not resolve dependencies for project org.apache.maven.plugins:maven-war-plugin:maven-plugin:2.3-SNAPSHOT:
Could not find artifact org.apache.maven:maven-archiver:jar:2.5 in central (http://repo.maven.apache.org/maven2)
Stack trace : 
org.apache.maven.lifecycle.LifecycleExecutionException: Failed to execute goal on project
maven-war-plugin: Could not resolve dependencies for project org.apache.maven.plugins:maven-war-plugin:maven-plugin:2.3-SNAPSHOT:
Could not find artifact org.apache.maven:maven-archiver:jar:2.5 in central (http://repo.maven.apache.org/maven2)
	at org.apache.maven.lifecycle.internal.LifecycleDependencyResolver.getDependencies(LifecycleDependencyResolver.java:210)
	at org.apache.maven.lifecycle.internal.LifecycleDependencyResolver.resolveProjectDependencies(LifecycleDependencyResolver.java:117)
	at org.apache.maven.lifecycle.internal.MojoExecutor.ensureDependenciesAreResolved(MojoExecutor.java:258)
	at org.apache.maven.lifecycle.internal.MojoExecutor.execute(MojoExecutor.java:201)
	at org.apache.maven.lifecycle.internal.MojoExecutor.execute(MojoExecutor.java:153)
	at org.apache.maven.lifecycle.internal.MojoExecutor.execute(MojoExecutor.java:145)
	at org.apache.maven.lifecycle.internal.LifecycleModuleBuilder.buildProject(LifecycleModuleBuilder.java:84)
	at org.apache.maven.lifecycle.internal.LifecycleThreadedBuilder$1.call(LifecycleThreadedBuilder.java:167)
	at org.apache.maven.lifecycle.internal.LifecycleThreadedBuilder$1.call(LifecycleThreadedBuilder.java:163)
	at java.util.concurrent.FutureTask$Sync.innerRun(FutureTask.java:269)
	at java.util.concurrent.FutureTask.run(FutureTask.java:123)
	at java.util.concurrent.ThreadPoolExecutor$Worker.runTask(ThreadPoolExecutor.java:651)
	at java.util.concurrent.ThreadPoolExecutor$Worker.run(ThreadPoolExecutor.java:676)
	at java.lang.Thread.run(Thread.java:595)
Caused by: org.apache.maven.project.DependencyResolutionException: Could not resolve dependencies
for project org.apache.maven.plugins:maven-war-plugin:maven-plugin:2.3-SNAPSHOT: Could not
find artifact org.apache.maven:maven-archiver:jar:2.5 in central (http://repo.maven.apache.org/maven2)
	at org.apache.maven.project.DefaultProjectDependenciesResolver.resolve(DefaultProjectDependenciesResolver.java:189)
	at org.apache.maven.lifecycle.internal.LifecycleDependencyResolver.getDependencies(LifecycleDependencyResolver.java:185)
	... 13 more
Caused by: org.sonatype.aether.resolution.DependencyResolutionException: Could not find artifact
org.apache.maven:maven-archiver:jar:2.5 in central (http://repo.maven.apache.org/maven2)
	at org.sonatype.aether.impl.internal.DefaultRepositorySystem.resolveDependencies(DefaultRepositorySystem.java:375)
	at org.apache.maven.project.DefaultProjectDependenciesResolver.resolve(DefaultProjectDependenciesResolver.java:183)
	... 14 more
Caused by: org.sonatype.aether.resolution.ArtifactResolutionException: Could not find artifact
org.apache.maven:maven-archiver:jar:2.5 in central (http://repo.maven.apache.org/maven2)
	at org.sonatype.aether.impl.internal.DefaultArtifactResolver.resolve(DefaultArtifactResolver.java:538)
	at org.sonatype.aether.impl.internal.DefaultArtifactResolver.resolveArtifacts(DefaultArtifactResolver.java:216)
	at org.sonatype.aether.impl.internal.DefaultRepositorySystem.resolveDependencies(DefaultRepositorySystem.java:358)
	... 15 more
Caused by: org.sonatype.aether.transfer.ArtifactNotFoundException: Could not find artifact
org.apache.maven:maven-archiver:jar:2.5 in central (http://repo.maven.apache.org/maven2)
	at org.sonatype.aether.connector.wagon.WagonRepositoryConnector$4.wrap(WagonRepositoryConnector.java:947)
	at org.sonatype.aether.connector.wagon.WagonRepositoryConnector$4.wrap(WagonRepositoryConnector.java:941)
	at org.sonatype.aether.connector.wagon.WagonRepositoryConnector$GetTask.run(WagonRepositoryConnector.java:669)
	at org.sonatype.aether.util.concurrency.RunnableErrorForwarder$1.run(RunnableErrorForwarder.java:60)
	... 3 more
Sending e-mails to: notifications@maven.apache.org
channel stopped


Mime
View raw message