maven-notifications mailing list archives

Site index · List index
Message view « Date » · « Thread »
Top « Date » · « Thread »
From Apache Jenkins Server <jenk...@builds.apache.org>
Subject Build failed in Jenkins: maven-plugins-ITs-m3 #335
Date Fri, 13 Jan 2012 23:45:25 GMT
See <https://builds.apache.org/job/maven-plugins-ITs-m3/335/changes>

Changes:

[hboutemy] renamed preBuildHookScript according to configuration done in parent pom

[hboutemy] updated verification script to better show which file is missing

[hboutemy] removed configuration inherited from parent pom

[hboutemy] clone IT projects to target/it instead of ${java.io.tmpdir}

------------------------------------------
[...truncated 9654 lines...]
[INFO] Using 'UTF-8' encoding to read mojo metadata.
[INFO] Applying mojo extractor for language: java
[INFO] Mojo extractor for language: java found 3 mojo descriptors.
[INFO] Applying mojo extractor for language: bsh
[INFO] Mojo extractor for language: bsh found 0 mojo descriptors.
[INFO] 
[INFO] --- maven-remote-resources-plugin:1.1:process (default) @ maven-remote-resources-plugin
---
[INFO] 
[INFO] --- maven-resources-plugin:2.4.3:resources (default-resources) @ maven-remote-resources-plugin
---
[INFO] Using 'UTF-8' encoding to copy filtered resources.
[INFO] Copying 1 resource
[INFO] Copying 3 resources
[INFO] 
[INFO] --- maven-compiler-plugin:2.3.2:compile (default-compile) @ maven-remote-resources-plugin
---
[INFO] Compiling 11 source files to <https://builds.apache.org/job/maven-plugins-ITs-m3/ws/maven-remote-resources-plugin/target/classes>
[INFO] 
[INFO] --- maven-resources-plugin:2.4.3:testResources (default-testResources) @ maven-remote-resources-plugin
---
[INFO] Using 'UTF-8' encoding to copy filtered resources.
[INFO] Copying 7 resources
[INFO] ..SUCCESS (4.6 s)
[INFO] Building: install-extra-artifacts/pom.xml
[INFO] Copying 46 resources
[INFO] Copying 1 resource
[INFO] Copying 3 resources
[INFO] 
[INFO] --- maven-compiler-plugin:2.3.2:testCompile (default-testCompile) @ maven-remote-resources-plugin
---
[INFO] Compiling 18 source files to <https://builds.apache.org/job/maven-plugins-ITs-m3/ws/maven-remote-resources-plugin/target/test-classes>
[INFO] 
[INFO] --- maven-surefire-plugin:2.7.2:test (default-test) @ maven-remote-resources-plugin
---
[INFO] Surefire report directory: <https://builds.apache.org/job/maven-plugins-ITs-m3/ws/maven-remote-resources-plugin/target/surefire-reports>

-------------------------------------------------------
 T E S T S
-------------------------------------------------------
Running org.apache.maven.plugin.resources.remote.RemoteResourcesMojoTest
Tests run: 10, Failures: 0, Errors: 0, Skipped: 0, Time elapsed: 1.418 sec

Results :

Tests run: 10, Failures: 0, Errors: 0, Skipped: 0

[INFO] 
[INFO] --- maven-jar-plugin:2.3.1:jar (default-jar) @ maven-remote-resources-plugin ---
[INFO] Building jar: <https://builds.apache.org/job/maven-plugins-ITs-m3/ws/maven-remote-resources-plugin/target/maven-remote-resources-plugin-1.3-SNAPSHOT.jar>
[INFO] 
[INFO] --- maven-plugin-plugin:2.7:addPluginArtifactMetadata (default-addPluginArtifactMetadata)
@ maven-remote-resources-plugin ---
[INFO] 
[INFO] --- maven-invoker-plugin:1.5:install (install-descriptor) @ maven-remote-resources-plugin
---
[INFO] Installing <https://builds.apache.org/job/maven-plugins-ITs-m3/ws/maven-remote-resources-plugin/pom.xml>
to <https://builds.apache.org/job/maven-plugins-ITs-m3/ws/maven-remote-resources-plugin/target/it-repo/org/apache/maven/plugins/maven-remote-resources-plugin/1.3-SNAPSHOT/maven-remote-resources-plugin-1.3-SNAPSHOT.pom>
[INFO] Installing <https://builds.apache.org/job/maven-plugins-ITs-m3/ws/maven-remote-resources-plugin/target/maven-remote-resources-plugin-1.3-SNAPSHOT.jar>
to <https://builds.apache.org/job/maven-plugins-ITs-m3/ws/maven-remote-resources-plugin/target/it-repo/org/apache/maven/plugins/maven-remote-resources-plugin/1.3-SNAPSHOT/maven-remote-resources-plugin-1.3-SNAPSHOT.jar>
[INFO] 
[INFO] --- maven-failsafe-plugin:2.9:integration-test (integration-tests) @ maven-remote-resources-plugin
---
[INFO] Failsafe report directory: <https://builds.apache.org/job/maven-plugins-ITs-m3/ws/maven-remote-resources-plugin/target/failsafe-reports>

-------------------------------------------------------
 T E S T S
-------------------------------------------------------
Running org.apache.maven.plugin.resources.remote.it.IT_GenerateFromBundle
[INFO] ..SUCCESS (6.9 s)
[INFO] Building: local-repo-isolated/pom.xml
[INFO] ..SUCCESS (7.9 s)
[INFO] Building: skip-run/pom.xml
[INFO] ..SUCCESS (2.9 s)
[INFO] Building: staging-dependencies/pom.xml
[INFO] ..SUCCESS (4.5 s)
[INFO] Building: script-context/pom.xml
[INFO] ..SUCCESS (6.6 s)
[INFO] Building: invoker-report/pom.xml
[INFO] ..SUCCESS (12.9 s)
[INFO] Building: fail-build-with-verify/pom.xml
[INFO] ..SUCCESS (4.4 s)
[INFO] Building: fail-prebuild/pom.xml
[INFO] ..SUCCESS (2.9 s)
[INFO] Building: fail-ignore/pom.xml
[INFO] ..SUCCESS (4.2 s)
[INFO] Building: staging-pom/pom.xml
[INFO] ..SUCCESS (2.9 s)
[INFO] Building: local-repo-default/pom.xml
[INFO] ..SUCCESS (7.2 s)
[INFO] Building: fail-build/pom.xml
[INFO] ..SUCCESS (4.4 s)
[INFO] Building: script-global-vars/pom.xml
[INFO] ..SUCCESS (6.5 s)
[INFO] -------------------------------------------------
[INFO] Build Summary:
[INFO]   Passed: 40, Failed: 0, Errors: 0, Skipped: 0
[INFO] -------------------------------------------------
[INFO] 
[INFO] --- maven-install-plugin:2.3.1:install (default-install) @ maven-invoker-plugin ---
[INFO] Installing <https://builds.apache.org/job/maven-plugins-ITs-m3/ws/maven-invoker-plugin/target/maven-invoker-plugin-1.6-SNAPSHOT.jar>
to /home/jenkins/.m2/repository/org/apache/maven/plugins/maven-invoker-plugin/1.6-SNAPSHOT/maven-invoker-plugin-1.6-SNAPSHOT.jar
[INFO] Installing <https://builds.apache.org/job/maven-plugins-ITs-m3/ws/maven-invoker-plugin/pom.xml>
to /home/jenkins/.m2/repository/org/apache/maven/plugins/maven-invoker-plugin/1.6-SNAPSHOT/maven-invoker-plugin-1.6-SNAPSHOT.pom
[INFO]                                                                         
[INFO] ------------------------------------------------------------------------
[INFO] Building Maven Plugins Aggregator 1-SNAPSHOT
[INFO] ------------------------------------------------------------------------
[WARNING] *****************************************************************
[WARNING] * Your build is requesting parallel execution, but project      *
[WARNING] * contains the following plugin(s) that are not marked as       *
[WARNING] * @threadSafe to support parallel building.                     *
[WARNING] * While this /may/ work fine, please look for plugin updates    *
[WARNING] * and/or request plugins be made thread-safe.                   *
[WARNING] * If reporting an issue, report it against the plugin in        *
[WARNING] * question, not against maven-core                              *
[WARNING] *****************************************************************
[WARNING] The following plugins are not marked @threadSafe in Maven Plugins Aggregator:
[WARNING] org.apache.maven.plugins:maven-remote-resources-plugin:1.1
[WARNING] *****************************************************************
[INFO] 
[INFO] --- maven-clean-plugin:2.4.1:clean (default-clean) @ maven-plugins-aggregator ---
[INFO] Deleting <https://builds.apache.org/job/maven-plugins-ITs-m3/ws/target>
[INFO] 
[INFO] --- maven-remote-resources-plugin:1.1:process (default) @ maven-plugins-aggregator
---
[INFO] 
[INFO] --- maven-install-plugin:2.3.1:install (default-install) @ maven-plugins-aggregator
---
[INFO] Installing <https://builds.apache.org/job/maven-plugins-ITs-m3/ws/pom.xml> to
/home/jenkins/.m2/repository/org/apache/maven/plugins/maven-plugins-aggregator/1-SNAPSHOT/maven-plugins-aggregator-1-SNAPSHOT.pom
[INFO] ..SUCCESS (91.3 s)
[INFO] Building: inheritedReports/pom.xml
[INFO] ..SKIPPED 
[INFO] Building: MSITE-265/pom.xml
[INFO] ..SUCCESS (9.7 s)
[INFO] Building: new-configuration/pom.xml
[INFO] ..SUCCESS (8.5 s)
[INFO] Building: MSITE-354/pom.xml
[INFO] ..SUCCESS (8.7 s)
[INFO] Building: MSITE-506/pom.xml
[INFO] ..SUCCESS (12.5 s)
[INFO] Building: site-skip/pom.xml
[INFO] ..SUCCESS (5.0 s)
[INFO] 
[INFO] --- maven-invoker-plugin:1.5:verify (integration-test) @ maven-site-plugin ---
[INFO] -------------------------------------------------
[INFO] Build Summary:
[INFO]   Passed: 39, Failed: 0, Errors: 0, Skipped: 1
[INFO] -------------------------------------------------
[INFO] 
[INFO] --- maven-install-plugin:2.3.1:install (default-install) @ maven-site-plugin ---
[INFO] Installing <https://builds.apache.org/job/maven-plugins-ITs-m3/ws/maven-site-plugin/target/maven-site-plugin-3.1-SNAPSHOT.jar>
to /home/jenkins/.m2/repository/org/apache/maven/plugins/maven-site-plugin/3.1-SNAPSHOT/maven-site-plugin-3.1-SNAPSHOT.jar
[INFO] Installing <https://builds.apache.org/job/maven-plugins-ITs-m3/ws/maven-site-plugin/dependency-reduced-pom.xml>
to /home/jenkins/.m2/repository/org/apache/maven/plugins/maven-site-plugin/3.1-SNAPSHOT/maven-site-plugin-3.1-SNAPSHOT.pom
Tests run: 1, Failures: 0, Errors: 0, Skipped: 0, Time elapsed: 131.573 sec
Running org.apache.maven.plugin.resources.remote.it.IT_GenerateFromOverride
Tests run: 1, Failures: 0, Errors: 0, Skipped: 0, Time elapsed: 2.424 sec
Running org.apache.maven.plugin.resources.remote.it.IT_CustomFilterDelimiter
Tests run: 1, Failures: 0, Errors: 0, Skipped: 0, Time elapsed: 2.539 sec
Running org.apache.maven.plugin.resources.remote.it.IT_SupplementalArtifact
Tests run: 1, Failures: 0, Errors: 0, Skipped: 0, Time elapsed: 6.322 sec
Running org.apache.maven.plugin.resources.remote.it.IT_GenerateFromBundleWithTypeAndClassifier
Tests run: 1, Failures: 0, Errors: 0, Skipped: 0, Time elapsed: 2.438 sec
Running org.apache.maven.plugin.resources.remote.it.IT_FilterLocalOverride
Tests run: 1, Failures: 0, Errors: 0, Skipped: 0, Time elapsed: 2.482 sec
Running org.apache.maven.plugin.resources.remote.it.IT_BadDependencyPoms
Tests run: 1, Failures: 0, Errors: 0, Skipped: 0, Time elapsed: 2.745 sec
Running org.apache.maven.plugin.resources.remote.it.IT_RunOnlyAtExecutionRoot
Tests run: 1, Failures: 0, Errors: 0, Skipped: 0, Time elapsed: 6.136 sec
Running org.apache.maven.plugin.resources.remote.it.IT_GetDependencyProjects
Tests run: 1, Failures: 0, Errors: 0, Skipped: 0, Time elapsed: 6.304 sec

Results :

Tests run: 9, Failures: 0, Errors: 0, Skipped: 0

[WARNING] File encoding has not been set, using platform encoding ANSI_X3.4-1968, i.e. build
is platform dependent!
[INFO] 
[INFO] --- maven-failsafe-plugin:2.9:verify (integration-tests) @ maven-remote-resources-plugin
---
[INFO] Failsafe report directory: <https://builds.apache.org/job/maven-plugins-ITs-m3/ws/maven-remote-resources-plugin/target/failsafe-reports>
[WARNING] File encoding has not been set, using platform encoding ANSI_X3.4-1968, i.e. build
is platform dependent!
[INFO] 
[INFO] --- maven-install-plugin:2.3.1:install (default-install) @ maven-remote-resources-plugin
---
[INFO] Installing <https://builds.apache.org/job/maven-plugins-ITs-m3/ws/maven-remote-resources-plugin/target/maven-remote-resources-plugin-1.3-SNAPSHOT.jar>
to /home/jenkins/.m2/repository/org/apache/maven/plugins/maven-remote-resources-plugin/1.3-SNAPSHOT/maven-remote-resources-plugin-1.3-SNAPSHOT.jar
[INFO] Installing <https://builds.apache.org/job/maven-plugins-ITs-m3/ws/maven-remote-resources-plugin/pom.xml>
to /home/jenkins/.m2/repository/org/apache/maven/plugins/maven-remote-resources-plugin/1.3-SNAPSHOT/maven-remote-resources-plugin-1.3-SNAPSHOT.pom
[INFO] ------------------------------------------------------------------------
[INFO] Reactor Summary:
[INFO] 
[INFO] Maven Plugins ..................................... SUCCESS [3.618s]
[INFO] Maven ACR Plugin .................................. SUCCESS [33.378s]
[INFO] Maven Ant Plugin .................................. SUCCESS [1:36.000s]
[INFO] Maven AntRun Plugin ............................... SUCCESS [1:11.633s]
[INFO] Maven Eclipse Plugin .............................. SUCCESS [13:13.342s]
[INFO] Maven Assembly Plugin ............................. FAILURE [26:35.989s]
[INFO] Maven Changelog Plugin ............................ SUCCESS [46.222s]
[INFO] Maven Changes Report Plugin ....................... SUCCESS [1:11.325s]
[INFO] Maven Checkstyle Plugin ........................... SUCCESS [1:35.928s]
[INFO] Maven Clean Plugin ................................ SUCCESS [19.473s]
[INFO] Maven Compiler Plugin ............................. SUCCESS [32.932s]
[INFO] Maven Dependency Plugin ........................... SUCCESS [2:36.899s]
[INFO] Maven Deploy Plugin ............................... SUCCESS [2:29.796s]
[INFO] Maven DOAP Plugin ................................. SUCCESS [25.596s]
[INFO] Maven Documentation Checker Plugin ................ SUCCESS [8.346s]
[INFO] Maven EAR Plugin .................................. SUCCESS [4:55.102s]
[INFO] Maven EJB Plugin .................................. SUCCESS [39.863s]
[INFO] Maven GPG Plugin .................................. SUCCESS [54.707s]
[INFO] Maven Help Plugin ................................. SUCCESS [44.296s]
[INFO] Maven IDEA Plugin ................................. SUCCESS [8.886s]
[INFO] Maven Install Plugin .............................. SUCCESS [45.395s]
[INFO] Maven JAR Plugin .................................. SUCCESS [1:20.757s]
[INFO] Maven Jarsigner Plugin ............................ SUCCESS [30.692s]
[INFO] Maven Javadoc Plugin .............................. SUCCESS [8:01.046s]
[INFO] Maven Linkcheck Plugin ............................ SUCCESS [2.326s]
[INFO] Maven One Plugin .................................. SUCCESS [2.859s]
[INFO] Maven Patch Plugin ................................ SUCCESS [17.271s]
[INFO] Maven PDF Plugin .................................. SUCCESS [4:32.845s]
[INFO] Maven PMD Plugin .................................. SUCCESS [27.835s]
[INFO] Maven RAR Plugin .................................. SUCCESS [11.881s]
[INFO] Maven Reactor Plugin .............................. SUCCESS [2.868s]
[INFO] Maven Repository Plugin ........................... FAILURE [14.428s]
[INFO] Maven Resources Plugin ............................ SUCCESS [1:02.769s]
[INFO] Maven Shade Plugin ................................ SUCCESS [2:23.458s]
[INFO] Maven Site Plugin 3 ............................... SUCCESS [8:18.933s]
[INFO] Maven Source Plugin ............................... SUCCESS [41.792s]
[INFO] Maven Stage Plugin ................................ SUCCESS [3.661s]
[INFO] Maven Toolchains Plugin ........................... SUCCESS [1.844s]
[INFO] Maven Verifier Plugin ............................. SUCCESS [11.314s]
[INFO] Maven WAR Plugin .................................. SUCCESS [1:25.306s]
[INFO] Maven Invoker Plugin .............................. SUCCESS [4:43.984s]
[INFO] Maven Project Info Reports Plugin ................. SUCCESS [2:10.093s]
[INFO] Maven Remote Resources Plugin ..................... SUCCESS [2:51.498s]
[INFO] Maven Plugins Aggregator .......................... SUCCESS [0.122s]
[INFO] ------------------------------------------------------------------------
[INFO] BUILD FAILURE
[INFO] ------------------------------------------------------------------------
[INFO] Total time: 34:27.344s (Wall Clock)
[INFO] Finished at: Fri Jan 13 23:45:22 UTC 2012
[INFO] Final Memory: 71M/1000M
[INFO] ------------------------------------------------------------------------
[WARNING] The requested profile "apache.snapshots" could not be activated because it does
not exist.
[ERROR] Failed to execute goal org.sonatype.plugins:maven-repository-collector-plugin:1.0:resolve
(resolve-deps) on project maven-repository-plugin: Failed to resolve project artifacts: Could
not transfer artifact org.codehaus.plexus:plexus-container-default:jar:1.0-alpha-15 from/to
central (http://repo1.maven.org/maven2): GET request of: org/codehaus/plexus/plexus-container-default/1.0-alpha-15/plexus-container-default-1.0-alpha-15.jar
from central failed
[ERROR] org.codehaus.plexus:plexus-container-default:jar:1.0-alpha-15
[ERROR] 
[ERROR] from the specified remote repositories:
[ERROR] main-local (file:///home/jenkins/.m2/repository/, releases=true, snapshots=true),
[ERROR] Nexus (http://repository.apache.org/snapshots, releases=false, snapshots=true),
[ERROR] central (http://repo1.maven.org/maven2, releases=true, snapshots=false),
[ERROR] codehaus.snapshots (http://snapshots.repository.codehaus.org, releases=false, snapshots=true)
[ERROR] Path to dependency:
[ERROR] 1) org.apache.maven.plugins:maven-repository-plugin:maven-plugin:2.3.3-SNAPSHOT
[ERROR] 2) org.codehaus.plexus:plexus-archiver:jar:1.0-alpha-10
[ERROR] 3) org.codehaus.plexus:plexus-container-default:jar:1.0-alpha-15: Corrupt GZIP trailer
[ERROR] -> [Help 1]
[ERROR] Failed to execute goal org.apache.maven.plugins:maven-invoker-plugin:1.5:verify (integration-test)
on project maven-assembly-plugin: 3 builds failed. -> [Help 2]
[ERROR] 
[ERROR] To see the full stack trace of the errors, re-run Maven with the -e switch.
[ERROR] Re-run Maven using the -X switch to enable full debug logging.
[ERROR] 
[ERROR] For more information about the errors and possible solutions, please read the following
articles:
[ERROR] [Help 1] http://cwiki.apache.org/confluence/display/MAVEN/MojoExecutionException
[ERROR] [Help 2] http://cwiki.apache.org/confluence/display/MAVEN/MojoFailureException
[ERROR] 
[ERROR] After correcting the problems, you can resume the build with the command
[ERROR]   mvn <goals> -rf :maven-repository-plugin
Build step 'Invoke top-level Maven targets' marked build as failure


Mime
View raw message