maven-notifications mailing list archives

Site index · List index
Message view « Date » · « Thread »
Top « Date » · « Thread »
From Apache Jenkins Server <jenk...@builds.apache.org>
Subject Build failed in Jenkins: maven-plugins-ITs-m3 #332
Date Thu, 12 Jan 2012 07:37:37 GMT
See <https://builds.apache.org/job/maven-plugins-ITs-m3/332/changes>

Changes:

[hboutemy] fixed typos

------------------------------------------
[...truncated 9282 lines...]
[INFO] Installing <https://builds.apache.org/job/maven-plugins-ITs-m3/ws/maven-remote-resources-plugin/target/maven-remote-resources-plugin-1.3-SNAPSHOT.jar>
to <https://builds.apache.org/job/maven-plugins-ITs-m3/ws/maven-remote-resources-plugin/target/it-repo/org/apache/maven/plugins/maven-remote-resources-plugin/1.3-SNAPSHOT/maven-remote-resources-plugin-1.3-SNAPSHOT.jar>
[INFO] 
[INFO] --- maven-failsafe-plugin:2.9:integration-test (integration-tests) @ maven-remote-resources-plugin
---
[INFO] Failsafe report directory: <https://builds.apache.org/job/maven-plugins-ITs-m3/ws/maven-remote-resources-plugin/target/failsafe-reports>

-------------------------------------------------------
 T E S T S
-------------------------------------------------------
Running org.apache.maven.plugin.resources.remote.it.IT_GenerateFromOverride
[INFO] ..SUCCESS (4.7 s)
[INFO] Building: fail-build/pom.xml
[INFO] ..SUCCESS (9.5 s)
[INFO] Building: empty-report-set/pom.xml
[INFO] ..SUCCESS (4.3 s)
[INFO] Building: local-repo-default/pom.xml
[INFO] ..SUCCESS (4.6 s)
[INFO] Building: MSITE-497/pom.xml
[INFO] ..SUCCESS (6.9 s)
[INFO] Building: staging-pom/pom.xml
[INFO] ..SUCCESS (3.0 s)
[INFO] Building: settings-auto-exclude/pom.xml
[INFO] ..SUCCESS (4.6 s)
[INFO] Building: local-repo-isolated/pom.xml
[INFO] ..SUCCESS (5.2 s)
[INFO] Building: script-global-vars/pom.xml
[INFO] ..SUCCESS (20.8 s)
[INFO] Building: site-attach-descriptor/pom.xml
[INFO] ..SUCCESS (6.5 s)
[INFO] Building: invoker-report/pom.xml
[INFO] ..SUCCESS (4.8 s)
[INFO] Building: MSITE-312/pom.xml
[INFO] ..SUCCESS (5.0 s)
[INFO] Building: site-stage-deploy/pom.xml
[INFO] ..SUCCESS (11.6 s)
[INFO] Building: pom-filtering-encoding/pom.xml
[INFO] ..SUCCESS (6.1 s)
[INFO] -------------------------------------------------
[INFO] Build Summary:
[INFO]   Passed: 39, Failed: 1, Errors: 0, Skipped: 0
[INFO] -------------------------------------------------
[ERROR] The following builds failed:
[ERROR] *  install-extra-artifacts/pom.xml
[INFO] -------------------------------------------------
[INFO]                                                                         
[INFO] ------------------------------------------------------------------------
[INFO] Building Maven Plugins Aggregator 1-SNAPSHOT
[INFO] ------------------------------------------------------------------------
[WARNING] *****************************************************************
[WARNING] * Your build is requesting parallel execution, but project      *
[WARNING] * contains the following plugin(s) that are not marked as       *
[WARNING] * @threadSafe to support parallel building.                     *
[WARNING] * While this /may/ work fine, please look for plugin updates    *
[WARNING] * and/or request plugins be made thread-safe.                   *
[WARNING] * If reporting an issue, report it against the plugin in        *
[WARNING] * question, not against maven-core                              *
[WARNING] *****************************************************************
[WARNING] The following plugins are not marked @threadSafe in Maven Plugins Aggregator:
[WARNING] org.apache.maven.plugins:maven-remote-resources-plugin:1.1
[WARNING] *****************************************************************
[INFO] 
[INFO] --- maven-clean-plugin:2.4.1:clean (default-clean) @ maven-plugins-aggregator ---
[INFO] Deleting <https://builds.apache.org/job/maven-plugins-ITs-m3/ws/target>
[INFO] 
[INFO] --- maven-remote-resources-plugin:1.1:process (default) @ maven-plugins-aggregator
---
[INFO] 
[INFO] --- maven-install-plugin:2.3.1:install (default-install) @ maven-plugins-aggregator
---
[INFO] Installing <https://builds.apache.org/job/maven-plugins-ITs-m3/ws/pom.xml> to
/home/jenkins/.m2/repository/org/apache/maven/plugins/maven-plugins-aggregator/1-SNAPSHOT/maven-plugins-aggregator-1-SNAPSHOT.pom
[INFO] ..SUCCESS (11.1 s)
[INFO] Building: site-deploy/pom.xml
[INFO] ..FAILED (24.3 s)
[INFO]   The build exited with code 1. See <https://builds.apache.org/job/maven-plugins-ITs-m3/ws/maven-site-plugin/target/it/site-deploy/build.log>
for details.
[INFO] Building: report-changes-generation/pom.xml
[INFO] ..SUCCESS (11.4 s)
[INFO] Building: full-reporting/pom.xml
Tests run: 1, Failures: 0, Errors: 1, Skipped: 0, Time elapsed: 99.579 sec <<< FAILURE!
Running org.apache.maven.plugin.resources.remote.it.IT_CustomFilterDelimiter
Tests run: 1, Failures: 0, Errors: 0, Skipped: 0, Time elapsed: 44.344 sec
Running org.apache.maven.plugin.resources.remote.it.IT_RunOnlyAtExecutionRoot
Tests run: 1, Failures: 0, Errors: 0, Skipped: 0, Time elapsed: 5.939 sec
Running org.apache.maven.plugin.resources.remote.it.IT_SupplementalArtifact
Tests run: 1, Failures: 0, Errors: 0, Skipped: 0, Time elapsed: 6.045 sec
Running org.apache.maven.plugin.resources.remote.it.IT_GetDependencyProjects
Tests run: 1, Failures: 0, Errors: 0, Skipped: 0, Time elapsed: 6.081 sec
Running org.apache.maven.plugin.resources.remote.it.IT_GenerateFromBundleWithTypeAndClassifier
Tests run: 1, Failures: 0, Errors: 0, Skipped: 0, Time elapsed: 2.336 sec
Running org.apache.maven.plugin.resources.remote.it.IT_BadDependencyPoms
Tests run: 1, Failures: 0, Errors: 0, Skipped: 0, Time elapsed: 2.6 sec
Running org.apache.maven.plugin.resources.remote.it.IT_GenerateFromBundle
Tests run: 1, Failures: 0, Errors: 0, Skipped: 0, Time elapsed: 2.581 sec
Running org.apache.maven.plugin.resources.remote.it.IT_FilterLocalOverride
Tests run: 1, Failures: 0, Errors: 0, Skipped: 0, Time elapsed: 2.436 sec

Results :

Tests in error: 
  test(org.apache.maven.plugin.resources.remote.it.IT_GenerateFromOverride): Exit code was
non-zero: 1; command line and log = 

Tests run: 9, Failures: 0, Errors: 1, Skipped: 0

[WARNING] File encoding has not been set, using platform encoding ANSI_X3.4-1968, i.e. build
is platform dependent!
[INFO] 
[INFO] --- maven-failsafe-plugin:2.9:verify (integration-tests) @ maven-remote-resources-plugin
---
[INFO] Failsafe report directory: <https://builds.apache.org/job/maven-plugins-ITs-m3/ws/maven-remote-resources-plugin/target/failsafe-reports>
[WARNING] File encoding has not been set, using platform encoding ANSI_X3.4-1968, i.e. build
is platform dependent!
[INFO] ..SUCCESS (98.7 s)
[INFO] Building: new-configuration/pom.xml
[INFO] ..SUCCESS (9.5 s)
[INFO] Building: top-parent-different-site/pom.xml
[INFO] ..SUCCESS (5.3 s)
[INFO] Building: MSITE-265/pom.xml
[INFO] ..SUCCESS (9.9 s)
[INFO] Building: validate/pom.xml
[INFO] ..SUCCESS (4.9 s)
[INFO] Building: site-skip/pom.xml
[INFO] ..SUCCESS (5.0 s)
[INFO] Building: site-inheritance/pom.xml
[INFO] ..SUCCESS (8.5 s)
[INFO] Building: MSITE-322/pom.xml
[INFO] ..SUCCESS (7.1 s)
[INFO] Building: surefire-report/pom.xml
[INFO] ..SUCCESS (5.9 s)
[INFO] Building: MSITE-566/pom.xml
[INFO] ..SUCCESS (3.4 s)
[INFO] Building: MSITE-456/pom.xml
[INFO] ..SUCCESS (4.8 s)
[INFO] Building: MSITE-304/pom.xml
[INFO] ..SUCCESS (6.5 s)
[INFO] Building: MSITE-627/pom.xml
[INFO] ..SUCCESS (10.6 s)
[INFO] Building: MSITE-609/pom.xml
[INFO] ..SUCCESS (5.4 s)
[INFO] Building: MSITE-512/pom.xml
[INFO] ..SUCCESS (7.3 s)
[INFO] Building: MSITE-458/pom.xml
[INFO] ..SUCCESS (10.9 s)
[INFO] Building: MSITE-550/pom.xml
[INFO] ..SUCCESS (3.3 s)
[INFO] 
[INFO] --- maven-invoker-plugin:1.5:verify (integration-test) @ maven-site-plugin ---
[INFO] -------------------------------------------------
[INFO] Build Summary:
[INFO]   Passed: 37, Failed: 2, Errors: 0, Skipped: 1
[INFO] -------------------------------------------------
[ERROR] The following builds failed:
[ERROR] *  site-jar/pom.xml
[ERROR] *  site-deploy/pom.xml
[INFO] -------------------------------------------------
[INFO] ------------------------------------------------------------------------
[INFO] Reactor Summary:
[INFO] 
[INFO] Maven Plugins ..................................... SUCCESS [8.714s]
[INFO] Maven ACR Plugin .................................. SUCCESS [1:17.243s]
[INFO] Maven Ant Plugin .................................. SUCCESS [2:14.966s]
[INFO] Maven AntRun Plugin ............................... SUCCESS [1:57.703s]
[INFO] Maven Eclipse Plugin .............................. SUCCESS [12:11.302s]
[INFO] Maven Assembly Plugin ............................. FAILURE [15:17.080s]
[INFO] Maven Changelog Plugin ............................ SUCCESS [49.736s]
[INFO] Maven Changes Report Plugin ....................... SUCCESS [1:31.328s]
[INFO] Maven Checkstyle Plugin ........................... SUCCESS [1:37.573s]
[INFO] Maven Clean Plugin ................................ SUCCESS [25.678s]
[INFO] Maven Compiler Plugin ............................. SUCCESS [29.667s]
[INFO] Maven Dependency Plugin ........................... SUCCESS [2:37.901s]
[INFO] Maven Deploy Plugin ............................... SUCCESS [2:36.242s]
[INFO] Maven DOAP Plugin ................................. FAILURE [41.852s]
[INFO] Maven Documentation Checker Plugin ................ FAILURE [12.805s]
[INFO] Maven EAR Plugin .................................. FAILURE [5:34.941s]
[INFO] Maven EJB Plugin .................................. SUCCESS [31.508s]
[INFO] Maven GPG Plugin .................................. SUCCESS [44.480s]
[INFO] Maven Help Plugin ................................. SUCCESS [41.749s]
[INFO] Maven IDEA Plugin ................................. SUCCESS [8.757s]
[INFO] Maven Install Plugin .............................. SUCCESS [43.800s]
[INFO] Maven JAR Plugin .................................. SUCCESS [1:31.851s]
[INFO] Maven Jarsigner Plugin ............................ FAILURE [1:25.518s]
[INFO] Maven Javadoc Plugin .............................. FAILURE [4:24.092s]
[INFO] Maven Linkcheck Plugin ............................ SUCCESS [2.035s]
[INFO] Maven One Plugin .................................. SUCCESS [3.551s]
[INFO] Maven Patch Plugin ................................ SUCCESS [12.991s]
[INFO] Maven PDF Plugin .................................. FAILURE [55.196s]
[INFO] Maven PMD Plugin .................................. FAILURE [39.566s]
[INFO] Maven RAR Plugin .................................. SUCCESS [7.504s]
[INFO] Maven Reactor Plugin .............................. SUCCESS [2.814s]
[INFO] Maven Repository Plugin ........................... FAILURE [26.971s]
[INFO] Maven Resources Plugin ............................ SUCCESS [56.618s]
[INFO] Maven Shade Plugin ................................ SUCCESS [2:34.055s]
[INFO] Maven Site Plugin 3 ............................... FAILURE [12:01.609s]
[INFO] Maven Source Plugin ............................... SUCCESS [34.791s]
[INFO] Maven Stage Plugin ................................ SUCCESS [2.236s]
[INFO] Maven Toolchains Plugin ........................... SUCCESS [1.474s]
[INFO] Maven Verifier Plugin ............................. SUCCESS [10.625s]
[INFO] Maven WAR Plugin .................................. SUCCESS [1:38.561s]
[INFO] Maven Invoker Plugin .............................. FAILURE [5:42.386s]
[INFO] Maven Project Info Reports Plugin ................. SUCCESS [3:14.397s]
[INFO] Maven Remote Resources Plugin ..................... FAILURE [2:59.664s]
[INFO] Maven Plugins Aggregator .......................... SUCCESS [0.083s]
[INFO] ------------------------------------------------------------------------
[INFO] BUILD FAILURE
[INFO] ------------------------------------------------------------------------
[INFO] Total time: 32:53.132s (Wall Clock)
[INFO] Finished at: Thu Jan 12 07:37:36 UTC 2012
[INFO] Final Memory: 68M/994M
[INFO] ------------------------------------------------------------------------
[WARNING] The requested profile "apache.snapshots" could not be activated because it does
not exist.
[ERROR] Failed to execute goal org.apache.maven.plugins:maven-invoker-plugin:1.5:run (integration-test)
on project maven-doap-plugin: 1 build failed. -> [Help 1]
[ERROR] Failed to execute goal org.apache.maven.plugins:maven-invoker-plugin:1.4:run (integration-test)
on project maven-docck-plugin: 1 build failed. -> [Help 1]
[ERROR] Failed to execute goal org.apache.maven.plugins:maven-invoker-plugin:1.5:run (integration-test)
on project maven-assembly-plugin: 2 builds failed. -> [Help 1]
[ERROR] Failed to execute goal org.apache.maven.plugins:maven-invoker-plugin:1.5:run (integration-test)
on project maven-jarsigner-plugin: 2 builds failed. -> [Help 1]
[ERROR] Failed to execute goal org.apache.maven.plugins:maven-surefire-plugin:2.9:test (default)
on project maven-ear-plugin: There are test failures.
[ERROR] 
[ERROR] Please refer to <https://builds.apache.org/job/maven-plugins-ITs-m3/ws/maven-ear-plugin/target/surefire-reports>
for the individual test results.
[ERROR] -> [Help 1]
[ERROR] Failed to execute goal org.apache.maven.plugins:maven-invoker-plugin:1.5:verify (integration-test)
on project maven-pmd-plugin: 1 build failed. -> [Help 1]
[ERROR] Failed to execute goal org.apache.maven.plugins:maven-surefire-plugin:2.7.2:test (default-test)
on project maven-pdf-plugin: There are test failures.
[ERROR] 
[ERROR] Please refer to <https://builds.apache.org/job/maven-plugins-ITs-m3/ws/maven-pdf-plugin/target/surefire-reports>
for the individual test results.
[ERROR] -> [Help 1]
[ERROR] Failed to execute goal org.sonatype.plugins:maven-repository-collector-plugin:1.0:resolve
(resolve-deps) on project maven-repository-plugin: Failed to resolve project artifacts: Could
not transfer artifact org.codehaus.plexus:plexus-container-default:jar:1.0-alpha-15 from/to
central (http://repo1.maven.org/maven2): Error transferring file: Connection timed out
[ERROR] org.codehaus.plexus:plexus-container-default:jar:1.0-alpha-15
[ERROR] 
[ERROR] from the specified remote repositories:
[ERROR] main-local (file:///home/jenkins/.m2/repository/, releases=true, snapshots=true),
[ERROR] Nexus (http://repository.apache.org/snapshots, releases=false, snapshots=true),
[ERROR] central (http://repo1.maven.org/maven2, releases=true, snapshots=false),
[ERROR] codehaus.snapshots (http://snapshots.repository.codehaus.org, releases=false, snapshots=true)
[ERROR] Path to dependency:
[ERROR] 1) org.apache.maven.plugins:maven-repository-plugin:maven-plugin:2.3.3-SNAPSHOT
[ERROR] 2) org.codehaus.plexus:plexus-archiver:jar:1.0-alpha-10
[ERROR] 3) org.codehaus.plexus:plexus-container-default:jar:1.0-alpha-15
[ERROR] -> [Help 2]
[ERROR] Failed to execute goal org.apache.maven.plugins:maven-surefire-plugin:2.9:test (default-test)
on project maven-javadoc-plugin: There are test failures.
[ERROR] 
[ERROR] Please refer to <https://builds.apache.org/job/maven-plugins-ITs-m3/ws/maven-javadoc-plugin/target/surefire-reports>
for the individual test results.
[ERROR] -> [Help 1]
[ERROR] Failed to execute goal org.apache.maven.plugins:maven-invoker-plugin:1.5:run (integration-test)
on project maven-invoker-plugin: 1 build failed. -> [Help 1]
[ERROR] Failed to execute goal org.apache.maven.plugins:maven-failsafe-plugin:2.9:verify (integration-tests)
on project maven-remote-resources-plugin: There are test failures.
[ERROR] 
[ERROR] Please refer to <https://builds.apache.org/job/maven-plugins-ITs-m3/ws/maven-remote-resources-plugin/target/failsafe-reports>
for the individual test results.
[ERROR] -> [Help 1]
[ERROR] Failed to execute goal org.apache.maven.plugins:maven-invoker-plugin:1.5:verify (integration-test)
on project maven-site-plugin: 2 builds failed. -> [Help 1]
[ERROR] 
[ERROR] To see the full stack trace of the errors, re-run Maven with the -e switch.
[ERROR] Re-run Maven using the -X switch to enable full debug logging.
[ERROR] 
[ERROR] For more information about the errors and possible solutions, please read the following
articles:
[ERROR] [Help 1] http://cwiki.apache.org/confluence/display/MAVEN/MojoFailureException
[ERROR] [Help 2] http://cwiki.apache.org/confluence/display/MAVEN/MojoExecutionException
[ERROR] 
[ERROR] After correcting the problems, you can resume the build with the command
[ERROR]   mvn <goals> -rf :maven-doap-plugin
Build step 'Invoke top-level Maven targets' marked build as failure


Mime
View raw message