maven-notifications mailing list archives

Site index · List index
Message view « Date » · « Thread »
Top « Date » · « Thread »
From Apache Jenkins Server <jenk...@builds.apache.org>
Subject Build failed in Jenkins: maven-plugins-ITs-m2 #462
Date Sat, 28 Jan 2012 12:46:42 GMT
See <https://builds.apache.org/job/maven-plugins-ITs-m2/462/changes>

Changes:

[rfscholte] Add generics and remove unused imports

------------------------------------------
[...truncated 5660 lines...]
[INFO] Generating current version: 1.0.0
[INFO] [modello:xpp3-reader {execution: standard}]
[INFO] outputDirectory: /x1/jenkins/jenkins-slave/workspace/maven-plugins-ITs-m2/maven-verifier-plugin/target/generated-sources/modello
[INFO] Working on model: src/main/mdo/verifications.mdo
[INFO] Generating current version: 1.0.0
[INFO] [modello:xpp3-writer {execution: standard}]
[INFO] outputDirectory: /x1/jenkins/jenkins-slave/workspace/maven-plugins-ITs-m2/maven-verifier-plugin/target/generated-sources/modello
[INFO] Working on model: src/main/mdo/verifications.mdo
[INFO] Generating current version: 1.0.0
[INFO] [plugin:descriptor {execution: default-descriptor}]
[INFO] Using 'UTF-8' encoding to read mojo metadata.
[INFO] Applying mojo extractor for language: java
[INFO] Mojo extractor for language: java found 2 mojo descriptors.
[INFO] Applying mojo extractor for language: bsh
[INFO] Mojo extractor for language: bsh found 0 mojo descriptors.
[INFO] [remote-resources:process {execution: default}]
[INFO] [resources:resources {execution: default-resources}]
[INFO] Using 'UTF-8' encoding to copy filtered resources.
[INFO] skip non existing resourceDirectory /x1/jenkins/jenkins-slave/workspace/maven-plugins-ITs-m2/maven-verifier-plugin/src/main/resources
[INFO] Copying 3 resources
[INFO] [compiler:compile {execution: default-compile}]
[INFO] Compiling 9 source files to /x1/jenkins/jenkins-slave/workspace/maven-plugins-ITs-m2/maven-verifier-plugin/target/classes
[INFO] [resources:testResources {execution: default-testResources}]
[INFO] Using 'UTF-8' encoding to copy filtered resources.
[INFO] Copying 6 resources
[INFO] Copying 3 resources
[INFO] [compiler:testCompile {execution: default-testCompile}]
[INFO] Compiling 1 source file to /x1/jenkins/jenkins-slave/workspace/maven-plugins-ITs-m2/maven-verifier-plugin/target/test-classes
[INFO] [surefire:test {execution: default-test}]
[INFO] Surefire report directory: /x1/jenkins/jenkins-slave/workspace/maven-plugins-ITs-m2/maven-verifier-plugin/target/surefire-reports

-------------------------------------------------------
 T E S T S
-------------------------------------------------------
Running org.apache.maven.plugin.verifier.VerifierMojoTest
[debug] Verifying existence of c:/some/path/src/test/resources/Dummy.xml
[debug] Verifying existence of /x1/jenkins/jenkins-slave/workspace/maven-plugins-ITs-m2/maven-verifier-plugin/target/test-classes/File
Exists.xml
[debug] Verifying absence of c:/some/path/src/test/resources/Dummy.xml
[debug] Verifying absence of /x1/jenkins/jenkins-slave/workspace/maven-plugins-ITs-m2/maven-verifier-plugin/target/test-classes/InexistentFileThatExists.xml
[debug] Verifying existence of /x1/jenkins/jenkins-slave/workspace/maven-plugins-ITs-m2/maven-verifier-plugin/target/test-classes/FileExistsValidContent.xml
[debug] Verifying contents of /x1/jenkins/jenkins-slave/workspace/maven-plugins-ITs-m2/maven-verifier-plugin/target/test-classes/FileExistsValidContent.xml
[debug] Verifying existence of /x1/jenkins/jenkins-slave/workspace/maven-plugins-ITs-m2/maven-verifier-plugin/target/test-classes/FileExistsValidContent.xml
[debug] Verifying contents of /x1/jenkins/jenkins-slave/workspace/maven-plugins-ITs-m2/maven-verifier-plugin/target/test-classes/FileExistsValidContent.xml
Tests run: 8, Failures: 0, Errors: 0, Skipped: 0, Time elapsed: 0.058 sec

Results :

Tests run: 8, Failures: 0, Errors: 0, Skipped: 0

[INFO] [jar:jar {execution: default-jar}]
[INFO] Building jar: /x1/jenkins/jenkins-slave/workspace/maven-plugins-ITs-m2/maven-verifier-plugin/target/maven-verifier-plugin-1.1-SNAPSHOT.jar
[INFO] [plugin:addPluginArtifactMetadata {execution: default-addPluginArtifactMetadata}]
[INFO] [invoker:install {execution: integration-test}]
[INFO] Installing /x1/jenkins/jenkins-slave/workspace/maven-plugins-ITs-m2/maven-verifier-plugin/pom.xml
to /x1/jenkins/jenkins-slave/workspace/maven-plugins-ITs-m2/maven-verifier-plugin/target/local-repo/org/apache/maven/plugins/maven-verifier-plugin/1.1-SNAPSHOT/maven-verifier-plugin-1.1-SNAPSHOT.pom
[INFO] Installing /x1/jenkins/jenkins-slave/workspace/maven-plugins-ITs-m2/maven-verifier-plugin/target/maven-verifier-plugin-1.1-SNAPSHOT.jar
to /x1/jenkins/jenkins-slave/workspace/maven-plugins-ITs-m2/maven-verifier-plugin/target/local-repo/org/apache/maven/plugins/maven-verifier-plugin/1.1-SNAPSHOT/maven-verifier-plugin-1.1-SNAPSHOT.jar
[INFO] [invoker:run {execution: integration-test}]
[INFO] Building: simple/pom.xml
[INFO] ..SUCCESS (2.2 s)
[INFO] Building: default/pom.xml
[INFO] ..SUCCESS (1.7 s)
[INFO] ---------------------------------------
[INFO] Execution Summary:
[INFO]   Builds Passing: 2
[INFO]   Builds Failing: 0
[INFO]   Builds Skipped: 0
[INFO] ---------------------------------------
[INFO] [install:install {execution: default-install}]
[INFO] Installing /x1/jenkins/jenkins-slave/workspace/maven-plugins-ITs-m2/maven-verifier-plugin/target/maven-verifier-plugin-1.1-SNAPSHOT.jar
to /home/jenkins/.m2/repository/org/apache/maven/plugins/maven-verifier-plugin/1.1-SNAPSHOT/maven-verifier-plugin-1.1-SNAPSHOT.jar
[INFO] ------------------------------------------------------------------------
[INFO] Building Maven WAR Plugin
[INFO]    task-segment: [clean, install]
[INFO] ------------------------------------------------------------------------
[INFO] [clean:clean {execution: default-clean}]
Downloading: http://repo1.maven.org/maven2/org/apache/maven/maven-archiver/2.5/maven-archiver-2.5.pom
[INFO] Unable to find resource 'org.apache.maven:maven-archiver:pom:2.5' in repository central
(http://repo1.maven.org/maven2)
Downloading: http://repo1.maven.org/maven2/org/apache/maven/maven-archiver/2.5/maven-archiver-2.5.jar
[INFO] Unable to find resource 'org.apache.maven:maven-archiver:jar:2.5' in repository central
(http://repo1.maven.org/maven2)
[INFO] ------------------------------------------------------------------------
[INFO] Building Maven Plugins Aggregator
[INFO]    task-segment: [clean, install]
[INFO] ------------------------------------------------------------------------
[INFO] [clean:clean {execution: default-clean}]
[INFO] Deleting /x1/jenkins/jenkins-slave/workspace/maven-plugins-ITs-m2/target
[INFO] [remote-resources:process {execution: default}]
[INFO] [site:attach-descriptor {execution: default-attach-descriptor}]
[INFO] [install:install {execution: default-install}]
[INFO] Installing /x1/jenkins/jenkins-slave/workspace/maven-plugins-ITs-m2/pom.xml to /home/jenkins/.m2/repository/org/apache/maven/plugins/maven-plugins-aggregator/1-SNAPSHOT/maven-plugins-aggregator-1-SNAPSHOT.pom
[INFO] 
[INFO] 
[INFO] ------------------------------------------------------------------------
[INFO] Reactor Summary:
[INFO] ------------------------------------------------------------------------
[INFO] Maven Plugins ......................................... SUCCESS [12.018s]
[INFO] Maven ACR Plugin ...................................... SUCCESS [29.408s]
[INFO] Maven Ant Plugin ...................................... SUCCESS [1:01.841s]
[INFO] Maven AntRun Plugin ................................... SUCCESS [42.355s]
[INFO] Maven Eclipse Plugin .................................. SUCCESS [10:01.051s]
[INFO] Maven Assembly Plugin ................................. FAILED [1.779s]
[INFO] Maven Changelog Plugin ................................ SUCCESS [25.592s]
[INFO] Maven Compiler Plugin ................................. SUCCESS [18.065s]
[INFO] Maven Changes Report Plugin ........................... SUCCESS [36.813s]
[INFO] Maven Checkstyle Plugin ............................... SUCCESS [1:03.459s]
[INFO] Maven Clean Plugin .................................... SUCCESS [10.615s]
[INFO] Maven Dependency Plugin ............................... SUCCESS [1:51.220s]
[INFO] Maven Deploy Plugin ................................... SUCCESS [1:27.432s]
[INFO] Maven DOAP Plugin ..................................... SUCCESS [15.356s]
[INFO] Maven Documentation Checker Plugin .................... SUCCESS [6.440s]
[INFO] Maven EAR Plugin ...................................... FAILED [2:57.008s]
[INFO] Maven EJB Plugin ...................................... SUCCESS [18.627s]
[INFO] Maven GPG Plugin ...................................... SUCCESS [23.774s]
[INFO] Maven Help Plugin ..................................... SUCCESS [22.774s]
[INFO] Maven IDEA Plugin ..................................... SUCCESS [5.322s]
[INFO] Maven Install Plugin .................................. SUCCESS [27.829s]
[INFO] Maven JAR Plugin ...................................... FAILED [0.115s]
[INFO] Maven Jarsigner Plugin ................................ SUCCESS [19.432s]
[INFO] Maven Shade Plugin .................................... SUCCESS [1:19.689s]
[INFO] Maven Javadoc Plugin .................................. SUCCESS [7:04.374s]
[INFO] Maven Linkcheck Plugin ................................ SUCCESS [1.567s]
[INFO] Maven One Plugin ...................................... SUCCESS [1.706s]
[INFO] Maven Patch Plugin .................................... SUCCESS [8.666s]
[INFO] Maven PDF Plugin ...................................... SUCCESS [24.396s]
[INFO] Maven PMD Plugin ...................................... SUCCESS [20.321s]
[INFO] Maven RAR Plugin ...................................... SUCCESS [5.032s]
[INFO] Maven Reactor Plugin .................................. SUCCESS [2.197s]
[INFO] Maven Repository Plugin ............................... SUCCESS [2:17.432s]
[INFO] Maven Resources Plugin ................................ SKIPPED (dependency build failed
or was skipped)
[INFO] Maven Site Plugin 3 ................................... SUCCESS [5:40.596s]
[INFO] Maven Source Plugin ................................... SUCCESS [22.539s]
[INFO] Maven Stage Plugin .................................... SUCCESS [1.540s]
[INFO] Maven Toolchains Plugin ............................... SUCCESS [1.293s]
[INFO] Maven Verifier Plugin ................................. SUCCESS [5.852s]
[INFO] Maven WAR Plugin ...................................... FAILED [0.657s]
[INFO] Maven Plugins Aggregator .............................. SUCCESS [2.122s]
[INFO] ------------------------------------------------------------------------
[INFO] Error for project: Maven Assembly Plugin (during install)
[INFO] ------------------------------------------------------------------------
[INFO] Failed to resolve artifact.

Missing:
----------
1) org.apache.maven:maven-archiver:jar:2.5

  Try downloading the file manually from the project website.

  Then, install it using the command: 
      mvn install:install-file -DgroupId=org.apache.maven -DartifactId=maven-archiver -Dversion=2.5
-Dpackaging=jar -Dfile=/path/to/file

  Alternatively, if you host your own repository you can deploy the file there: 
      mvn deploy:deploy-file -DgroupId=org.apache.maven -DartifactId=maven-archiver -Dversion=2.5
-Dpackaging=jar -Dfile=/path/to/file -Durl=[url] -DrepositoryId=[id]

  Path to dependency: 
  	1) org.apache.maven.plugins:maven-assembly-plugin:maven-plugin:2.4-SNAPSHOT
  	2) org.apache.maven:maven-archiver:jar:2.5

----------
1 required artifact is missing.

for artifact: 
  org.apache.maven.plugins:maven-assembly-plugin:maven-plugin:2.4-SNAPSHOT

from the specified remote repositories:
  central (http://repo1.maven.org/maven2),
  Nexus (http://repository.apache.org/snapshots),
  codehaus.org (http://snapshots.repository.codehaus.org)



[INFO] ------------------------------------------------------------------------
[INFO] Error for project: Maven EAR Plugin (during install)
[INFO] ------------------------------------------------------------------------
[INFO] There are test failures.

Please refer to /x1/jenkins/jenkins-slave/workspace/maven-plugins-ITs-m2/maven-ear-plugin/target/surefire-reports
for the individual test results.
[INFO] ------------------------------------------------------------------------
[INFO] Error for project: Maven JAR Plugin (during install)
[INFO] ------------------------------------------------------------------------
[INFO] Failed to resolve artifact.

Missing:
----------
1) org.apache.maven:maven-archiver:jar:2.5

  Try downloading the file manually from the project website.

  Then, install it using the command: 
      mvn install:install-file -DgroupId=org.apache.maven -DartifactId=maven-archiver -Dversion=2.5
-Dpackaging=jar -Dfile=/path/to/file

  Alternatively, if you host your own repository you can deploy the file there: 
      mvn deploy:deploy-file -DgroupId=org.apache.maven -DartifactId=maven-archiver -Dversion=2.5
-Dpackaging=jar -Dfile=/path/to/file -Durl=[url] -DrepositoryId=[id]

  Path to dependency: 
  	1) org.apache.maven.plugins:maven-jar-plugin:maven-plugin:2.5-SNAPSHOT
  	2) org.apache.maven:maven-archiver:jar:2.5

----------
1 required artifact is missing.

for artifact: 
  org.apache.maven.plugins:maven-jar-plugin:maven-plugin:2.5-SNAPSHOT

from the specified remote repositories:
  central (http://repo1.maven.org/maven2),
  Nexus (http://repository.apache.org/snapshots)



[INFO] ------------------------------------------------------------------------
[INFO] Error for project: Maven WAR Plugin (during install)
[INFO] ------------------------------------------------------------------------
[INFO] Failed to resolve artifact.

Missing:
----------
1) org.apache.maven:maven-archiver:jar:2.5

  Try downloading the file manually from the project website.

  Then, install it using the command: 
      mvn install:install-file -DgroupId=org.apache.maven -DartifactId=maven-archiver -Dversion=2.5
-Dpackaging=jar -Dfile=/path/to/file

  Alternatively, if you host your own repository you can deploy the file there: 
      mvn deploy:deploy-file -DgroupId=org.apache.maven -DartifactId=maven-archiver -Dversion=2.5
-Dpackaging=jar -Dfile=/path/to/file -Durl=[url] -DrepositoryId=[id]

  Path to dependency: 
  	1) org.apache.maven.plugins:maven-war-plugin:maven-plugin:2.3-SNAPSHOT
  	2) org.apache.maven:maven-archiver:jar:2.5

----------
1 required artifact is missing.

for artifact: 
  org.apache.maven.plugins:maven-war-plugin:maven-plugin:2.3-SNAPSHOT

from the specified remote repositories:
  central (http://repo1.maven.org/maven2),
  Nexus (http://repository.apache.org/snapshots)



[INFO] ------------------------------------------------------------------------
[INFO] For more information, run Maven with the -e switch
[INFO] ------------------------------------------------------------------------
[INFO] BUILD ERRORS
[INFO] ------------------------------------------------------------------------
[INFO] Total time: 41 minutes 44 seconds
[INFO] Finished at: Sat Jan 28 12:46:37 GMT 2012
[INFO] Final Memory: 94M/953M
[INFO] ------------------------------------------------------------------------
Build step 'Invoke top-level Maven targets' marked build as failure


Mime
View raw message