maven-notifications mailing list archives

Site index · List index
Message view « Date » · « Thread »
Top « Date » · « Thread »
From Apache Jenkins Server <jenk...@builds.apache.org>
Subject Build failed in Jenkins: maven-plugins #616
Date Thu, 09 Feb 2012 18:35:11 GMT
See <https://builds.apache.org/job/maven-plugins/616/changes>

Changes:

[olamy] use released version

------------------------------------------
[...truncated 6339 lines...]
[WARNING] Unsupported option <locale/> with variant 'fr_CA_wrong', trying to use <locale/>
without variant, i.e. 'fr_CA'
[WARNING] Source files encoding has not been set, using platform encoding ANSI_X3.4-1968,
i.e. build is platform dependent!
[INFO] snapshot org.apache.maven.plugins.maven-javadoc-plugin.unit:stylesheetfile-test:1.0-SNAPSHOT:
checking for updates from central
[INFO] snapshot org.apache.maven.plugins.maven-javadoc-plugin.unit:helpfile-test:1.0-SNAPSHOT:
checking for updates from central
Tests run: 23, Failures: 0, Errors: 0, Skipped: 0, Time elapsed: 104.493 sec
Running org.apache.maven.plugin.javadoc.JavadocUtilTest
2012-02-09 18:34:58.843::INFO:  jetty-6.1.19
2012-02-09 18:34:58.844::INFO:  Started SocketConnector@vesta.apache.org:47590
2012-02-09 18:34:59.095::INFO:  jetty-6.1.19
2012-02-09 18:34:59.096::INFO:  Started SocketConnector@vesta.apache.org:52206
[ INFO] basic authentication scheme selected
[ INFO] No credentials available for BASIC 'Jetty Proxy Authorization'@vesta.apache.org:52206
2012-02-09 18:34:59.165::INFO:  jetty-6.1.19
2012-02-09 18:34:59.165::INFO:  Started SocketConnector@vesta.apache.org:36555
[ INFO] basic authentication scheme selected
[ INFO] basic authentication scheme selected
2012-02-09 18:34:59.418::INFO:  jetty-6.1.19
2012-02-09 18:34:59.419::INFO:  Started SocketConnector@vesta.apache.org:43038
[ INFO] basic authentication scheme selected
2012-02-09 18:35:02.484::WARN:  EXCEPTION on HttpExchange@32841820=GET//maven.apache.org:80/plugins/maven-javadoc-plugin/apidocs/package-list#6
org.mortbay.jetty.EofException
	at org.mortbay.jetty.HttpGenerator.flush(HttpGenerator.java:787)
	at org.mortbay.jetty.AbstractGenerator$Output.flush(AbstractGenerator.java:568)
	at org.mortbay.jetty.HttpConnection$Output.flush(HttpConnection.java:946)
	at org.mortbay.jetty.AbstractGenerator$Output.write(AbstractGenerator.java:652)
	at org.mortbay.jetty.AbstractGenerator$Output.write(AbstractGenerator.java:579)
	at org.mortbay.proxy.AsyncProxyServlet$1.onResponseContent(AsyncProxyServlet.java:183)
	at org.mortbay.jetty.client.HttpExchange$Listener.onResponseContent(HttpExchange.java:590)
	at org.mortbay.jetty.client.HttpConnection$Handler.content(HttpConnection.java:535)
	at org.mortbay.jetty.HttpParser.parseNext(HttpParser.java:747)
	at org.mortbay.jetty.HttpParser.parseAvailable(HttpParser.java:218)
	at org.mortbay.jetty.client.HttpConnection.handle(HttpConnection.java:269)
	at org.mortbay.io.nio.SelectChannelEndPoint.run(SelectChannelEndPoint.java:409)
	at org.mortbay.thread.QueuedThreadPool$PoolThread.run(QueuedThreadPool.java:520)
Caused by: java.net.SocketException: Broken pipe
	at java.net.SocketOutputStream.socketWrite0(Native Method)
	at java.net.SocketOutputStream.socketWrite(SocketOutputStream.java:92)
	at java.net.SocketOutputStream.write(SocketOutputStream.java:136)
	at org.mortbay.io.ByteArrayBuffer.writeTo(ByteArrayBuffer.java:368)
	at org.mortbay.io.bio.StreamEndPoint.flush(StreamEndPoint.java:122)
	at org.mortbay.io.bio.StreamEndPoint.flush(StreamEndPoint.java:154)
	at org.mortbay.jetty.HttpGenerator.flush(HttpGenerator.java:710)
	... 12 more
2012-02-09 18:35:03.428::WARN:  CONNECTION FAILED on HttpExchange@23060273=GET//maven.apache.org:80/plugins/maven-javadoc-plugin/apidocs/package-list#1
java.nio.channels.ClosedByInterruptException
	at java.nio.channels.spi.AbstractInterruptibleChannel.end(AbstractInterruptibleChannel.java:184)
	at sun.nio.ch.SocketChannelImpl.connect(SocketChannelImpl.java:476)
	at org.mortbay.jetty.client.SelectConnector.startConnection(SelectConnector.java:70)
	at org.mortbay.jetty.client.HttpDestination.startNewConnection(HttpDestination.java:243)
	at org.mortbay.jetty.client.HttpDestination.doSend(HttpDestination.java:474)
	at org.mortbay.jetty.client.HttpDestination.send(HttpDestination.java:420)
	at org.mortbay.jetty.client.HttpClient.send(HttpClient.java:142)
	at org.mortbay.proxy.AsyncProxyServlet.service(AsyncProxyServlet.java:266)
	at org.apache.maven.plugin.javadoc.ProxyServer$AuthAsyncProxyServlet.service(ProxyServer.java:228)
	at org.mortbay.jetty.servlet.ServletHolder.handle(ServletHolder.java:502)
	at org.mortbay.jetty.servlet.ServletHandler.handle(ServletHandler.java:389)
	at org.mortbay.jetty.handler.ContextHandler.handle(ContextHandler.java:765)
	at org.mortbay.jetty.handler.HandlerWrapper.handle(HandlerWrapper.java:152)
	at org.mortbay.jetty.Server.handle(Server.java:326)
	at org.mortbay.jetty.HttpConnection.handleRequest(HttpConnection.java:534)
	at org.mortbay.jetty.HttpConnection$RequestHandler.headerComplete(HttpConnection.java:864)
	at org.mortbay.jetty.HttpParser.parseNext(HttpParser.java:539)
	at org.mortbay.jetty.HttpParser.parseAvailable(HttpParser.java:212)
	at org.mortbay.jetty.HttpConnection.handle(HttpConnection.java:404)
	at org.mortbay.jetty.bio.SocketConnector$Connection.run(SocketConnector.java:228)
	at org.mortbay.thread.QueuedThreadPool$PoolThread.run(QueuedThreadPool.java:520)
2012-02-09 18:35:03.729::INFO:  jetty-6.1.19
2012-02-09 18:35:03.735::INFO:  Started SocketConnector@vesta.apache.org:37224
Tests run: 8, Failures: 0, Errors: 0, Skipped: 0, Time elapsed: 6.659 sec
Running org.apache.maven.plugin.javadoc.TestJavadocReportTest
Tests run: 1, Failures: 0, Errors: 0, Skipped: 0, Time elapsed: 1.064 sec

Results :

Tests run: 53, Failures: 0, Errors: 0, Skipped: 0

[JENKINS] Recording test results
[INFO] 
[INFO] --- maven-jar-plugin:2.3.1:jar (default-jar) @ maven-javadoc-plugin ---
[INFO] Building jar: <https://builds.apache.org/job/maven-plugins/ws/maven-javadoc-plugin/target/maven-javadoc-plugin-2.8.2-SNAPSHOT.jar>
[INFO] 
[INFO] --- maven-plugin-plugin:2.8:addPluginArtifactMetadata (default-addPluginArtifactMetadata)
@ maven-javadoc-plugin ---
[INFO] 
[INFO] --- maven-shade-plugin:1.2.1:shade (default) @ maven-javadoc-plugin ---
[INFO] Excluding org.apache.maven:maven-core:jar:2.0.9 from the shaded jar.
[INFO] Excluding org.apache.maven.wagon:wagon-file:jar:1.0-beta-2 from the shaded jar.
[INFO] Excluding org.apache.maven:maven-plugin-parameter-documenter:jar:2.0.9 from the shaded
jar.
[INFO] Excluding org.apache.maven.wagon:wagon-webdav:jar:1.0-beta-2 from the shaded jar.
[INFO] Excluding slide:slide-webdavlib:jar:2.1 from the shaded jar.
[INFO] Excluding jdom:jdom:jar:1.0 from the shaded jar.
[INFO] Excluding de.zeigermann.xml:xml-im-exporter:jar:1.1 from the shaded jar.
[INFO] Excluding org.apache.maven.wagon:wagon-http-lightweight:jar:1.0-beta-2 from the shaded
jar.
[INFO] Excluding org.apache.maven.wagon:wagon-http-shared:jar:1.0-beta-2 from the shaded jar.
[INFO] Excluding jtidy:jtidy:jar:4aug2000r7-dev from the shaded jar.
[INFO] Excluding xml-apis:xml-apis:jar:1.0.b2 from the shaded jar.
[INFO] Excluding org.apache.maven:maven-profile:jar:2.0.9 from the shaded jar.
[INFO] Excluding org.apache.maven:maven-repository-metadata:jar:2.0.9 from the shaded jar.
[INFO] Excluding org.apache.maven:maven-error-diagnostics:jar:2.0.9 from the shaded jar.
[INFO] Excluding commons-cli:commons-cli:jar:1.0 from the shaded jar.
[INFO] Excluding org.apache.maven.wagon:wagon-ssh-external:jar:1.0-beta-2 from the shaded
jar.
[INFO] Excluding org.apache.maven.wagon:wagon-ssh-common:jar:1.0-beta-2 from the shaded jar.
[INFO] Excluding org.apache.maven:maven-plugin-descriptor:jar:2.0.9 from the shaded jar.
[INFO] Excluding org.codehaus.plexus:plexus-interactivity-api:jar:1.0-alpha-4 from the shaded
jar.
[INFO] Excluding org.apache.maven:maven-monitor:jar:2.0.9 from the shaded jar.
[INFO] Excluding org.apache.maven.wagon:wagon-ssh:jar:1.0-beta-2 from the shaded jar.
[INFO] Excluding com.jcraft:jsch:jar:0.1.27 from the shaded jar.
[INFO] Excluding classworlds:classworlds:jar:1.1 from the shaded jar.
[INFO] Excluding org.apache.maven:maven-project:jar:2.0.9 from the shaded jar.
[INFO] Excluding org.apache.maven:maven-plugin-registry:jar:2.0.9 from the shaded jar.
[INFO] Excluding org.apache.maven:maven-model:jar:2.0.9 from the shaded jar.
[INFO] Excluding org.apache.maven:maven-settings:jar:2.0.9 from the shaded jar.
[INFO] Excluding org.apache.maven:maven-plugin-api:jar:2.0.9 from the shaded jar.
[INFO] Excluding org.apache.maven:maven-artifact:jar:2.0.9 from the shaded jar.
[INFO] Excluding org.apache.maven:maven-artifact-manager:jar:2.0.9 from the shaded jar.
[INFO] Excluding org.apache.maven.reporting:maven-reporting-api:jar:3.0 from the shaded jar.
[INFO] Excluding org.apache.maven:maven-archiver:jar:2.3 from the shaded jar.
[INFO] Excluding org.apache.maven.shared:maven-invoker:jar:2.0.9 from the shaded jar.
[INFO] Excluding org.apache.maven.shared:maven-common-artifact-filters:jar:1.3 from the shaded
jar.
[INFO] Excluding org.apache.maven.doxia:doxia-sink-api:jar:1.0 from the shaded jar.
[INFO] Excluding org.apache.maven.doxia:doxia-site-renderer:jar:1.0 from the shaded jar.
[INFO] Excluding org.apache.maven.doxia:doxia-core:jar:1.0 from the shaded jar.
[INFO] Excluding org.codehaus.plexus:plexus-i18n:jar:1.0-beta-7 from the shaded jar.
[INFO] Excluding org.codehaus.plexus:plexus-velocity:jar:1.1.7 from the shaded jar.
[INFO] Excluding org.apache.velocity:velocity:jar:1.5 from the shaded jar.
[INFO] Excluding oro:oro:jar:2.0.8 from the shaded jar.
[INFO] Excluding org.apache.maven.doxia:doxia-decoration-model:jar:1.0 from the shaded jar.
[INFO] Excluding commons-collections:commons-collections:jar:3.2 from the shaded jar.
[INFO] Excluding org.apache.maven.doxia:doxia-module-apt:jar:1.0 from the shaded jar.
[INFO] Excluding org.apache.maven.doxia:doxia-module-fml:jar:1.0 from the shaded jar.
[INFO] Excluding org.apache.maven.doxia:doxia-module-xdoc:jar:1.0 from the shaded jar.
[INFO] Excluding org.apache.maven.doxia:doxia-module-xhtml:jar:1.0 from the shaded jar.
[INFO] Including org.apache.maven.wagon:wagon-provider-api:jar:1.0-beta-6 in the shaded jar.
[INFO] Excluding commons-lang:commons-lang:jar:2.4 from the shaded jar.
[INFO] Excluding commons-httpclient:commons-httpclient:jar:3.1 from the shaded jar.
[INFO] Excluding commons-codec:commons-codec:jar:1.2 from the shaded jar.
[INFO] Excluding commons-logging:commons-logging:jar:1.1.1 from the shaded jar.
[INFO] Excluding log4j:log4j:jar:1.2.14 from the shaded jar.
[INFO] Excluding com.thoughtworks.qdox:qdox:jar:1.12 from the shaded jar.
[INFO] Excluding org.codehaus.plexus:plexus-container-default:jar:1.0-alpha-9 from the shaded
jar.
[INFO] Excluding org.codehaus.plexus:plexus-archiver:jar:1.0-alpha-9 from the shaded jar.
[INFO] Excluding org.codehaus.plexus:plexus-io:jar:1.0-alpha-1 from the shaded jar.
[INFO] Excluding org.apache.maven:maven-toolchain:jar:1.0 from the shaded jar.
[INFO] Excluding org.codehaus.plexus:plexus-utils:jar:1.5.8 from the shaded jar.
[INFO] Excluding org.mockito:mockito-core:jar:1.8.5 from the shaded jar.
[INFO] Excluding org.hamcrest:hamcrest-core:jar:1.1 from the shaded jar.
[INFO] Excluding org.objenesis:objenesis:jar:1.0 from the shaded jar.
[INFO] Replacing original artifact with shaded artifact.
[INFO] Replacing <https://builds.apache.org/job/maven-plugins/ws/maven-javadoc-plugin/target/maven-javadoc-plugin-2.8.2-SNAPSHOT.jar>
with <https://builds.apache.org/job/maven-plugins/ws/maven-javadoc-plugin/target/maven-javadoc-plugin-2.8.2-SNAPSHOT-shaded.jar>
[INFO] [INFO] Installing <https://builds.apache.org/job/maven-plugins/ws/maven-javadoc-plugin/target/maven-javadoc-plugin-2.8.2-SNAPSHOT.jar>
to /home/hudson/.m2/repository/org/apache/maven/plugins/maven-javadoc-plugin/2.8.2-SNAPSHOT/maven-javadoc-plugin-2.8.2-SNAPSHOT.jar
[INFO] Installing <https://builds.apache.org/job/maven-plugins/ws/maven-javadoc-plugin/pom.xml>
to /home/hudson/.m2/repository/org/apache/maven/plugins/maven-javadoc-plugin/2.8.2-SNAPSHOT/maven-javadoc-plugin-2.8.2-SNAPSHOT.pom

[INFO] --- maven-install-plugin:2.3.1:install (default-install) @ maven-javadoc-plugin ---
[JENKINS] Archiving <https://builds.apache.org/job/maven-plugins/ws/maven-javadoc-plugin/pom.xml>
to /home/hudson/hudson/jobs/maven-plugins/modules/org.apache.maven.plugins$maven-javadoc-plugin/builds/2012-02-09_18-28-42/archive/org.apache.maven.plugins/maven-javadoc-plugin/2.8.2-SNAPSHOT/maven-javadoc-plugin-2.8.2-SNAPSHOT.pom
[JENKINS] Archiving <https://builds.apache.org/job/maven-plugins/ws/maven-javadoc-plugin/target/maven-javadoc-plugin-2.8.2-SNAPSHOT.jar>
to /home/hudson/hudson/jobs/maven-plugins/modules/org.apache.maven.plugins$maven-javadoc-plugin/builds/2012-02-09_18-28-42/archive/org.apache.maven.plugins/maven-javadoc-plugin/2.8.2-SNAPSHOT/maven-javadoc-plugin-2.8.2-SNAPSHOT.jar
[INFO] ------------------------------------------------------------------------
[INFO] Reactor Summary:
[INFO] 
[INFO] Maven Plugins ..................................... SUCCESS [31.645s]
[INFO] Maven ACR Plugin .................................. SUCCESS [35.622s]
[INFO] Maven Ant Plugin .................................. SUCCESS [46.626s]
[INFO] Maven AntRun Plugin ............................... SUCCESS [4.171s]
[INFO] Maven Eclipse Plugin .............................. SUCCESS [32.787s]
[INFO] Maven Assembly Plugin ............................. SUCCESS [23.607s]
[INFO] Maven Changelog Plugin ............................ SUCCESS [8.430s]
[INFO] Maven Changes Report Plugin ....................... SUCCESS [24.114s]
[INFO] Maven Checkstyle Plugin ........................... FAILURE [1.630s]
[INFO] Maven Clean Plugin ................................ SUCCESS [15.555s]
[INFO] Maven Compiler Plugin ............................. SUCCESS [14.130s]
[INFO] Maven Dependency Plugin ........................... SUCCESS [1:05.732s]
[INFO] Maven Deploy Plugin ............................... SUCCESS [5.743s]
[INFO] Maven DOAP Plugin ................................. SUCCESS [10.228s]
[INFO] Maven Documentation Checker Plugin ................ SUCCESS [2.956s]
[INFO] Maven EAR Plugin .................................. SUCCESS [11.975s]
[INFO] Maven EJB Plugin .................................. SUCCESS [8.169s]
[INFO] Maven GPG Plugin .................................. SUCCESS [6.281s]
[INFO] Maven Help Plugin ................................. SUCCESS [8.335s]
[INFO] Maven IDEA Plugin ................................. SUCCESS [16.494s]
[INFO] Maven Install Plugin .............................. SUCCESS [11.939s]
[INFO] Maven JAR Plugin .................................. SUCCESS [4.479s]
[INFO] Maven Jarsigner Plugin ............................ SUCCESS [2.771s]
[INFO] Maven Javadoc Plugin .............................. SUCCESS [3:55.537s]
[INFO] Maven Linkcheck Plugin ............................ SUCCESS [3.068s]
[INFO] Maven One Plugin .................................. SUCCESS [5.323s]
[INFO] Maven Patch Plugin ................................ SUCCESS [3.658s]
[INFO] Maven PDF Plugin .................................. SUCCESS [12.729s]
[INFO] Maven PMD Plugin .................................. SUCCESS [10.872s]
[INFO] Maven RAR Plugin .................................. SUCCESS [4.806s]
[INFO] Maven Reactor Plugin .............................. SUCCESS [4.278s]
[INFO] Maven Repository Plugin ........................... SUCCESS [6.369s]
[INFO] Maven Resources Plugin ............................ SUCCESS [7.659s]
[INFO] Maven Shade Plugin ................................ SUCCESS [10.931s]
[INFO] Maven Site Plugin 3 ............................... SUCCESS [16.085s]
[INFO] Maven Source Plugin ............................... SUCCESS [6.532s]
[INFO] Maven Stage Plugin ................................ SUCCESS [3.205s]
[INFO] Maven Toolchains Plugin ........................... SUCCESS [2.586s]
[INFO] Maven Verifier Plugin ............................. SUCCESS [3.741s]
[INFO] Maven WAR Plugin .................................. SUCCESS [22.837s]
[INFO] Maven Invoker Plugin .............................. SUCCESS [6.904s]
[INFO] Maven Project Info Reports Plugin ................. SUCCESS [29.084s]
[INFO] Maven Remote Resources Plugin ..................... SUCCESS [6.611s]
[INFO] Maven Plugins Aggregator .......................... SUCCESS [0.350s]
[INFO] ------------------------------------------------------------------------
[INFO] BUILD FAILURE
[INFO] ------------------------------------------------------------------------
[INFO] Total time: 6:16.087s (Wall Clock)
[INFO] Finished at: Thu Feb 09 18:35:09 UTC 2012
[INFO] Final Memory: 78M/973M
[INFO] ------------------------------------------------------------------------
Waiting for Jenkins to finish collecting data
mavenExecutionResult exceptions not empty
message : Failed to execute goal on project maven-checkstyle-plugin: Could not resolve dependencies
for project org.apache.maven.plugins:maven-checkstyle-plugin:maven-plugin:2.10-SNAPSHOT: Could
not find artifact org.apache.maven.reporting:maven-reporting-impl:jar:2.2 in central (http://repo.maven.apache.org/maven2)
cause : Could not resolve dependencies for project org.apache.maven.plugins:maven-checkstyle-plugin:maven-plugin:2.10-SNAPSHOT:
Could not find artifact org.apache.maven.reporting:maven-reporting-impl:jar:2.2 in central
(http://repo.maven.apache.org/maven2)
Stack trace : 
org.apache.maven.lifecycle.LifecycleExecutionException: Failed to execute goal on project
maven-checkstyle-plugin: Could not resolve dependencies for project org.apache.maven.plugins:maven-checkstyle-plugin:maven-plugin:2.10-SNAPSHOT:
Could not find artifact org.apache.maven.reporting:maven-reporting-impl:jar:2.2 in central
(http://repo.maven.apache.org/maven2)
	at org.apache.maven.lifecycle.internal.LifecycleDependencyResolver.getDependencies(LifecycleDependencyResolver.java:210)
	at org.apache.maven.lifecycle.internal.LifecycleDependencyResolver.resolveProjectDependencies(LifecycleDependencyResolver.java:117)
	at org.apache.maven.lifecycle.internal.MojoExecutor.ensureDependenciesAreResolved(MojoExecutor.java:258)
	at org.apache.maven.lifecycle.internal.MojoExecutor.execute(MojoExecutor.java:201)
	at org.apache.maven.lifecycle.internal.MojoExecutor.execute(MojoExecutor.java:153)
	at org.apache.maven.lifecycle.internal.MojoExecutor.execute(MojoExecutor.java:145)
	at org.apache.maven.lifecycle.internal.LifecycleModuleBuilder.buildProject(LifecycleModuleBuilder.java:84)
	at org.apache.maven.lifecycle.internal.LifecycleThreadedBuilder$1.call(LifecycleThreadedBuilder.java:167)
	at org.apache.maven.lifecycle.internal.LifecycleThreadedBuilder$1.call(LifecycleThreadedBuilder.java:163)
	at java.util.concurrent.FutureTask$Sync.innerRun(FutureTask.java:269)
	at java.util.concurrent.FutureTask.run(FutureTask.java:123)
	at java.util.concurrent.ThreadPoolExecutor$Worker.runTask(ThreadPoolExecutor.java:651)
	at java.util.concurrent.ThreadPoolExecutor$Worker.run(ThreadPoolExecutor.java:676)
	at java.lang.Thread.run(Thread.java:595)
Caused by: org.apache.maven.project.DependencyResolutionException: Could not resolve dependencies
for project org.apache.maven.plugins:maven-checkstyle-plugin:maven-plugin:2.10-SNAPSHOT: Could
not find artifact org.apache.maven.reporting:maven-reporting-impl:jar:2.2 in central (http://repo.maven.apache.org/maven2)
	at org.apache.maven.project.DefaultProjectDependenciesResolver.resolve(DefaultProjectDependenciesResolver.java:189)
	at org.apache.maven.lifecycle.internal.LifecycleDependencyResolver.getDependencies(LifecycleDependencyResolver.java:185)
	... 13 more
Caused by: org.sonatype.aether.resolution.DependencyResolutionException: Could not find artifact
org.apache.maven.reporting:maven-reporting-impl:jar:2.2 in central (http://repo.maven.apache.org/maven2)
	at org.sonatype.aether.impl.internal.DefaultRepositorySystem.resolveDependencies(DefaultRepositorySystem.java:375)
	at org.apache.maven.project.DefaultProjectDependenciesResolver.resolve(DefaultProjectDependenciesResolver.java:183)
	... 14 more
Caused by: org.sonatype.aether.resolution.ArtifactResolutionException: Could not find artifact
org.apache.maven.reporting:maven-reporting-impl:jar:2.2 in central (http://repo.maven.apache.org/maven2)
	at org.sonatype.aether.impl.internal.DefaultArtifactResolver.resolve(DefaultArtifactResolver.java:538)
	at org.sonatype.aether.impl.internal.DefaultArtifactResolver.resolveArtifacts(DefaultArtifactResolver.java:216)
	at org.sonatype.aether.impl.internal.DefaultRepositorySystem.resolveDependencies(DefaultRepositorySystem.java:358)
	... 15 more
Caused by: org.sonatype.aether.transfer.ArtifactNotFoundException: Could not find artifact
org.apache.maven.reporting:maven-reporting-impl:jar:2.2 in central (http://repo.maven.apache.org/maven2)
	at org.sonatype.aether.connector.wagon.WagonRepositoryConnector$4.wrap(WagonRepositoryConnector.java:947)
	at org.sonatype.aether.connector.wagon.WagonRepositoryConnector$4.wrap(WagonRepositoryConnector.java:941)
	at org.sonatype.aether.connector.wagon.WagonRepositoryConnector$GetTask.run(WagonRepositoryConnector.java:669)
	at org.sonatype.aether.util.concurrency.RunnableErrorForwarder$1.run(RunnableErrorForwarder.java:60)
	... 3 more
Sending e-mails to: notifications@maven.apache.org
channel stopped


Mime
View raw message