maven-notifications mailing list archives

Site index · List index
Message view « Date » · « Thread »
Top « Date » · « Thread »
From Apache Jenkins Server <jenk...@builds.apache.org>
Subject Build failed in Jenkins: maven-site-plugin-3.x » JDK 1.5 (latest),Windows #204
Date Sun, 26 Feb 2012 19:02:21 GMT
See <https://builds.apache.org/job/maven-site-plugin-3.x/./jdk=JDK%201.5%20(latest),label=Windows/204/changes>

Changes:

[olamy] [MSITE-610] No doc for reportPlugins in main goal docs.
improve a bit documentation.

[hboutemy] use Java 5 for loop

[hboutemy] fixed crlf

[hboutemy] use Java 5 for loop

[hboutemy] code formatting

------------------------------------------
[...truncated 856 lines...]

2831 [main] INFO org.apache.maven.plugins.site.SiteDeployWebDavTest - MKCOL path /site/css/.svn/prop-base/
Proxy-Authorization : Basic Zm9vOnRpdGk=
Proxy-Connection : Keep-Alive
Content-Length : 0
Host : toto.com
User-Agent : Jakarta Commons-HttpClient/3.1
Expires : 0
Accept-Encoding : gzip
Cache-store : no-store
Pragma : no-cache
Cache-Control : no-cache

2831 [main] INFO org.apache.maven.plugins.site.SiteDeployWebDavTest - PUT path /site//css/.svn/prop-base/maven-base.css.svn-base
Proxy-Authorization : Basic Zm9vOnRpdGk=
Proxy-Connection : Keep-Alive
Content-Length : 81
Host : toto.com
User-Agent : Jakarta Commons-HttpClient/3.1
Expires : 0
Accept-Encoding : gzip
Cache-store : no-store
Pragma : no-cache
Cache-Control : no-cache

2831 [main] INFO org.apache.maven.plugins.site.SiteDeployWebDavTest - MKCOL path /site/css/.svn/text-base/
Proxy-Authorization : Basic Zm9vOnRpdGk=
Proxy-Connection : Keep-Alive
Content-Length : 0
Host : toto.com
User-Agent : Jakarta Commons-HttpClient/3.1
Expires : 0
Accept-Encoding : gzip
Cache-store : no-store
Pragma : no-cache
Cache-Control : no-cache

2831 [main] INFO org.apache.maven.plugins.site.SiteDeployWebDavTest - PUT path /site//css/.svn/text-base/maven-base.css.svn-base
Proxy-Authorization : Basic Zm9vOnRpdGk=
Proxy-Connection : Keep-Alive
Content-Length : 2310
Host : toto.com
User-Agent : Jakarta Commons-HttpClient/3.1
Expires : 0
Accept-Encoding : gzip
Cache-store : no-store
Pragma : no-cache
Cache-Control : no-cache

2831 [main] INFO org.apache.maven.plugins.site.SiteDeployWebDavTest - MKCOL path /site/css/
Proxy-Authorization : Basic Zm9vOnRpdGk=
Proxy-Connection : Keep-Alive
Content-Length : 0
Host : toto.com
User-Agent : Jakarta Commons-HttpClient/3.1
Expires : 0
Accept-Encoding : gzip
Cache-store : no-store
Pragma : no-cache
Cache-Control : no-cache

2831 [main] INFO org.apache.maven.plugins.site.SiteDeployWebDavTest - PUT path /site//css/maven-base.css
Proxy-Authorization : Basic Zm9vOnRpdGk=
Proxy-Connection : Keep-Alive
Content-Length : 2461
Host : toto.com
User-Agent : Jakarta Commons-HttpClient/3.1
Expires : 0
Accept-Encoding : gzip
Cache-store : no-store
Pragma : no-cache
Cache-Control : no-cache

2831 [main] INFO org.apache.maven.plugins.site.SiteDeployWebDavTest - MKCOL path /site/
Proxy-Authorization : Basic Zm9vOnRpdGk=
Proxy-Connection : Keep-Alive
Content-Length : 0
Host : toto.com
User-Agent : Jakarta Commons-HttpClient/3.1
Expires : 0
Accept-Encoding : gzip
Cache-store : no-store
Pragma : no-cache
Cache-Control : no-cache

2831 [main] INFO org.apache.maven.plugins.site.SiteDeployWebDavTest - PUT path /site//index.html
Proxy-Authorization : Basic Zm9vOnRpdGk=
Proxy-Connection : Keep-Alive
Content-Length : 21549
Host : toto.com
User-Agent : Jakarta Commons-HttpClient/3.1
Expires : 0
Accept-Encoding : gzip
Cache-store : no-store
Pragma : no-cache
Cache-Control : no-cache

2831 [main] INFO org.mortbay.log - Stopped SocketConnector@0.0.0.0:50321
Tests run: 3, Failures: 0, Errors: 0, Skipped: 0, Time elapsed: 3.004 sec
Running org.apache.maven.plugins.site.SiteMojoTest
Tests run: 1, Failures: 0, Errors: 0, Skipped: 0, Time elapsed: 0.552 sec

Results :

Tests run: 5, Failures: 0, Errors: 0, Skipped: 0

[INFO] 
[INFO] --- maven-jar-plugin:2.3.1:jar (default-jar) @ maven-site-plugin ---
[INFO] Building jar: f:\hudson\hudson-slave\workspace\maven-site-plugin-3.x\jdk\JDK 1.5 (latest)\label\Windows\target\maven-site-plugin-3.1-SNAPSHOT.jar
[INFO] 
[INFO] --- maven-plugin-plugin:2.8:addPluginArtifactMetadata (default-addPluginArtifactMetadata)
@ maven-site-plugin ---
[INFO] 
[INFO] --- maven-shade-plugin:1.4:shade (default) @ maven-site-plugin ---
[INFO] Including org.apache.maven.reporting:maven-reporting-api:jar:3.0 in the shaded jar.
[INFO] Excluding org.apache.maven.reporting:maven-reporting-exec:jar:1.0.2-SNAPSHOT from the
shaded jar.
[INFO] Excluding org.apache.velocity:velocity:jar:1.5 from the shaded jar.
[INFO] Excluding oro:oro:jar:2.0.8 from the shaded jar.
[INFO] Excluding velocity:velocity:jar:1.5 from the shaded jar.
[INFO] Including org.apache.maven:maven-artifact:jar:3.0 in the shaded jar.
[INFO] Excluding org.apache.maven:maven-model-builder:jar:3.0 from the shaded jar.
[INFO] Excluding org.codehaus.plexus:plexus-interpolation:jar:1.14 from the shaded jar.
[INFO] Excluding org.sonatype.sisu:sisu-inject-plexus:jar:1.4.2 from the shaded jar.
[INFO] Excluding org.sonatype.sisu:sisu-inject-bean:jar:1.4.2 from the shaded jar.
[INFO] Excluding org.sonatype.sisu:sisu-guice:jar:noaop:2.1.7 from the shaded jar.
[INFO] Excluding org.codehaus.plexus:plexus-component-annotations:jar:1.5.5 from the shaded
jar.
[INFO] Excluding org.apache.maven:maven-core:jar:3.0 from the shaded jar.
[INFO] Excluding org.apache.maven:maven-repository-metadata:jar:3.0 from the shaded jar.
[INFO] Excluding org.apache.maven:maven-aether-provider:jar:3.0 from the shaded jar.
[INFO] Excluding org.sonatype.aether:aether-impl:jar:1.7 from the shaded jar.
[INFO] Excluding org.sonatype.aether:aether-spi:jar:1.7 from the shaded jar.
[INFO] Excluding org.sonatype.aether:aether-api:jar:1.7 from the shaded jar.
[INFO] Excluding org.sonatype.aether:aether-util:jar:1.7 from the shaded jar.
[INFO] Excluding org.codehaus.plexus:plexus-classworlds:jar:2.2.3 from the shaded jar.
[INFO] Excluding org.sonatype.plexus:plexus-sec-dispatcher:jar:1.3 from the shaded jar.
[INFO] Excluding org.sonatype.plexus:plexus-cipher:jar:1.4 from the shaded jar.
[INFO] Excluding org.apache.maven:maven-model:jar:3.0 from the shaded jar.
[INFO] Excluding org.apache.maven:maven-plugin-api:jar:3.0 from the shaded jar.
[INFO] Excluding org.apache.maven:maven-settings:jar:3.0 from the shaded jar.
[INFO] Excluding org.apache.maven:maven-settings-builder:jar:3.0 from the shaded jar.
[INFO] Excluding org.apache.maven:maven-archiver:jar:2.4.2 from the shaded jar.
[INFO] Excluding org.apache.maven.doxia:doxia-sink-api:jar:1.2 from the shaded jar.
[INFO] Excluding org.apache.maven.doxia:doxia-logging-api:jar:1.2 from the shaded jar.
[INFO] Excluding org.codehaus.plexus:plexus-container-default:jar:1.0-alpha-30 from the shaded
jar.
[INFO] Excluding org.apache.maven.doxia:doxia-core:jar:1.2 from the shaded jar.
[INFO] Excluding xerces:xercesImpl:jar:2.9.1 from the shaded jar.
[INFO] Excluding xml-apis:xml-apis:jar:1.3.04 from the shaded jar.
[INFO] Excluding org.apache.httpcomponents:httpclient:jar:4.0.2 from the shaded jar.
[INFO] Excluding org.apache.httpcomponents:httpcore:jar:4.0.1 from the shaded jar.
[INFO] Excluding commons-logging:commons-logging:jar:1.1.1 from the shaded jar.
[INFO] Excluding commons-codec:commons-codec:jar:1.3 from the shaded jar.
[INFO] Excluding org.apache.maven.doxia:doxia-module-xhtml:jar:1.2 from the shaded jar.
[INFO] Excluding org.apache.maven.doxia:doxia-module-apt:jar:1.2 from the shaded jar.
[INFO] Excluding org.apache.maven.doxia:doxia-module-xdoc:jar:1.2 from the shaded jar.
[INFO] Excluding org.apache.maven.doxia:doxia-module-fml:jar:1.2 from the shaded jar.
[INFO] Excluding javax.servlet:servlet-api:jar:2.5 from the shaded jar.
[INFO] Excluding org.apache.maven.doxia:doxia-decoration-model:jar:1.2 from the shaded jar.
[INFO] Excluding org.apache.maven.doxia:doxia-site-renderer:jar:1.2 from the shaded jar.
[INFO] Excluding commons-collections:commons-collections:jar:3.2.1 from the shaded jar.
[INFO] Excluding org.apache.maven.shared:maven-doxia-tools:jar:1.4 from the shaded jar.
[INFO] Excluding org.apache.maven.wagon:wagon-provider-api:jar:1.0 from the shaded jar.
[INFO] Excluding org.codehaus.plexus:plexus-archiver:jar:1.0 from the shaded jar.
[INFO] Excluding org.codehaus.plexus:plexus-io:jar:1.0 from the shaded jar.
[INFO] Excluding org.codehaus.plexus:plexus-i18n:jar:1.0-beta-7 from the shaded jar.
[INFO] Excluding org.codehaus.plexus:plexus-velocity:jar:1.1.8 from the shaded jar.
[INFO] Excluding org.codehaus.plexus:plexus-utils:jar:1.5.10 from the shaded jar.
[INFO] Excluding org.mortbay.jetty:jetty:jar:6.1.25 from the shaded jar.
[INFO] Excluding org.mortbay.jetty:servlet-api:jar:2.5-20081211 from the shaded jar.
[INFO] Excluding org.mortbay.jetty:jetty-util:jar:6.1.25 from the shaded jar.
[INFO] Excluding commons-lang:commons-lang:jar:2.5 from the shaded jar.
[INFO] Excluding commons-io:commons-io:jar:1.4 from the shaded jar.
[INFO] Replacing original artifact with shaded artifact.
[INFO] Replacing f:\hudson\hudson-slave\workspace\maven-site-plugin-3.x\jdk\JDK 1.5 (latest)\label\Windows\target\maven-site-plugin-3.1-SNAPSHOT.jar
with f:\hudson\hudson-slave\workspace\maven-site-plugin-3.x\jdk\JDK 1.5 (latest)\label\Windows\target\maven-site-plugin-3.1-SNAPSHOT-shaded.jar
[INFO] 
[INFO] --- maven-invoker-plugin:1.5:install (integration-test) @ maven-site-plugin ---
[INFO] Installing f:\hudson\hudson-slave\workspace\maven-site-plugin-3.x\jdk\JDK 1.5 (latest)\label\Windows\dependency-reduced-pom.xml
to f:\hudson\hudson-slave\workspace\maven-site-plugin-3.x\jdk\JDK 1.5 (latest)\label\Windows\target\local-repo\org\apache\maven\plugins\maven-site-plugin\3.1-SNAPSHOT\maven-site-plugin-3.1-SNAPSHOT.pom
[INFO] Installing f:\hudson\hudson-slave\workspace\maven-site-plugin-3.x\jdk\JDK 1.5 (latest)\label\Windows\target\maven-site-plugin-3.1-SNAPSHOT.jar
to f:\hudson\hudson-slave\workspace\maven-site-plugin-3.x\jdk\JDK 1.5 (latest)\label\Windows\target\local-repo\org\apache\maven\plugins\maven-site-plugin\3.1-SNAPSHOT\maven-site-plugin-3.1-SNAPSHOT.jar
[INFO] 
[INFO] --- maven-invoker-plugin:1.5:integration-test (integration-test) @ maven-site-plugin
---
[INFO] Building: emma-plugin-it\pom.xml
[INFO] ..SUCCESS (19.2 s)
[INFO] Building: empty-report-set\pom.xml
[INFO] ..SUCCESS (4.7 s)
[INFO] Building: full-reporting\pom.xml
[INFO] ..SUCCESS (105.2 s)
[INFO] Building: inheritedMenus\pom.xml
[INFO] ..SUCCESS (16.6 s)
[INFO] Building: inheritedReports\pom.xml
[INFO] ..SKIPPED 
[INFO] Building: interpolation\pom.xml
[INFO] ..SUCCESS (12.6 s)
[INFO] Building: it-plugin-test\pom.xml
[INFO] ..SUCCESS (11.9 s)
[INFO] Building: MSITE-159\pom.xml
[INFO] ..SUCCESS (8.4 s)
[INFO] Building: MSITE-265\pom.xml
[INFO] ..SUCCESS (32.2 s)
[INFO] Building: MSITE-304\pom.xml
[INFO] ..SUCCESS (11.7 s)
[INFO] Building: MSITE-312\pom.xml
[INFO] ..SUCCESS (6.3 s)
[INFO] Building: MSITE-322\pom.xml
[INFO] ..SUCCESS (15.8 s)
[INFO] Building: MSITE-354\pom.xml
[INFO] ..SUCCESS (12.0 s)
[INFO] Building: MSITE-456\pom.xml
[INFO] ..SUCCESS (7.3 s)
[INFO] Building: MSITE-458\pom.xml
[INFO] ..SUCCESS (19.5 s)
[INFO] Building: MSITE-484\pom.xml
[INFO] ..SUCCESS (15.0 s)
[INFO] Building: MSITE-497\pom.xml
[INFO] ..SUCCESS (33.3 s)
[INFO] Building: MSITE-504\pom.xml
[locks-and-latches] Releasing all the locks
[locks-and-latches] All the locks released
FATAL: hudson.remoting.RequestAbortedException: java.net.SocketException: Socket closed
hudson.remoting.RequestAbortedException: hudson.remoting.RequestAbortedException: java.net.SocketException:
Socket closed
	at hudson.remoting.Request.call(Request.java:149)
	at hudson.remoting.Channel.call(Channel.java:681)
	at hudson.remoting.RemoteInvocationHandler.invoke(RemoteInvocationHandler.java:158)
	at $Proxy29.join(Unknown Source)
	at hudson.Launcher$RemoteLauncher$ProcImpl.join(Launcher.java:859)
	at hudson.Launcher$ProcStarter.join(Launcher.java:345)
	at hudson.tasks.Maven.perform(Maven.java:263)
	at hudson.tasks.BuildStepMonitor$1.perform(BuildStepMonitor.java:19)
	at hudson.model.AbstractBuild$AbstractRunner.perform(AbstractBuild.java:700)
	at hudson.model.Build$RunnerImpl.build(Build.java:178)
	at hudson.model.Build$RunnerImpl.doRun(Build.java:139)
	at hudson.model.AbstractBuild$AbstractRunner.run(AbstractBuild.java:470)
	at hudson.model.Run.run(Run.java:1409)
	at hudson.matrix.MatrixRun.run(MatrixRun.java:146)
	at hudson.model.ResourceController.execute(ResourceController.java:88)
	at hudson.model.Executor.run(Executor.java:238)
Caused by: hudson.remoting.RequestAbortedException: java.net.SocketException: Socket closed
	at hudson.remoting.Request.abort(Request.java:273)
	at hudson.remoting.Channel.terminate(Channel.java:732)
	at hudson.remoting.Channel$ReaderThread.run(Channel.java:1157)
Caused by: java.net.SocketException: Socket closed
	at java.net.SocketInputStream.socketRead0(Native Method)
	at java.net.SocketInputStream.read(SocketInputStream.java:150)
	at java.net.SocketInputStream.read(SocketInputStream.java:121)
	at java.io.BufferedInputStream.fill(BufferedInputStream.java:235)
	at java.io.BufferedInputStream.read(BufferedInputStream.java:254)
	at java.io.ObjectInputStream$PeekInputStream.peek(ObjectInputStream.java:2266)
	at java.io.ObjectInputStream$BlockDataInputStream.peek(ObjectInputStream.java:2559)
	at java.io.ObjectInputStream$BlockDataInputStream.peekByte(ObjectInputStream.java:2569)
	at java.io.ObjectInputStream.readObject0(ObjectInputStream.java:1315)
	at java.io.ObjectInputStream.readObject(ObjectInputStream.java:369)
	at hudson.remoting.Channel$ReaderThread.run(Channel.java:1127)


Mime
View raw message