maven-notifications mailing list archives

Site index · List index
Message view « Date » · « Thread »
Top « Date » · « Thread »
From Apache Jenkins Server <jenk...@builds.apache.org>
Subject Build failed in Jenkins: doxia-tools » JDK 1.5 (latest),Ubuntu #17
Date Sun, 03 Jun 2012 21:09:45 GMT
See <https://builds.apache.org/job/doxia-tools/./jdk=JDK%201.5%20(latest),label=Ubuntu/17/changes>

Changes:

[hboutemy] [DOXIATOOLS-38] use plugin java 5 annotations instead of old-style javadoc annotations

------------------------------------------
[...truncated 369 lines...]
 T E S T S
-------------------------------------------------------
Running org.apache.maven.doxia.book.services.indexer.BookIndexerTest
Tests run: 1, Failures: 0, Errors: 0, Skipped: 0, Time elapsed: 0.354 sec
Running org.apache.maven.doxia.book.services.renderer.docbook.DocBookBookSinkTest
[WARNING] [Docbook Sink] Modified invalid comment: 'Simple comment with ----' to 'Simple comment
with - - - -'
Tests run: 38, Failures: 0, Errors: 0, Skipped: 0, Time elapsed: 0.742 sec
Running org.apache.maven.doxia.book.BookRendererTest
Tests run: 1, Failures: 0, Errors: 0, Skipped: 0, Time elapsed: 0.464 sec

Results :

Tests run: 40, Failures: 0, Errors: 0, Skipped: 0

[INFO] [jar:jar {execution: default-jar}]
[INFO] Building jar: /x1/jenkins/jenkins-slave/workspace/doxia-tools/jdk/JDK 1.5 (latest)/label/Ubuntu/doxia-book-renderer/target/doxia-book-renderer-1.3-SNAPSHOT.jar
[INFO] [install:install {execution: default-install}]
[INFO] Installing /x1/jenkins/jenkins-slave/workspace/doxia-tools/jdk/JDK 1.5 (latest)/label/Ubuntu/doxia-book-renderer/target/doxia-book-renderer-1.3-SNAPSHOT.jar
to /home/jenkins/.m2/repository/org/apache/maven/doxia/doxia-book-renderer/1.3-SNAPSHOT/doxia-book-renderer-1.3-SNAPSHOT.jar
[INFO] ------------------------------------------------------------------------
[INFO] Building Doxia Book Maven Plugin
[INFO]    task-segment: [clean, install]
[INFO] ------------------------------------------------------------------------
[INFO] [clean:clean {execution: default-clean}]
[INFO] [plugin:helpmojo {execution: generated-helpmojo}]
[INFO] Using 'UTF-8' encoding to read mojo metadata.
[INFO] Applying mojo extractor for language: java
[INFO] Mojo extractor for language: java found 0 mojo descriptors.
[INFO] Applying mojo extractor for language: bsh
[INFO] Mojo extractor for language: bsh found 0 mojo descriptors.
[INFO] Applying mojo extractor for language: java-annotations
[INFO] Mojo extractor for language: java-annotations found 0 mojo descriptors.
[INFO] ------------------------------------------------------------------------
[INFO] Building Doxia Tools :: Converter
[INFO]    task-segment: [clean, install]
[INFO] ------------------------------------------------------------------------
[INFO] [clean:clean {execution: default-clean}]
[INFO] [remote-resources:process {execution: default}]
[debug] execute contextualize
[INFO] [resources:resources {execution: default-resources}]
[INFO] Using 'UTF-8' encoding to copy filtered resources.
[INFO] Copying 1 resource
[INFO] Copying 3 resources
[INFO] [compiler:compile {execution: default-compile}]
[INFO] Compiling 13 source files to /x1/jenkins/jenkins-slave/workspace/doxia-tools/jdk/JDK
1.5 (latest)/label/Ubuntu/doxia-converter/target/classes
[INFO] [plexus-component-metadata:generate-metadata {execution: default}]
[debug] execute contextualize
[INFO] [resources:testResources {execution: default-testResources}]
[INFO] Using 'UTF-8' encoding to copy filtered resources.
[INFO] Copying 9 resources
[INFO] Copying 3 resources
[INFO] [compiler:testCompile {execution: default-testCompile}]
[INFO] Compiling 1 source file to /x1/jenkins/jenkins-slave/workspace/doxia-tools/jdk/JDK
1.5 (latest)/label/Ubuntu/doxia-converter/target/test-classes
[INFO] [surefire:test {execution: default-test}]
[INFO] Surefire report directory: /x1/jenkins/jenkins-slave/workspace/doxia-tools/jdk/JDK
1.5 (latest)/label/Ubuntu/doxia-converter/target/surefire-reports

-------------------------------------------------------
 T E S T S
-------------------------------------------------------
Running org.apache.maven.doxia.ConverterTest
[warn] [Apt Sink] Unknown Sink event: 'meta', ignoring!
[warn] [Apt Sink] Unknown Sink event: 'meta', ignoring!
[warn] [Apt Sink] Unknown Sink event: 'meta', ignoring!
[warn] [Docbook Sink] Unknown Sink event: 'meta', ignoring!
Tests run: 16, Failures: 0, Errors: 0, Skipped: 0, Time elapsed: 1.145 sec

Results :

Tests run: 16, Failures: 0, Errors: 0, Skipped: 0

[INFO] [jar:jar {execution: default-jar}]
[INFO] Building jar: /x1/jenkins/jenkins-slave/workspace/doxia-tools/jdk/JDK 1.5 (latest)/label/Ubuntu/doxia-converter/target/doxia-converter-1.3-SNAPSHOT.jar
[INFO] [assembly:single {execution: default}]
[INFO] Reading assembly descriptor: src/main/assembly/jar.xml
[INFO] Processing DependencySet (output=null)
[WARNING] The following patterns were never triggered in this artifact exclusion filter:
o  'junit-addons:junit-addons'
o  'javax.servlet:servlet-api'

[INFO] Building jar: /x1/jenkins/jenkins-slave/workspace/doxia-tools/jdk/JDK 1.5 (latest)/label/Ubuntu/doxia-converter/target/apache-doxia-1.3-SNAPSHOT-jar-with-dependencies.jar
[INFO] [install:install {execution: default-install}]
[INFO] Installing /x1/jenkins/jenkins-slave/workspace/doxia-tools/jdk/JDK 1.5 (latest)/label/Ubuntu/doxia-converter/target/doxia-converter-1.3-SNAPSHOT.jar
to /home/jenkins/.m2/repository/org/apache/maven/doxia/doxia-converter/1.3-SNAPSHOT/doxia-converter-1.3-SNAPSHOT.jar
[INFO] Installing /x1/jenkins/jenkins-slave/workspace/doxia-tools/jdk/JDK 1.5 (latest)/label/Ubuntu/doxia-converter/target/apache-doxia-1.3-SNAPSHOT-jar-with-dependencies.jar
to /home/jenkins/.m2/repository/org/apache/maven/doxia/doxia-converter/1.3-SNAPSHOT/doxia-converter-1.3-SNAPSHOT-jar-with-dependencies.jar
[INFO] ------------------------------------------------------------------------
[INFO] Building Doxia Tools :: Integration Tools
[INFO]    task-segment: [clean, install]
[INFO] ------------------------------------------------------------------------
[INFO] [clean:clean {execution: default-clean}]
[INFO] [remote-resources:process {execution: default}]
[debug] execute contextualize
[INFO] [resources:resources {execution: default-resources}]
[INFO] Using 'UTF-8' encoding to copy filtered resources.
[INFO] Copying 26 resources
[INFO] Copying 3 resources
[INFO] [compiler:compile {execution: default-compile}]
[INFO] Compiling 5 source files to /x1/jenkins/jenkins-slave/workspace/doxia-tools/jdk/JDK
1.5 (latest)/label/Ubuntu/doxia-integration-tools/target/classes
[INFO] [plexus-component-metadata:generate-metadata {execution: default}]
[INFO] Discovered 1 component descriptors(s)
[INFO] [plexus-component-metadata:generate-metadata {execution: create-component-descriptor}]
[INFO] Discovered 1 component descriptors(s)
[debug] execute contextualize
[INFO] [resources:testResources {execution: default-testResources}]
[INFO] Using 'UTF-8' encoding to copy filtered resources.
[INFO] Copying 3 resources
[INFO] Copying 3 resources
[INFO] [compiler:testCompile {execution: default-testCompile}]
[INFO] Compiling 3 source files to /x1/jenkins/jenkins-slave/workspace/doxia-tools/jdk/JDK
1.5 (latest)/label/Ubuntu/doxia-integration-tools/target/test-classes
[INFO] [surefire:test {execution: default-test}]
[INFO] Surefire report directory: /x1/jenkins/jenkins-slave/workspace/doxia-tools/jdk/JDK
1.5 (latest)/label/Ubuntu/doxia-integration-tools/target/surefire-reports

-------------------------------------------------------
 T E S T S
-------------------------------------------------------
Running org.apache.maven.doxia.tools.DefaultSiteToolTest
Tests run: 1, Failures: 0, Errors: 0, Skipped: 0, Time elapsed: 0.02 sec
Running org.apache.maven.doxia.tools.SiteToolTest
[INFO] artifact org.apache.maven.skins:maven-stylus-skin: checking for updates from central
[INFO] Unable to find resource 'org.apache.maven:maven-site:xml:site_en:1.0' in repository
central (http://repo1.maven.org/maven2)
Tests run: 7, Failures: 0, Errors: 0, Skipped: 0, Time elapsed: 2.736 sec

Results :

Tests run: 8, Failures: 0, Errors: 0, Skipped: 0

[INFO] [jar:jar {execution: default-jar}]
[INFO] Building jar: /x1/jenkins/jenkins-slave/workspace/doxia-tools/jdk/JDK 1.5 (latest)/label/Ubuntu/doxia-integration-tools/target/doxia-integration-tools-1.5-SNAPSHOT.jar
[INFO] [install:install {execution: default-install}]
[INFO] Installing /x1/jenkins/jenkins-slave/workspace/doxia-tools/jdk/JDK 1.5 (latest)/label/Ubuntu/doxia-integration-tools/target/doxia-integration-tools-1.5-SNAPSHOT.jar
to /home/jenkins/.m2/repository/org/apache/maven/doxia/doxia-integration-tools/1.5-SNAPSHOT/doxia-integration-tools-1.5-SNAPSHOT.jar
[INFO] ------------------------------------------------------------------------
[INFO] Building Doxia Tools :: Linkcheck
[INFO]    task-segment: [clean, install]
[INFO] ------------------------------------------------------------------------
[INFO] [clean:clean {execution: default-clean}]
[INFO] [modello:java {execution: linkcheck}]
[INFO] outputDirectory: /x1/jenkins/jenkins-slave/workspace/doxia-tools/jdk/JDK 1.5 (latest)/label/Ubuntu/doxia-linkcheck/target/generated-sources/modello
[INFO] Working on model: src/main/mdo/linkcheck.mdo
[INFO] Generating current version: 1.0.0
[INFO] [modello:xpp3-reader {execution: linkcheck}]
[INFO] outputDirectory: /x1/jenkins/jenkins-slave/workspace/doxia-tools/jdk/JDK 1.5 (latest)/label/Ubuntu/doxia-linkcheck/target/generated-sources/modello
[INFO] Working on model: src/main/mdo/linkcheck.mdo
[INFO] Generating current version: 1.0.0
[INFO] [modello:xpp3-writer {execution: linkcheck}]
[INFO] outputDirectory: /x1/jenkins/jenkins-slave/workspace/doxia-tools/jdk/JDK 1.5 (latest)/label/Ubuntu/doxia-linkcheck/target/generated-sources/modello
[INFO] Working on model: src/main/mdo/linkcheck.mdo
[INFO] Generating current version: 1.0.0
[INFO] [modello:java {execution: httpbean}]
[INFO] outputDirectory: /x1/jenkins/jenkins-slave/workspace/doxia-tools/jdk/JDK 1.5 (latest)/label/Ubuntu/doxia-linkcheck/target/generated-sources/modello
[INFO] Working on model: src/main/mdo/httpbean.mdo
[INFO] Generating current version: 1.0.0
[INFO] [remote-resources:process {execution: default}]
[debug] execute contextualize
[INFO] [resources:resources {execution: default-resources}]
[INFO] Using 'UTF-8' encoding to copy filtered resources.
[INFO] Copying 1 resource
[INFO] Copying 3 resources
[INFO] [compiler:compile {execution: default-compile}]
[INFO] Compiling 21 source files to /x1/jenkins/jenkins-slave/workspace/doxia-tools/jdk/JDK
1.5 (latest)/label/Ubuntu/doxia-linkcheck/target/classes
[INFO] [plexus-component-metadata:generate-metadata {execution: default}]
[INFO] Discovered 1 component descriptors(s)
[debug] execute contextualize
[INFO] [resources:testResources {execution: default-testResources}]
[INFO] Using 'UTF-8' encoding to copy filtered resources.
[INFO] Copying 10 resources
[INFO] Copying 3 resources
[INFO] [compiler:testCompile {execution: default-testCompile}]
[INFO] Compiling 5 source files to /x1/jenkins/jenkins-slave/workspace/doxia-tools/jdk/JDK
1.5 (latest)/label/Ubuntu/doxia-linkcheck/target/test-classes
[INFO] [surefire:test {execution: default-test}]
[INFO] Surefire report directory: /x1/jenkins/jenkins-slave/workspace/doxia-tools/jdk/JDK
1.5 (latest)/label/Ubuntu/doxia-linkcheck/target/surefire-reports

-------------------------------------------------------
 T E S T S
-------------------------------------------------------
Running org.apache.maven.doxia.linkcheck.LinkCheckTest
[ INFO] Begin to check links in files...
[ INFO] Links checked.
Tests run: 1, Failures: 0, Errors: 0, Skipped: 0, Time elapsed: 0.784 sec
Running org.apache.maven.doxia.linkcheck.AnchorLinkTest
[ INFO] Begin to check links in files...
[ INFO] Links checked.
Tests run: 1, Failures: 0, Errors: 0, Skipped: 0, Time elapsed: 0.014 sec
Running org.apache.maven.doxia.linkcheck.validation.AnchorsTest
Tests run: 1, Failures: 0, Errors: 0, Skipped: 0, Time elapsed: 0.001 sec
Running org.apache.maven.doxia.linkcheck.validation.LinkValidatorManagerTest
Tests run: 1, Failures: 0, Errors: 0, Skipped: 0, Time elapsed: 0 sec
Running org.apache.maven.doxia.linkcheck.validation.HTTPLinkValidatorTest
Tests run: 1, Failures: 0, Errors: 0, Skipped: 0, Time elapsed: 0.002 sec

Results :

Tests run: 5, Failures: 0, Errors: 0, Skipped: 0

[INFO] [jar:jar {execution: default-jar}]
[INFO] Building jar: /x1/jenkins/jenkins-slave/workspace/doxia-tools/jdk/JDK 1.5 (latest)/label/Ubuntu/doxia-linkcheck/target/doxia-linkcheck-1.3-SNAPSHOT.jar
[INFO] [install:install {execution: default-install}]
[INFO] Installing /x1/jenkins/jenkins-slave/workspace/doxia-tools/jdk/JDK 1.5 (latest)/label/Ubuntu/doxia-linkcheck/target/doxia-linkcheck-1.3-SNAPSHOT.jar
to /home/jenkins/.m2/repository/org/apache/maven/doxia/doxia-linkcheck/1.3-SNAPSHOT/doxia-linkcheck-1.3-SNAPSHOT.jar
[INFO] 
[INFO] 
[INFO] ------------------------------------------------------------------------
[INFO] Reactor Summary:
[INFO] ------------------------------------------------------------------------
[INFO] Doxia Tools ........................................... SUCCESS [7.397s]
[INFO] Doxia Book Renderer ................................... SUCCESS [5.714s]
[INFO] Doxia Book Maven Plugin ............................... FAILED [1.964s]
[INFO] Doxia Tools :: Converter .............................. SUCCESS [11.543s]
[INFO] Doxia Tools :: Integration Tools ...................... SUCCESS [4.339s]
[INFO] Doxia Tools :: Linkcheck .............................. SUCCESS [2.219s]
[INFO] ------------------------------------------------------------------------
[INFO] Error for project: Doxia Book Maven Plugin (during install)
[INFO] ------------------------------------------------------------------------
[INFO] Error extracting plugin descriptor: 'No mojo definitions were found for plugin: org.apache.maven.doxia:doxia-book-maven-plugin.'

[INFO] ------------------------------------------------------------------------
[INFO] Trace
org.apache.maven.lifecycle.LifecycleExecutionException: Error extracting plugin descriptor:
'No mojo definitions were found for plugin: org.apache.maven.doxia:doxia-book-maven-plugin.'
	at org.apache.maven.lifecycle.DefaultLifecycleExecutor.executeGoals(DefaultLifecycleExecutor.java:719)
	at org.apache.maven.lifecycle.DefaultLifecycleExecutor.executeGoalWithLifecycle(DefaultLifecycleExecutor.java:556)
	at org.apache.maven.lifecycle.DefaultLifecycleExecutor.executeGoal(DefaultLifecycleExecutor.java:535)
	at org.apache.maven.lifecycle.DefaultLifecycleExecutor.executeGoalAndHandleFailures(DefaultLifecycleExecutor.java:387)
	at org.apache.maven.lifecycle.DefaultLifecycleExecutor.executeTaskSegments(DefaultLifecycleExecutor.java:348)
	at org.apache.maven.lifecycle.DefaultLifecycleExecutor.execute(DefaultLifecycleExecutor.java:180)
	at org.apache.maven.DefaultMaven.doExecute(DefaultMaven.java:328)
	at org.apache.maven.DefaultMaven.execute(DefaultMaven.java:138)
	at org.apache.maven.cli.MavenCli.main(MavenCli.java:362)
	at org.apache.maven.cli.compat.CompatibleMain.main(CompatibleMain.java:60)
	at sun.reflect.NativeMethodAccessorImpl.invoke0(Native Method)
	at sun.reflect.NativeMethodAccessorImpl.invoke(NativeMethodAccessorImpl.java:39)
	at sun.reflect.DelegatingMethodAccessorImpl.invoke(DelegatingMethodAccessorImpl.java:25)
	at java.lang.reflect.Method.invoke(Method.java:592)
	at org.codehaus.classworlds.Launcher.launchEnhanced(Launcher.java:315)
	at org.codehaus.classworlds.Launcher.launch(Launcher.java:255)
	at org.codehaus.classworlds.Launcher.mainWithExitCode(Launcher.java:430)
	at org.codehaus.classworlds.Launcher.main(Launcher.java:375)
Caused by: org.apache.maven.plugin.MojoExecutionException: Error extracting plugin descriptor:
'No mojo definitions were found for plugin: org.apache.maven.doxia:doxia-book-maven-plugin.'
	at org.apache.maven.plugin.plugin.AbstractGeneratorMojo.execute(AbstractGeneratorMojo.java:257)
	at org.apache.maven.plugin.plugin.HelpGeneratorMojo.execute(HelpGeneratorMojo.java:88)
	at org.apache.maven.plugin.DefaultPluginManager.executeMojo(DefaultPluginManager.java:490)
	at org.apache.maven.lifecycle.DefaultLifecycleExecutor.executeGoals(DefaultLifecycleExecutor.java:694)
	... 17 more
Caused by: org.apache.maven.plugin.descriptor.InvalidPluginDescriptorException: No mojo definitions
were found for plugin: org.apache.maven.doxia:doxia-book-maven-plugin.
	at org.apache.maven.tools.plugin.scanner.DefaultMojoScanner.populatePluginDescriptor(DefaultMojoScanner.java:126)
	at org.apache.maven.plugin.plugin.AbstractGeneratorMojo.execute(AbstractGeneratorMojo.java:245)
	... 20 more
[INFO] ------------------------------------------------------------------------
[INFO] BUILD ERRORS
[INFO] ------------------------------------------------------------------------
[INFO] Total time: 33 seconds
[INFO] Finished at: Sun Jun 03 21:09:45 GMT 2012
[INFO] Final Memory: 72M/274M
[INFO] ------------------------------------------------------------------------
Build step 'Invoke top-level Maven targets' marked build as failure

Mime
View raw message