maven-notifications mailing list archives

Site index · List index
Message view « Date » · « Thread »
Top « Date » · « Thread »
From Apache Jenkins Server <jenk...@builds.apache.org>
Subject Build failed in Jenkins: maven-plugins-ITs-m3 #481
Date Fri, 08 Jun 2012 21:49:25 GMT
See <https://builds.apache.org/job/maven-plugins-ITs-m3/481/changes>

Changes:

[olamy] [MPMD-151] Use canonical paths for the file list / Unit test failures on builds.apache.org
Submitted by Andreas Dangel.

------------------------------------------
[...truncated 9175 lines...]
[INFO] 
[INFO] --- maven-invoker-plugin:1.5:verify (integration-test) @ maven-project-info-reports-plugin
---
[INFO] -------------------------------------------------
[INFO] Build Summary:
[INFO]   Passed: 2, Failed: 0, Errors: 0, Skipped: 0
[INFO] -------------------------------------------------
[INFO] 
[INFO] --- maven-install-plugin:2.3.1:install (default-install) @ maven-project-info-reports-plugin
---
[INFO] Installing <https://builds.apache.org/job/maven-plugins-ITs-m3/ws/maven-project-info-reports-plugin/target/maven-project-info-reports-plugin-2.4.1-SNAPSHOT.jar>
to <https://builds.apache.org/job/maven-plugins-ITs-m3/ws/.repository/org/apache/maven/plugins/maven-project-info-reports-plugin/2.4.1-SNAPSHOT/maven-project-info-reports-plugin-2.4.1-SNAPSHOT.jar>
[INFO] Installing <https://builds.apache.org/job/maven-plugins-ITs-m3/ws/maven-project-info-reports-plugin/pom.xml>
to <https://builds.apache.org/job/maven-plugins-ITs-m3/ws/.repository/org/apache/maven/plugins/maven-project-info-reports-plugin/2.4.1-SNAPSHOT/maven-project-info-reports-plugin-2.4.1-SNAPSHOT.pom>
[INFO]                                                                         
[INFO] ------------------------------------------------------------------------
[INFO] Building Maven Remote Resources Plugin 1.4-SNAPSHOT
[INFO] ------------------------------------------------------------------------
[INFO] 
[INFO] --- maven-clean-plugin:2.4.1:clean (default-clean) @ maven-remote-resources-plugin
---
[INFO] Deleting <https://builds.apache.org/job/maven-plugins-ITs-m3/ws/maven-remote-resources-plugin/target>
[INFO] 
[INFO] --- maven-enforcer-plugin:1.0.1:enforce (ensure-no-container-api) @ maven-remote-resources-plugin
---
[INFO] 
[INFO] --- maven-plugin-plugin:2.8:helpmojo (generated-helpmojo) @ maven-remote-resources-plugin
---
[INFO] Using 'UTF-8' encoding to read mojo metadata.
[INFO] Applying mojo extractor for language: java
[INFO] Mojo extractor for language: java found 2 mojo descriptors.
[INFO] Applying mojo extractor for language: bsh
[INFO] Mojo extractor for language: bsh found 0 mojo descriptors.
[INFO] 
[INFO] --- modello-maven-plugin:1.4.1:xpp3-writer (remote-resources) @ maven-remote-resources-plugin
---
[INFO] outputDirectory: <https://builds.apache.org/job/maven-plugins-ITs-m3/ws/maven-remote-resources-plugin/target/generated-sources/modello>
[INFO] Working on model: src/main/mdo/remote-resources.mdo
[INFO] Generating current version: 1.1.0
[INFO] 
[INFO] --- modello-maven-plugin:1.4.1:java (remote-resources) @ maven-remote-resources-plugin
---
[INFO] outputDirectory: <https://builds.apache.org/job/maven-plugins-ITs-m3/ws/maven-remote-resources-plugin/target/generated-sources/modello>
[INFO] Working on model: src/main/mdo/remote-resources.mdo
[INFO] Generating current version: 1.1.0
[INFO] 
[INFO] --- modello-maven-plugin:1.4.1:xpp3-reader (remote-resources) @ maven-remote-resources-plugin
---
[INFO] outputDirectory: <https://builds.apache.org/job/maven-plugins-ITs-m3/ws/maven-remote-resources-plugin/target/generated-sources/modello>
[INFO] Working on model: src/main/mdo/remote-resources.mdo
[INFO] Generating current version: 1.1.0
[INFO] 
[INFO] --- modello-maven-plugin:1.4.1:xpp3-writer (supplemental-models) @ maven-remote-resources-plugin
---
[INFO] outputDirectory: <https://builds.apache.org/job/maven-plugins-ITs-m3/ws/maven-remote-resources-plugin/target/generated-sources/modello>
[INFO] Working on model: src/main/mdo/supplemental-model.mdo
[INFO] Generating current version: 1.0.0
[INFO] 
[INFO] --- modello-maven-plugin:1.4.1:java (supplemental-models) @ maven-remote-resources-plugin
---
[INFO] outputDirectory: <https://builds.apache.org/job/maven-plugins-ITs-m3/ws/maven-remote-resources-plugin/target/generated-sources/modello>
[INFO] Working on model: src/main/mdo/supplemental-model.mdo
[INFO] Generating current version: 1.0.0
[INFO] 
[INFO] --- modello-maven-plugin:1.4.1:xpp3-reader (supplemental-models) @ maven-remote-resources-plugin
---
[INFO] outputDirectory: <https://builds.apache.org/job/maven-plugins-ITs-m3/ws/maven-remote-resources-plugin/target/generated-sources/modello>
[INFO] Working on model: src/main/mdo/supplemental-model.mdo
[INFO] Generating current version: 1.0.0
[INFO] 
[INFO] --- maven-plugin-plugin:2.8:descriptor (default-descriptor) @ maven-remote-resources-plugin
---
[INFO] Using 'UTF-8' encoding to read mojo metadata.
[INFO] Applying mojo extractor for language: java
[INFO] Mojo extractor for language: java found 3 mojo descriptors.
[INFO] Applying mojo extractor for language: bsh
[INFO] Mojo extractor for language: bsh found 0 mojo descriptors.
[INFO] 
[INFO] --- maven-remote-resources-plugin:1.2.1:process (default) @ maven-remote-resources-plugin
---
[INFO] 
[INFO] --- maven-resources-plugin:2.5:resources (default-resources) @ maven-remote-resources-plugin
---
[debug] execute contextualize
[INFO] Using 'UTF-8' encoding to copy filtered resources.
[INFO] Copying 1 resource
[INFO] Copying 3 resources
[INFO] 
[INFO] --- maven-compiler-plugin:2.3.2:compile (default-compile) @ maven-remote-resources-plugin
---
[INFO] Compiling 11 source files to <https://builds.apache.org/job/maven-plugins-ITs-m3/ws/maven-remote-resources-plugin/target/classes>
[INFO] 
[INFO] --- maven-resources-plugin:2.5:testResources (default-testResources) @ maven-remote-resources-plugin
---
[debug] execute contextualize
[INFO] Using 'UTF-8' encoding to copy filtered resources.
[INFO] Copying 7 resources
[INFO] Copying 46 resources
[INFO] Copying 1 resource
[INFO] Copying 3 resources
[INFO] 
[INFO] --- maven-compiler-plugin:2.3.2:testCompile (default-testCompile) @ maven-remote-resources-plugin
---
[INFO] Compiling 18 source files to <https://builds.apache.org/job/maven-plugins-ITs-m3/ws/maven-remote-resources-plugin/target/test-classes>
[INFO] 
[INFO] --- maven-surefire-plugin:2.9:test (default-test) @ maven-remote-resources-plugin ---
[INFO] Surefire report directory: <https://builds.apache.org/job/maven-plugins-ITs-m3/ws/maven-remote-resources-plugin/target/surefire-reports>

-------------------------------------------------------
 T E S T S
-------------------------------------------------------
Running org.apache.maven.plugin.resources.remote.RemoteResourcesMojoTest
Tests run: 10, Failures: 0, Errors: 0, Skipped: 0, Time elapsed: 1.326 sec

Results :

Tests run: 10, Failures: 0, Errors: 0, Skipped: 0

[INFO] 
[INFO] --- maven-jar-plugin:2.3.1:jar (default-jar) @ maven-remote-resources-plugin ---
[INFO] Building jar: <https://builds.apache.org/job/maven-plugins-ITs-m3/ws/maven-remote-resources-plugin/target/maven-remote-resources-plugin-1.4-SNAPSHOT.jar>
[INFO] 
[INFO] --- maven-plugin-plugin:2.8:addPluginArtifactMetadata (default-addPluginArtifactMetadata)
@ maven-remote-resources-plugin ---
[INFO] 
[INFO] --- maven-invoker-plugin:1.5:install (integration-test) @ maven-remote-resources-plugin
---
[INFO] Installing <https://builds.apache.org/job/maven-plugins-ITs-m3/ws/maven-remote-resources-plugin/pom.xml>
to <https://builds.apache.org/job/maven-plugins-ITs-m3/ws/maven-remote-resources-plugin/target/local-repo/org/apache/maven/plugins/maven-remote-resources-plugin/1.4-SNAPSHOT/maven-remote-resources-plugin-1.4-SNAPSHOT.pom>
[INFO] Installing <https://builds.apache.org/job/maven-plugins-ITs-m3/ws/maven-remote-resources-plugin/target/maven-remote-resources-plugin-1.4-SNAPSHOT.jar>
to <https://builds.apache.org/job/maven-plugins-ITs-m3/ws/maven-remote-resources-plugin/target/local-repo/org/apache/maven/plugins/maven-remote-resources-plugin/1.4-SNAPSHOT/maven-remote-resources-plugin-1.4-SNAPSHOT.jar>
[INFO] 
[INFO] --- maven-invoker-plugin:1.5:install (install-descriptor) @ maven-remote-resources-plugin
---
[INFO] Installing <https://builds.apache.org/job/maven-plugins-ITs-m3/ws/maven-remote-resources-plugin/pom.xml>
to <https://builds.apache.org/job/maven-plugins-ITs-m3/ws/maven-remote-resources-plugin/target/it-repo/org/apache/maven/plugins/maven-remote-resources-plugin/1.4-SNAPSHOT/maven-remote-resources-plugin-1.4-SNAPSHOT.pom>
[INFO] Installing <https://builds.apache.org/job/maven-plugins-ITs-m3/ws/maven-remote-resources-plugin/target/maven-remote-resources-plugin-1.4-SNAPSHOT.jar>
to <https://builds.apache.org/job/maven-plugins-ITs-m3/ws/maven-remote-resources-plugin/target/it-repo/org/apache/maven/plugins/maven-remote-resources-plugin/1.4-SNAPSHOT/maven-remote-resources-plugin-1.4-SNAPSHOT.jar>
[INFO] 
[INFO] --- maven-failsafe-plugin:2.9:integration-test (integration-tests) @ maven-remote-resources-plugin
---
[INFO] Failsafe report directory: <https://builds.apache.org/job/maven-plugins-ITs-m3/ws/maven-remote-resources-plugin/target/failsafe-reports>

-------------------------------------------------------
 T E S T S
-------------------------------------------------------
Running org.apache.maven.plugin.resources.remote.it.IT_GenerateFromOverride
Tests run: 1, Failures: 0, Errors: 1, Skipped: 0, Time elapsed: 5.871 sec <<< FAILURE!
Running org.apache.maven.plugin.resources.remote.it.IT_CustomFilterDelimiter
Tests run: 1, Failures: 0, Errors: 1, Skipped: 0, Time elapsed: 1.376 sec <<< FAILURE!
Running org.apache.maven.plugin.resources.remote.it.IT_RunOnlyAtExecutionRoot
Tests run: 1, Failures: 0, Errors: 1, Skipped: 0, Time elapsed: 5.003 sec <<< FAILURE!
Running org.apache.maven.plugin.resources.remote.it.IT_SupplementalArtifact
Tests run: 1, Failures: 0, Errors: 1, Skipped: 0, Time elapsed: 5.487 sec <<< FAILURE!
Running org.apache.maven.plugin.resources.remote.it.IT_GetDependencyProjects
Tests run: 1, Failures: 0, Errors: 1, Skipped: 0, Time elapsed: 4.921 sec <<< FAILURE!
Running org.apache.maven.plugin.resources.remote.it.IT_GenerateFromBundleWithTypeAndClassifier
Tests run: 1, Failures: 0, Errors: 1, Skipped: 0, Time elapsed: 1.46 sec <<< FAILURE!
Running org.apache.maven.plugin.resources.remote.it.IT_BadDependencyPoms
Tests run: 1, Failures: 0, Errors: 1, Skipped: 0, Time elapsed: 1.387 sec <<< FAILURE!
Running org.apache.maven.plugin.resources.remote.it.IT_GenerateFromBundle
Tests run: 1, Failures: 0, Errors: 1, Skipped: 0, Time elapsed: 1.423 sec <<< FAILURE!
Running org.apache.maven.plugin.resources.remote.it.IT_FilterLocalOverride
Tests run: 1, Failures: 0, Errors: 1, Skipped: 0, Time elapsed: 1.388 sec <<< FAILURE!

Results :

Tests in error: 
  test(org.apache.maven.plugin.resources.remote.it.IT_GenerateFromOverride): Exit code was
non-zero: 1; command line and log = 
  test(org.apache.maven.plugin.resources.remote.it.IT_CustomFilterDelimiter): Exit code was
non-zero: 1; command line and log = 
  test(org.apache.maven.plugin.resources.remote.it.IT_RunOnlyAtExecutionRoot): Exit code was
non-zero: 1; command line and log = 
  test(org.apache.maven.plugin.resources.remote.it.IT_SupplementalArtifact): Exit code was
non-zero: 1; command line and log = 
  test(org.apache.maven.plugin.resources.remote.it.IT_GetDependencyProjects): Exit code was
non-zero: 1; command line and log = 
  test(org.apache.maven.plugin.resources.remote.it.IT_GenerateFromBundleWithTypeAndClassifier):
Exit code was non-zero: 1; command line and log = 
  test(org.apache.maven.plugin.resources.remote.it.IT_BadDependencyPoms): Exit code was non-zero:
1; command line and log = 
  test(org.apache.maven.plugin.resources.remote.it.IT_GenerateFromBundle): Exit code was non-zero:
1; command line and log = 
  test(org.apache.maven.plugin.resources.remote.it.IT_FilterLocalOverride): Exit code was
non-zero: 1; command line and log = 

Tests run: 9, Failures: 0, Errors: 9, Skipped: 0

[WARNING] File encoding has not been set, using platform encoding ANSI_X3.4-1968, i.e. build
is platform dependent!
[INFO] 
[INFO] --- maven-invoker-plugin:1.5:integration-test (integration-test) @ maven-remote-resources-plugin
---
[INFO] Building: maven-remote-resources-test/pom.xml
[INFO] ..SUCCESS (4.5 s)
[INFO] 
[INFO] --- maven-failsafe-plugin:2.9:verify (integration-tests) @ maven-remote-resources-plugin
---
[INFO] Failsafe report directory: <https://builds.apache.org/job/maven-plugins-ITs-m3/ws/maven-remote-resources-plugin/target/failsafe-reports>
[WARNING] File encoding has not been set, using platform encoding ANSI_X3.4-1968, i.e. build
is platform dependent!
[INFO]                                                                         
[INFO] ------------------------------------------------------------------------
[INFO] Building Maven Plugins Aggregator 1-SNAPSHOT
[INFO] ------------------------------------------------------------------------
[INFO] 
[INFO] --- maven-clean-plugin:2.4.1:clean (default-clean) @ maven-plugins-aggregator ---
[INFO] Deleting <https://builds.apache.org/job/maven-plugins-ITs-m3/ws/target>
[INFO] 
[INFO] --- maven-remote-resources-plugin:1.1:process (default) @ maven-plugins-aggregator
---
[INFO] 
[INFO] --- maven-install-plugin:2.3.1:install (default-install) @ maven-plugins-aggregator
---
[INFO] Installing <https://builds.apache.org/job/maven-plugins-ITs-m3/ws/pom.xml> to
<https://builds.apache.org/job/maven-plugins-ITs-m3/ws/.repository/org/apache/maven/plugins/maven-plugins-aggregator/1-SNAPSHOT/maven-plugins-aggregator-1-SNAPSHOT.pom>
[INFO] ------------------------------------------------------------------------
[INFO] Reactor Summary:
[INFO] 
[INFO] Maven Plugins ..................................... SUCCESS [33.592s]
[INFO] Maven ACR Plugin .................................. SUCCESS [23.585s]
[INFO] Maven Ant Plugin .................................. SUCCESS [1:34.672s]
[INFO] Maven AntRun Plugin ............................... SUCCESS [1:04.217s]
[INFO] Maven Eclipse Plugin .............................. SUCCESS [11:35.039s]
[INFO] Maven Assembly Plugin ............................. SUCCESS [13:13.605s]
[INFO] Maven Changelog Plugin ............................ SUCCESS [1:05.039s]
[INFO] Maven Changes Report Plugin ....................... SUCCESS [2:00.209s]
[INFO] Maven Checkstyle Plugin ........................... SUCCESS [1:49.254s]
[INFO] Maven Clean Plugin ................................ SUCCESS [31.029s]
[INFO] Maven Compiler Plugin ............................. SUCCESS [46.051s]
[INFO] Maven Dependency Plugin ........................... SUCCESS [2:15.319s]
[INFO] Maven Deploy Plugin ............................... SUCCESS [1:25.621s]
[INFO] Maven DOAP Plugin ................................. SUCCESS [18.656s]
[INFO] Maven Documentation Checker Plugin ................ SUCCESS [8.371s]
[INFO] Maven EAR Plugin .................................. SUCCESS [3:55.940s]
[INFO] Maven EJB Plugin .................................. SUCCESS [28.293s]
[INFO] Maven GPG Plugin .................................. SUCCESS [54.229s]
[INFO] Maven Help Plugin ................................. SUCCESS [45.436s]
[INFO] Maven IDEA Plugin ................................. SUCCESS [8.018s]
[INFO] Maven Install Plugin .............................. SUCCESS [55.940s]
[INFO] Maven JAR Plugin .................................. SUCCESS [1:20.242s]
[INFO] Maven Jarsigner Plugin ............................ SUCCESS [40.375s]
[INFO] Maven Javadoc Plugin .............................. SUCCESS [7:17.002s]
[INFO] Maven Linkcheck Plugin ............................ SUCCESS [2.116s]
[INFO] Maven One Plugin .................................. SUCCESS [3.104s]
[INFO] Maven Patch Plugin ................................ SUCCESS [12.672s]
[INFO] Maven PDF Plugin .................................. SUCCESS [30.735s]
[INFO] Maven PMD Plugin .................................. SUCCESS [52.347s]
[INFO] Maven RAR Plugin .................................. SUCCESS [8.430s]
[INFO] Maven Reactor Plugin .............................. SUCCESS [2.834s]
[INFO] Maven Repository Plugin ........................... FAILURE [18.997s]
[INFO] Maven Resources Plugin ............................ SUCCESS [1:05.243s]
[INFO] Maven Shade Plugin ................................ SUCCESS [3:43.977s]
[INFO] Maven Site Plugin 3 ............................... FAILURE [9:19.453s]
[INFO] Maven Source Plugin ............................... SUCCESS [32.772s]
[INFO] Maven Stage Plugin ................................ SUCCESS [1.960s]
[INFO] Maven Toolchains Plugin ........................... SUCCESS [1.418s]
[INFO] Maven Verifier Plugin ............................. SUCCESS [9.840s]
[INFO] Maven WAR Plugin .................................. SUCCESS [1:21.906s]
[INFO] Maven Invoker Plugin .............................. FAILURE [5:20.079s]
[INFO] Maven Project Info Reports Plugin ................. SUCCESS [5:45.934s]
[INFO] Maven Remote Resources Plugin ..................... FAILURE [40.299s]
[INFO] Maven Plugins Aggregator .......................... SUCCESS [0.078s]
[INFO] ------------------------------------------------------------------------
[INFO] BUILD FAILURE
[INFO] ------------------------------------------------------------------------
[INFO] Total time: 1:25:39.982s
[INFO] Finished at: Fri Jun 08 21:49:24 UTC 2012
[INFO] Final Memory: 77M/991M
[INFO] ------------------------------------------------------------------------
[WARNING] The requested profile "apache.snapshots" could not be activated because it does
not exist.
[ERROR] Failed to execute goal org.apache.maven.plugins:maven-surefire-plugin:2.9:test (integration-tests)
on project maven-repository-plugin: There are test failures.
[ERROR] 
[ERROR] Please refer to <https://builds.apache.org/job/maven-plugins-ITs-m3/ws/maven-repository-plugin/target/surefire-reports>
for the individual test results.
[ERROR] -> [Help 1]
[ERROR] Failed to execute goal org.apache.maven.plugins:maven-invoker-plugin:1.5:verify (integration-test)
on project maven-site-plugin: 1 build failed. -> [Help 1]
[ERROR] Failed to execute goal org.apache.maven.plugins:maven-invoker-plugin:1.5:verify (integration-test)
on project maven-invoker-plugin: 2 builds failed. -> [Help 1]
[ERROR] Failed to execute goal org.apache.maven.plugins:maven-failsafe-plugin:2.9:verify (integration-tests)
on project maven-remote-resources-plugin: There are test failures.
[ERROR] 
[ERROR] Please refer to <https://builds.apache.org/job/maven-plugins-ITs-m3/ws/maven-remote-resources-plugin/target/failsafe-reports>
for the individual test results.
[ERROR] -> [Help 1]
[ERROR] 
[ERROR] To see the full stack trace of the errors, re-run Maven with the -e switch.
[ERROR] Re-run Maven using the -X switch to enable full debug logging.
[ERROR] 
[ERROR] For more information about the errors and possible solutions, please read the following
articles:
[ERROR] [Help 1] http://cwiki.apache.org/confluence/display/MAVEN/MojoFailureException
[ERROR] 
[ERROR] After correcting the problems, you can resume the build with the command
[ERROR]   mvn <goals> -rf :maven-repository-plugin
Build step 'Invoke top-level Maven targets' marked build as failure

Mime
View raw message