maven-notifications mailing list archives

Site index · List index
Message view « Date » · « Thread »
Top « Date » · « Thread »
From Apache Jenkins Server <jenk...@builds.apache.org>
Subject Build failed in Jenkins: doxia-tools » JDK 1.5 (latest),Solaris #19
Date Mon, 18 Jun 2012 09:21:42 GMT
See <https://builds.apache.org/job/doxia-tools/./jdk=JDK%201.5%20(latest),label=Solaris/19/changes>

Changes:

[ltheussl] [MSITE-644] NullPointerException when site URL is not defined in distributionManagement

------------------------------------------
[...truncated 224 lines...]
[INFO] Excluding org.apache.maven.shared:maven-doxia-tools:jar:1.4 from the shaded jar.
[INFO] Excluding org.apache.maven.reporting:maven-reporting-api:jar:3.0 from the shaded jar.
[INFO] Excluding commons-io:commons-io:jar:1.4 from the shaded jar.
[INFO] Excluding org.apache.maven:maven-artifact-manager:jar:2.2.1 from the shaded jar.
[INFO] Excluding org.apache.maven:maven-repository-metadata:jar:2.2.1 from the shaded jar.
[INFO] Excluding org.apache.maven.wagon:wagon-provider-api:jar:1.0-beta-6 from the shaded
jar.
[INFO] Excluding backport-util-concurrent:backport-util-concurrent:jar:3.1 from the shaded
jar.
[INFO] Excluding org.apache.maven:maven-model:jar:2.2.1 from the shaded jar.
[INFO] Excluding org.apache.maven:maven-project:jar:2.2.1 from the shaded jar.
[INFO] Excluding org.apache.maven:maven-settings:jar:2.2.1 from the shaded jar.
[INFO] Excluding org.codehaus.plexus:plexus-interpolation:jar:1.14 from the shaded jar.
[INFO] Excluding org.apache.maven:maven-profile:jar:2.2.1 from the shaded jar.
[INFO] Excluding org.apache.maven:maven-plugin-registry:jar:2.2.1 from the shaded jar.
[INFO] Excluding org.apache.maven.doxia:doxia-decoration-model:jar:1.2 from the shaded jar.
[INFO] Replacing original artifact with shaded artifact.
[INFO] Replacing /zonestorage/hudson_solaris/home/hudson/hudson-slave/workspace/doxia-tools/jdk/JDK
1.5 (latest)/label/Solaris/doxia-book-maven-plugin/target/doxia-book-maven-plugin-1.3-SNAPSHOT.jar
with /zonestorage/hudson_solaris/home/hudson/hudson-slave/workspace/doxia-tools/jdk/JDK 1.5
(latest)/label/Solaris/doxia-book-maven-plugin/target/doxia-book-maven-plugin-1.3-SNAPSHOT-shaded.jar
[INFO] [install:install {execution: default-install}]
[INFO] Installing /zonestorage/hudson_solaris/home/hudson/hudson-slave/workspace/doxia-tools/jdk/JDK
1.5 (latest)/label/Solaris/doxia-book-maven-plugin/target/doxia-book-maven-plugin-1.3-SNAPSHOT.jar
to /export/home/hudson/.m2/repository/org/apache/maven/doxia/doxia-book-maven-plugin/1.3-SNAPSHOT/doxia-book-maven-plugin-1.3-SNAPSHOT.jar
[INFO] ------------------------------------------------------------------------
[INFO] Building Doxia Tools :: Converter
[INFO]    task-segment: [clean, install]
[INFO] ------------------------------------------------------------------------
[INFO] [clean:clean {execution: default-clean}]
[INFO] Deleting /zonestorage/hudson_solaris/home/hudson/hudson-slave/workspace/doxia-tools/jdk/JDK
1.5 (latest)/label/Solaris/doxia-converter/target
[INFO] [remote-resources:process {execution: default}]
[debug] execute contextualize
[INFO] [resources:resources {execution: default-resources}]
[INFO] Using 'UTF-8' encoding to copy filtered resources.
[INFO] Copying 1 resource
[INFO] Copying 3 resources
[INFO] [compiler:compile {execution: default-compile}]
[INFO] Compiling 13 source files to /zonestorage/hudson_solaris/home/hudson/hudson-slave/workspace/doxia-tools/jdk/JDK
1.5 (latest)/label/Solaris/doxia-converter/target/classes
[INFO] [plexus-component-metadata:generate-metadata {execution: default}]
[debug] execute contextualize
[INFO] [resources:testResources {execution: default-testResources}]
[INFO] Using 'UTF-8' encoding to copy filtered resources.
[INFO] Copying 9 resources
[INFO] Copying 3 resources
[INFO] [compiler:testCompile {execution: default-testCompile}]
[INFO] Compiling 1 source file to /zonestorage/hudson_solaris/home/hudson/hudson-slave/workspace/doxia-tools/jdk/JDK
1.5 (latest)/label/Solaris/doxia-converter/target/test-classes
[INFO] [surefire:test {execution: default-test}]
[INFO] Surefire report directory: /zonestorage/hudson_solaris/home/hudson/hudson-slave/workspace/doxia-tools/jdk/JDK
1.5 (latest)/label/Solaris/doxia-converter/target/surefire-reports

-------------------------------------------------------
 T E S T S
-------------------------------------------------------
Running org.apache.maven.doxia.ConverterTest
[warn] [Apt Sink] Unknown Sink event: 'meta', ignoring!
[warn] [Apt Sink] Unknown Sink event: 'meta', ignoring!
[warn] [Apt Sink] Unknown Sink event: 'meta', ignoring!
[warn] [Docbook Sink] Unknown Sink event: 'meta', ignoring!
Tests run: 16, Failures: 0, Errors: 0, Skipped: 0, Time elapsed: 2.034 sec

Results :

Tests run: 16, Failures: 0, Errors: 0, Skipped: 0

[INFO] [jar:jar {execution: default-jar}]
[INFO] Building jar: /zonestorage/hudson_solaris/home/hudson/hudson-slave/workspace/doxia-tools/jdk/JDK
1.5 (latest)/label/Solaris/doxia-converter/target/doxia-converter-1.3-SNAPSHOT.jar
[INFO] [assembly:single {execution: default}]
[INFO] Reading assembly descriptor: src/main/assembly/jar.xml
[INFO] Processing DependencySet (output=null)
[WARNING] The following patterns were never triggered in this artifact exclusion filter:
o  'junit-addons:junit-addons'
o  'javax.servlet:servlet-api'

[INFO] Building jar: /zonestorage/hudson_solaris/home/hudson/hudson-slave/workspace/doxia-tools/jdk/JDK
1.5 (latest)/label/Solaris/doxia-converter/target/apache-doxia-1.3-SNAPSHOT-jar-with-dependencies.jar
[INFO] [install:install {execution: default-install}]
[INFO] Installing /zonestorage/hudson_solaris/home/hudson/hudson-slave/workspace/doxia-tools/jdk/JDK
1.5 (latest)/label/Solaris/doxia-converter/target/doxia-converter-1.3-SNAPSHOT.jar to /export/home/hudson/.m2/repository/org/apache/maven/doxia/doxia-converter/1.3-SNAPSHOT/doxia-converter-1.3-SNAPSHOT.jar
[INFO] Installing /zonestorage/hudson_solaris/home/hudson/hudson-slave/workspace/doxia-tools/jdk/JDK
1.5 (latest)/label/Solaris/doxia-converter/target/apache-doxia-1.3-SNAPSHOT-jar-with-dependencies.jar
to /export/home/hudson/.m2/repository/org/apache/maven/doxia/doxia-converter/1.3-SNAPSHOT/doxia-converter-1.3-SNAPSHOT-jar-with-dependencies.jar
[INFO] ------------------------------------------------------------------------
[INFO] Building Doxia Tools :: Integration Tools
[INFO]    task-segment: [clean, install]
[INFO] ------------------------------------------------------------------------
[INFO] [clean:clean {execution: default-clean}]
[INFO] Deleting /zonestorage/hudson_solaris/home/hudson/hudson-slave/workspace/doxia-tools/jdk/JDK
1.5 (latest)/label/Solaris/doxia-integration-tools/target
[INFO] [remote-resources:process {execution: default}]
[debug] execute contextualize
[INFO] [resources:resources {execution: default-resources}]
[INFO] Using 'UTF-8' encoding to copy filtered resources.
[INFO] Copying 26 resources
[INFO] Copying 3 resources
[INFO] [compiler:compile {execution: default-compile}]
[INFO] Compiling 5 source files to /zonestorage/hudson_solaris/home/hudson/hudson-slave/workspace/doxia-tools/jdk/JDK
1.5 (latest)/label/Solaris/doxia-integration-tools/target/classes
[INFO] [plexus-component-metadata:generate-metadata {execution: default}]
[INFO] Discovered 1 component descriptors(s)
[INFO] [plexus-component-metadata:generate-metadata {execution: create-component-descriptor}]
[INFO] Discovered 1 component descriptors(s)
[debug] execute contextualize
[INFO] [resources:testResources {execution: default-testResources}]
[INFO] Using 'UTF-8' encoding to copy filtered resources.
[INFO] Copying 3 resources
[INFO] Copying 3 resources
[INFO] [compiler:testCompile {execution: default-testCompile}]
[INFO] Compiling 3 source files to /zonestorage/hudson_solaris/home/hudson/hudson-slave/workspace/doxia-tools/jdk/JDK
1.5 (latest)/label/Solaris/doxia-integration-tools/target/test-classes
[INFO] [surefire:test {execution: default-test}]
[INFO] Surefire report directory: /zonestorage/hudson_solaris/home/hudson/hudson-slave/workspace/doxia-tools/jdk/JDK
1.5 (latest)/label/Solaris/doxia-integration-tools/target/surefire-reports

-------------------------------------------------------
 T E S T S
-------------------------------------------------------
Running org.apache.maven.doxia.tools.SiteToolTest
[INFO] artifact org.apache.maven.skins:maven-stylus-skin: checking for updates from central
[WARNING] repository metadata for: 'artifact org.apache.maven.skins:maven-stylus-skin' could
not be retrieved from repository: central due to an error: Error transferring file
[INFO] Repository 'central' will be blacklisted
[INFO] Unable to find resource 'org.apache.maven:maven-site:xml:site_en:1.0' in repository
central (http://repo1.maven.org/maven2)
[WARNING] Unable to get resource 'org.apache.maven:maven-site:xml:site:1.0' from repository
central (http://repo1.maven.org/maven2): Error transferring file
[WARNING] No filesystem module-POM available
Tests run: 7, Failures: 1, Errors: 2, Skipped: 0, Time elapsed: 242.613 sec <<< FAILURE!
Running org.apache.maven.doxia.tools.DefaultSiteToolTest
Tests run: 1, Failures: 0, Errors: 0, Skipped: 0, Time elapsed: 0 sec

Results :

Failed tests:   testGetDecorationModel(org.apache.maven.doxia.tools.SiteToolTest): expected:<[Maven]>
but was:<[dummy]>

Tests in error: 
  testGetSkinArtifactFromRepository(org.apache.maven.doxia.tools.SiteToolTest): ArtifactNotFoundException:
The skin does not exist: Unable to determine the release version
  testGetSiteDescriptorFromRepository(org.apache.maven.doxia.tools.SiteToolTest)

Tests run: 8, Failures: 1, Errors: 2, Skipped: 0

[INFO] ------------------------------------------------------------------------
[INFO] Building Doxia Tools :: Linkcheck
[INFO]    task-segment: [clean, install]
[INFO] ------------------------------------------------------------------------
[INFO] [clean:clean {execution: default-clean}]
[INFO] Deleting /zonestorage/hudson_solaris/home/hudson/hudson-slave/workspace/doxia-tools/jdk/JDK
1.5 (latest)/label/Solaris/doxia-linkcheck/target
[INFO] [modello:java {execution: linkcheck}]
[INFO] outputDirectory: /zonestorage/hudson_solaris/home/hudson/hudson-slave/workspace/doxia-tools/jdk/JDK
1.5 (latest)/label/Solaris/doxia-linkcheck/target/generated-sources/modello
[INFO] Working on model: src/main/mdo/linkcheck.mdo
[INFO] Generating current version: 1.0.0
[INFO] [modello:xpp3-reader {execution: linkcheck}]
[INFO] outputDirectory: /zonestorage/hudson_solaris/home/hudson/hudson-slave/workspace/doxia-tools/jdk/JDK
1.5 (latest)/label/Solaris/doxia-linkcheck/target/generated-sources/modello
[INFO] Working on model: src/main/mdo/linkcheck.mdo
[INFO] Generating current version: 1.0.0
[INFO] [modello:xpp3-writer {execution: linkcheck}]
[INFO] outputDirectory: /zonestorage/hudson_solaris/home/hudson/hudson-slave/workspace/doxia-tools/jdk/JDK
1.5 (latest)/label/Solaris/doxia-linkcheck/target/generated-sources/modello
[INFO] Working on model: src/main/mdo/linkcheck.mdo
[INFO] Generating current version: 1.0.0
[INFO] [modello:java {execution: httpbean}]
[INFO] outputDirectory: /zonestorage/hudson_solaris/home/hudson/hudson-slave/workspace/doxia-tools/jdk/JDK
1.5 (latest)/label/Solaris/doxia-linkcheck/target/generated-sources/modello
[INFO] Working on model: src/main/mdo/httpbean.mdo
[INFO] Generating current version: 1.0.0
[INFO] [remote-resources:process {execution: default}]
[debug] execute contextualize
[INFO] [resources:resources {execution: default-resources}]
[INFO] Using 'UTF-8' encoding to copy filtered resources.
[INFO] Copying 1 resource
[INFO] Copying 3 resources
[INFO] [compiler:compile {execution: default-compile}]
[INFO] Compiling 21 source files to /zonestorage/hudson_solaris/home/hudson/hudson-slave/workspace/doxia-tools/jdk/JDK
1.5 (latest)/label/Solaris/doxia-linkcheck/target/classes
[INFO] [plexus-component-metadata:generate-metadata {execution: default}]
[INFO] Discovered 1 component descriptors(s)
[debug] execute contextualize
[INFO] [resources:testResources {execution: default-testResources}]
[INFO] Using 'UTF-8' encoding to copy filtered resources.
[INFO] Copying 10 resources
[INFO] Copying 3 resources
[INFO] [compiler:testCompile {execution: default-testCompile}]
[INFO] Compiling 5 source files to /zonestorage/hudson_solaris/home/hudson/hudson-slave/workspace/doxia-tools/jdk/JDK
1.5 (latest)/label/Solaris/doxia-linkcheck/target/test-classes
[INFO] [surefire:test {execution: default-test}]
[INFO] Surefire report directory: /zonestorage/hudson_solaris/home/hudson/hudson-slave/workspace/doxia-tools/jdk/JDK
1.5 (latest)/label/Solaris/doxia-linkcheck/target/surefire-reports

-------------------------------------------------------
 T E S T S
-------------------------------------------------------
Running org.apache.maven.doxia.linkcheck.LinkCheckTest
[ INFO] Begin to check links in files...
[ INFO] Links checked.
Tests run: 1, Failures: 0, Errors: 0, Skipped: 0, Time elapsed: 1.348 sec
Running org.apache.maven.doxia.linkcheck.validation.AnchorsTest
Tests run: 1, Failures: 0, Errors: 0, Skipped: 0, Time elapsed: 0 sec
Running org.apache.maven.doxia.linkcheck.validation.LinkValidatorManagerTest
Tests run: 1, Failures: 0, Errors: 0, Skipped: 0, Time elapsed: 0.001 sec
Running org.apache.maven.doxia.linkcheck.validation.HTTPLinkValidatorTest
Tests run: 1, Failures: 0, Errors: 0, Skipped: 0, Time elapsed: 0.161 sec
Running org.apache.maven.doxia.linkcheck.AnchorLinkTest
[ INFO] Begin to check links in files...
[ INFO] Links checked.
Tests run: 1, Failures: 0, Errors: 0, Skipped: 0, Time elapsed: 0.076 sec

Results :

Tests run: 5, Failures: 0, Errors: 0, Skipped: 0

[INFO] [jar:jar {execution: default-jar}]
[INFO] Building jar: /zonestorage/hudson_solaris/home/hudson/hudson-slave/workspace/doxia-tools/jdk/JDK
1.5 (latest)/label/Solaris/doxia-linkcheck/target/doxia-linkcheck-1.3-SNAPSHOT.jar
[INFO] [install:install {execution: default-install}]
[INFO] Installing /zonestorage/hudson_solaris/home/hudson/hudson-slave/workspace/doxia-tools/jdk/JDK
1.5 (latest)/label/Solaris/doxia-linkcheck/target/doxia-linkcheck-1.3-SNAPSHOT.jar to /export/home/hudson/.m2/repository/org/apache/maven/doxia/doxia-linkcheck/1.3-SNAPSHOT/doxia-linkcheck-1.3-SNAPSHOT.jar
[INFO] 
[INFO] 
[INFO] ------------------------------------------------------------------------
[INFO] Reactor Summary:
[INFO] ------------------------------------------------------------------------
[INFO] Doxia Tools ........................................... SUCCESS [16.966s]
[INFO] Doxia Book Renderer ................................... SUCCESS [15.500s]
[INFO] Doxia Book Maven Plugin ............................... SUCCESS [18.594s]
[INFO] Doxia Tools :: Converter .............................. SUCCESS [37.075s]
[INFO] Doxia Tools :: Integration Tools ...................... FAILED [4:05.671s]
[INFO] Doxia Tools :: Linkcheck .............................. SUCCESS [7.132s]
[INFO] ------------------------------------------------------------------------
[INFO] Error for project: Doxia Tools :: Integration Tools (during install)
[INFO] ------------------------------------------------------------------------
[INFO] There are test failures.

Please refer to /zonestorage/hudson_solaris/home/hudson/hudson-slave/workspace/doxia-tools/jdk/JDK
1.5 (latest)/label/Solaris/doxia-integration-tools/target/surefire-reports for the individual
test results.
[INFO] ------------------------------------------------------------------------
[INFO] Trace
org.apache.maven.BuildFailureException: There are test failures.

Please refer to /zonestorage/hudson_solaris/home/hudson/hudson-slave/workspace/doxia-tools/jdk/JDK
1.5 (latest)/label/Solaris/doxia-integration-tools/target/surefire-reports for the individual
test results.
	at org.apache.maven.lifecycle.DefaultLifecycleExecutor.executeGoals(DefaultLifecycleExecutor.java:715)
	at org.apache.maven.lifecycle.DefaultLifecycleExecutor.executeGoalWithLifecycle(DefaultLifecycleExecutor.java:556)
	at org.apache.maven.lifecycle.DefaultLifecycleExecutor.executeGoal(DefaultLifecycleExecutor.java:535)
	at org.apache.maven.lifecycle.DefaultLifecycleExecutor.executeGoalAndHandleFailures(DefaultLifecycleExecutor.java:387)
	at org.apache.maven.lifecycle.DefaultLifecycleExecutor.executeTaskSegments(DefaultLifecycleExecutor.java:348)
	at org.apache.maven.lifecycle.DefaultLifecycleExecutor.execute(DefaultLifecycleExecutor.java:180)
	at org.apache.maven.DefaultMaven.doExecute(DefaultMaven.java:328)
	at org.apache.maven.DefaultMaven.execute(DefaultMaven.java:138)
	at org.apache.maven.cli.MavenCli.main(MavenCli.java:362)
	at org.apache.maven.cli.compat.CompatibleMain.main(CompatibleMain.java:60)
	at sun.reflect.NativeMethodAccessorImpl.invoke0(Native Method)
	at sun.reflect.NativeMethodAccessorImpl.invoke(NativeMethodAccessorImpl.java:39)
	at sun.reflect.DelegatingMethodAccessorImpl.invoke(DelegatingMethodAccessorImpl.java:25)
	at java.lang.reflect.Method.invoke(Method.java:592)
	at org.codehaus.classworlds.Launcher.launchEnhanced(Launcher.java:315)
	at org.codehaus.classworlds.Launcher.launch(Launcher.java:255)
	at org.codehaus.classworlds.Launcher.mainWithExitCode(Launcher.java:430)
	at org.codehaus.classworlds.Launcher.main(Launcher.java:375)
Caused by: org.apache.maven.plugin.MojoFailureException: There are test failures.

Please refer to /zonestorage/hudson_solaris/home/hudson/hudson-slave/workspace/doxia-tools/jdk/JDK
1.5 (latest)/label/Solaris/doxia-integration-tools/target/surefire-reports for the individual
test results.
	at org.apache.maven.plugin.surefire.SurefireHelper.reportExecution(SurefireHelper.java:87)
	at org.apache.maven.plugin.surefire.SurefirePlugin.writeSummary(SurefirePlugin.java:631)
	at org.apache.maven.plugin.surefire.SurefirePlugin.handleSummary(SurefirePlugin.java:605)
	at org.apache.maven.plugin.surefire.AbstractSurefireMojo.executeAfterPreconditionsChecked(AbstractSurefireMojo.java:136)
	at org.apache.maven.plugin.surefire.AbstractSurefireMojo.execute(AbstractSurefireMojo.java:97)
	at org.apache.maven.plugin.DefaultPluginManager.executeMojo(DefaultPluginManager.java:490)
	at org.apache.maven.lifecycle.DefaultLifecycleExecutor.executeGoals(DefaultLifecycleExecutor.java:694)
	... 17 more
[INFO] ------------------------------------------------------------------------
[INFO] BUILD ERRORS
[INFO] ------------------------------------------------------------------------
[INFO] Total time: 5 minutes 42 seconds
[INFO] Finished at: Mon Jun 18 09:21:40 GMT+00:00 2012
[INFO] Final Memory: 76M/280M
[INFO] ------------------------------------------------------------------------
Build step 'Invoke top-level Maven targets' marked build as failure

Mime
View raw message