maven-notifications mailing list archives

Site index · List index
Message view « Date » · « Thread »
Top « Date » · « Thread »
From Apache Jenkins Server <jenk...@builds.apache.org>
Subject Build failed in Jenkins: maven-plugin-tools #115
Date Fri, 01 Jun 2012 00:47:53 GMT
See <https://builds.apache.org/job/maven-plugin-tools/115/changes>

Changes:

[hboutemy] fixed POM xsd location

------------------------------------------
[...truncated 1150 lines...]
mojoStarted org.codehaus.modello:modello-maven-plugin:1.4.1(standard)[INFO] Working on model:
src/main/mdo/plugin-metadata.mdo
[INFO] Generating current version: 1.0.0

[INFO] 
[INFO] --- modello-maven-plugin:1.4.1:xpp3-writer (standard) @ maven-plugin-tools-model ---
mojoSucceeded org.codehaus.modello:modello-maven-plugin:1.4.1(standard)
mojoStarted org.apache.maven.plugins:maven-remote-resources-plugin:1.2.1(default)
[INFO] 
[INFO] --- maven-remote-resources-plugin:1.2.1:process (default) @ maven-plugin-tools-model
---
mojoSucceeded org.apache.maven.plugins:maven-remote-resources-plugin:1.2.1(default)
mojoStarted org.apache.maven.plugins:maven-resources-plugin:2.5(default-resources)[debug]
execute contextualize
[INFO] Using 'UTF-8' encoding to copy filtered resources.
[INFO] skip non existing resourceDirectory <https://builds.apache.org/job/maven-plugin-tools/ws/maven-plugin-tools-model/src/main/resources>
[INFO] Copying 3 resources

[INFO] 
[INFO] --- maven-resources-plugin:2.5:resources (default-resources) @ maven-plugin-tools-model
---
mojoSucceeded org.apache.maven.plugins:maven-resources-plugin:2.5(default-resources)
mojoStarted org.apache.maven.plugins:maven-compiler-plugin:2.5(default-compile)
[INFO] 
[INFO] --- maven-compiler-plugin:2.5:compile (default-compile) @ maven-plugin-tools-model
---
[INFO] Compiling 9 source files to <https://builds.apache.org/job/maven-plugin-tools/ws/maven-plugin-tools-model/target/classes>
mojoSucceeded org.apache.maven.plugins:maven-compiler-plugin:2.5(default-compile)
mojoStarted org.apache.maven.plugins:maven-resources-plugin:2.5(default-testResources)[debug]
execute contextualize
[INFO] Using 'UTF-8' encoding to copy filtered resources.
[INFO] Copying 2 resources
[INFO] Copying 3 resources

[INFO] 
[INFO] --- maven-resources-plugin:2.5:testResources (default-testResources) @ maven-plugin-tools-model
---
mojoSucceeded org.apache.maven.plugins:maven-resources-plugin:2.5(default-testResources)
mojoStarted org.apache.maven.plugins:maven-compiler-plugin:2.5(default-testCompile)[INFO]
Compiling 1 source file to <https://builds.apache.org/job/maven-plugin-tools/ws/maven-plugin-tools-model/target/test-classes>

[INFO] 
[INFO] --- maven-compiler-plugin:2.5:testCompile (default-testCompile) @ maven-plugin-tools-model
---
mojoSucceeded org.apache.maven.plugins:maven-compiler-plugin:2.5(default-testCompile)
mojoStarted org.apache.maven.plugins:maven-surefire-plugin:2.9(default-test)[INFO] Surefire
report directory: <https://builds.apache.org/job/maven-plugin-tools/ws/maven-plugin-tools-model/target/surefire-reports>

-------------------------------------------------------
 T E S T S
-------------------------------------------------------

[INFO] 
[INFO] --- maven-surefire-plugin:2.9:test (default-test) @ maven-plugin-tools-model ---
Running org.apache.maven.plugin.tools.model.PluginMetadataParserTest
Tests run: 2, Failures: 0, Errors: 0, Skipped: 0, Time elapsed: 0.051 sec

Results :

Tests run: 2, Failures: 0, Errors: 0, Skipped: 0

mojoSucceeded org.apache.maven.plugins:maven-surefire-plugin:2.9(default-test)
[JENKINS] Recording test results
mojoStarted org.apache.maven.plugins:maven-jar-plugin:2.3.1(default-jar)
[INFO] 
[INFO] --- maven-jar-plugin:2.3.1:jar (default-jar) @ maven-plugin-tools-model ---
[INFO] Building jar: <https://builds.apache.org/job/maven-plugin-tools/ws/maven-plugin-tools-model/target/maven-plugin-tools-model-3.1-SNAPSHOT.jar>
mojoSucceeded org.apache.maven.plugins:maven-jar-plugin:2.3.1(default-jar)
mojoStarted org.apache.maven.plugins:maven-site-plugin:3.1(attach-descriptor)
[INFO] 
[INFO] --- maven-site-plugin:3.1:attach-descriptor (attach-descriptor) @ maven-plugin-tools-model
---
mojoSucceeded org.apache.maven.plugins:maven-site-plugin:3.1(attach-descriptor)
mojoStarted org.apache.maven.plugins:maven-install-plugin:2.3.1(default-install)[INFO] Installing
<https://builds.apache.org/job/maven-plugin-tools/ws/maven-plugin-tools-model/target/maven-plugin-tools-model-3.1-SNAPSHOT.jar>
to /home/jenkins/jenkins-slave/maven-repositories/0/org/apache/maven/plugin-tools/maven-plugin-tools-model/3.1-SNAPSHOT/maven-plugin-tools-model-3.1-SNAPSHOT.jar
[INFO] Installing <https://builds.apache.org/job/maven-plugin-tools/ws/maven-plugin-tools-model/pom.xml>
to /home/jenkins/jenkins-slave/maven-repositories/0/org/apache/maven/plugin-tools/maven-plugin-tools-model/3.1-SNAPSHOT/maven-plugin-tools-model-3.1-SNAPSHOT.pom

[INFO] 
[INFO] --- maven-install-plugin:2.3.1:install (default-install) @ maven-plugin-tools-model
---
mojoSucceeded org.apache.maven.plugins:maven-install-plugin:2.3.1(default-install)
projectSucceeded org.apache.maven.plugin-tools:maven-plugin-tools-model:3.1-SNAPSHOT
projectStarted org.apache.maven.plugin-tools:maven-plugin-tools-ant:3.1-SNAPSHOT
[INFO] [INFO] Deleting <https://builds.apache.org/job/maven-plugin-tools/ws/maven-plugin-tools-ant/target>
                                                                        
[INFO] ------------------------------------------------------------------------
[INFO] Building Maven Plugin Tool for Ant 3.1-SNAPSHOT
[INFO] ------------------------------------------------------------------------
mojoStarted org.apache.maven.plugins:maven-clean-plugin:2.4.1(default-clean)
[INFO] 
[INFO] --- maven-clean-plugin:2.4.1:clean (default-clean) @ maven-plugin-tools-ant ---
mojoSucceeded org.apache.maven.plugins:maven-clean-plugin:2.4.1(default-clean)
mojoStarted org.apache.maven.plugins:maven-remote-resources-plugin:1.2.1(default)
[INFO] 
[INFO] --- maven-remote-resources-plugin:1.2.1:process (default) @ maven-plugin-tools-ant
---
mojoSucceeded org.apache.maven.plugins:maven-remote-resources-plugin:1.2.1(default)
mojoStarted org.apache.maven.plugins:maven-resources-plugin:2.5(default-resources)[debug]
execute contextualize
[INFO] Using 'UTF-8' encoding to copy filtered resources.
[INFO] skip non existing resourceDirectory <https://builds.apache.org/job/maven-plugin-tools/ws/maven-plugin-tools-ant/src/main/resources>
[INFO] Copying 3 resources

[INFO] 
[INFO] --- maven-resources-plugin:2.5:resources (default-resources) @ maven-plugin-tools-ant
---
mojoSucceeded org.apache.maven.plugins:maven-resources-plugin:2.5(default-resources)
mojoStarted org.apache.maven.plugins:maven-compiler-plugin:2.5(default-compile)
[INFO] 
[INFO] --- maven-compiler-plugin:2.5:compile (default-compile) @ maven-plugin-tools-ant ---
[INFO] Compiling 1 source file to <https://builds.apache.org/job/maven-plugin-tools/ws/maven-plugin-tools-ant/target/classes>
mojoSucceeded org.apache.maven.plugins:maven-compiler-plugin:2.5(default-compile)
[INFO] Discovered 1 component descriptors(s)
mojoStarted org.codehaus.plexus:plexus-component-metadata:1.5.5(default)
[INFO] 
[INFO] --- plexus-component-metadata:1.5.5:generate-metadata (default) @ maven-plugin-tools-ant
---
mojoSucceeded org.codehaus.plexus:plexus-component-metadata:1.5.5(default)
mojoStarted org.apache.maven.plugins:maven-resources-plugin:2.5(default-testResources)[debug]
execute contextualize
[INFO] Using 'UTF-8' encoding to copy filtered resources.
[INFO] Copying 2 resources
[INFO] Copying 3 resources

[INFO] 
[INFO] --- maven-resources-plugin:2.5:testResources (default-testResources) @ maven-plugin-tools-ant
---
mojoSucceeded org.apache.maven.plugins:maven-resources-plugin:2.5(default-testResources)
mojoStarted org.apache.maven.plugins:maven-compiler-plugin:2.5(default-testCompile)
[INFO] 
[INFO] --- maven-compiler-plugin:2.5:testCompile (default-testCompile) @ maven-plugin-tools-ant
---
[INFO] Compiling 1 source file to <https://builds.apache.org/job/maven-plugin-tools/ws/maven-plugin-tools-ant/target/test-classes>
mojoSucceeded org.apache.maven.plugins:maven-compiler-plugin:2.5(default-testCompile)
mojoStarted org.codehaus.plexus:plexus-component-metadata:1.5.5(default)
[INFO] 
[INFO] --- plexus-component-metadata:1.5.5:generate-test-metadata (default) @ maven-plugin-tools-ant
---
mojoSucceeded org.codehaus.plexus:plexus-component-metadata:1.5.5(default)
mojoStarted org.apache.maven.plugins:maven-surefire-plugin:2.9(default-test)[INFO] Surefire
report directory: <https://builds.apache.org/job/maven-plugin-tools/ws/maven-plugin-tools-ant/target/surefire-reports>

-------------------------------------------------------
 T E S T S
-------------------------------------------------------

[INFO] 
[INFO] --- maven-surefire-plugin:2.9:test (default-test) @ maven-plugin-tools-ant ---
Running org.apache.maven.tools.plugin.extractor.ant.AntMojoDescriptorExtractorTest
Tests run: 1, Failures: 0, Errors: 0, Skipped: 0, Time elapsed: 0.075 sec

Results :

Tests run: 1, Failures: 0, Errors: 0, Skipped: 0

mojoSucceeded org.apache.maven.plugins:maven-surefire-plugin:2.9(default-test)
[JENKINS] Recording test results
mojoStarted org.apache.maven.plugins:maven-jar-plugin:2.3.1(default-jar)
[INFO] 
[INFO] --- maven-jar-plugin:2.3.1:jar (default-jar) @ maven-plugin-tools-ant ---
[INFO] Building jar: <https://builds.apache.org/job/maven-plugin-tools/ws/maven-plugin-tools-ant/target/maven-plugin-tools-ant-3.1-SNAPSHOT.jar>
mojoSucceeded org.apache.maven.plugins:maven-jar-plugin:2.3.1(default-jar)
mojoStarted org.apache.maven.plugins:maven-site-plugin:3.1(attach-descriptor)
[INFO] 
[INFO] --- maven-site-plugin:3.1:attach-descriptor (attach-descriptor) @ maven-plugin-tools-ant
---
mojoSucceeded org.apache.maven.plugins:maven-site-plugin:3.1(attach-descriptor)
mojoStarted org.apache.maven.plugins:maven-install-plugin:2.3.1(default-install)[INFO] Installing
<https://builds.apache.org/job/maven-plugin-tools/ws/maven-plugin-tools-ant/target/maven-plugin-tools-ant-3.1-SNAPSHOT.jar>
to /home/jenkins/jenkins-slave/maven-repositories/0/org/apache/maven/plugin-tools/maven-plugin-tools-ant/3.1-SNAPSHOT/maven-plugin-tools-ant-3.1-SNAPSHOT.jar
[INFO] Installing <https://builds.apache.org/job/maven-plugin-tools/ws/maven-plugin-tools-ant/pom.xml>
to /home/jenkins/jenkins-slave/maven-repositories/0/org/apache/maven/plugin-tools/maven-plugin-tools-ant/3.1-SNAPSHOT/maven-plugin-tools-ant-3.1-SNAPSHOT.pom

[INFO] 
[INFO] --- maven-install-plugin:2.3.1:install (default-install) @ maven-plugin-tools-ant ---
mojoSucceeded org.apache.maven.plugins:maven-install-plugin:2.3.1(default-install)
projectSucceeded org.apache.maven.plugin-tools:maven-plugin-tools-ant:3.1-SNAPSHOT
sessionEnded
[INFO] ------------------------------------------------------------------------
[INFO] Reactor Summary:
[INFO] 
[INFO] Maven Plugin Tools ................................ SUCCESS [22.588s]
[INFO] Maven Script Mojo Support ......................... SUCCESS [0.743s]
[INFO] Maven Ant Mojo Support ............................ SUCCESS [14.844s]
[INFO] Maven Beanshell Mojo Support ...................... SUCCESS [3.060s]
[INFO] Maven Plugin Tools APIs ........................... SUCCESS [8.218s]
[INFO] Maven Plugin Tools Generators ..................... SUCCESS [5.215s]
[INFO] Maven Plugin Tool for Java with Javadoc Tags ...... SUCCESS [7.888s]
[INFO] Maven Plugin Tool for Beanshell ................... SUCCESS [2.269s]
[INFO] Maven Plugin Java 5 Annotations ................... SUCCESS [1.882s]
[INFO] Maven Plugin Tool for Annotations ................. SUCCESS [8.237s]
[INFO] Maven Plugin Plugin ............................... FAILURE [3:05.427s]
[INFO] Maven Plugin Tools Javadoc ........................ SUCCESS [11.867s]
[INFO] Maven Plugin Metadata Model ....................... SUCCESS [2.891s]
[INFO] Maven Plugin Tool for Ant ......................... SUCCESS [2.636s]
[INFO] ------------------------------------------------------------------------
[INFO] BUILD FAILURE
[INFO] ------------------------------------------------------------------------
[INFO] Total time: 4:41.821s
[INFO] Finished at: Fri Jun 01 00:47:39 UTC 2012
[INFO] Final Memory: 35M/292M
[INFO] ------------------------------------------------------------------------
Projects to build: [MavenProject: org.apache.maven.plugin-tools:maven-plugin-tools:3.1-SNAPSHOT
@ <https://builds.apache.org/job/maven-plugin-tools/ws/pom.xml,> MavenProject: org.apache.maven.plugin-tools:maven-script:3.1-SNAPSHOT
@ <https://builds.apache.org/job/maven-plugin-tools/ws/maven-script/pom.xml,> MavenProject:
org.apache.maven.plugin-tools:maven-script-ant:3.1-SNAPSHOT @ <https://builds.apache.org/job/maven-plugin-tools/ws/maven-script/maven-script-ant/pom.xml,>
MavenProject: org.apache.maven.plugin-tools:maven-script-beanshell:3.1-SNAPSHOT @ <https://builds.apache.org/job/maven-plugin-tools/ws/maven-script/maven-script-beanshell/pom.xml,>
MavenProject: org.apache.maven.plugin-tools:maven-plugin-tools-api:3.1-SNAPSHOT @ <https://builds.apache.org/job/maven-plugin-tools/ws/maven-plugin-tools-api/pom.xml,>
MavenProject: org.apache.maven.plugin-tools:maven-plugin-tools-generators:3.1-SNAPSHOT @ <https://builds.apache.org/job/maven-plugin-tools/ws/maven-plugin-tools-generators/pom.xml,>
MavenProject: org.apache.maven.plugin-tools:maven-plugin-tools-java:3.1-SNAPSHOT @ <https://builds.apache.org/job/maven-plugin-tools/ws/maven-plugin-tools-java/pom.xml,>
MavenProject: org.apache.maven.plugin-tools:maven-plugin-tools-beanshell:3.1-SNAPSHOT @ <https://builds.apache.org/job/maven-plugin-tools/ws/maven-plugin-tools-beanshell/pom.xml,>
MavenProject: org.apache.maven.plugin-tools:maven-plugin-annotations:3.1-SNAPSHOT @ <https://builds.apache.org/job/maven-plugin-tools/ws/maven-plugin-annotations/pom.xml,>
MavenProject: org.apache.maven.plugin-tools:maven-plugin-tools-annotations:3.1-SNAPSHOT @
<https://builds.apache.org/job/maven-plugin-tools/ws/maven-plugin-tools-annotations/pom.xml,>
MavenProject: org.apache.maven.plugins:maven-plugin-plugin:3.1-SNAPSHOT @ <https://builds.apache.org/job/maven-plugin-tools/ws/maven-plugin-plugin/pom.xml,>
MavenProject: org.apache.maven.plugin-tools:maven-plugin-tools-javadoc:3.1-SNAPSHOT @ <https://builds.apache.org/job/maven-plugin-tools/ws/maven-plugin-tools-javadoc/pom.xml,>
MavenProject: org.apache.maven.plugin-tools:maven-plugin-tools-model:3.1-SNAPSHOT @ <https://builds.apache.org/job/maven-plugin-tools/ws/maven-plugin-tools-model/pom.xml,>
MavenProject: org.apache.maven.plugin-tools:maven-plugin-tools-ant:3.1-SNAPSHOT @ <https://builds.apache.org/job/maven-plugin-tools/ws/maven-plugin-tools-ant/pom.xml]>
[JENKINS] Archiving <https://builds.apache.org/job/maven-plugin-tools/ws/maven-plugin-tools-beanshell/pom.xml>
to /home/hudson/hudson/jobs/maven-plugin-tools/modules/org.apache.maven.plugin-tools$maven-plugin-tools-beanshell/builds/2012-06-01_00-42-44/archive/org.apache.maven.plugin-tools/maven-plugin-tools-beanshell/3.1-SNAPSHOT/maven-plugin-tools-beanshell-3.1-SNAPSHOT.pom
[JENKINS] Archiving <https://builds.apache.org/job/maven-plugin-tools/ws/maven-plugin-tools-beanshell/target/maven-plugin-tools-beanshell-3.1-SNAPSHOT.jar>
to /home/hudson/hudson/jobs/maven-plugin-tools/modules/org.apache.maven.plugin-tools$maven-plugin-tools-beanshell/builds/2012-06-01_00-42-44/archive/org.apache.maven.plugin-tools/maven-plugin-tools-beanshell/3.1-SNAPSHOT/maven-plugin-tools-beanshell-3.1-SNAPSHOT.jar
[JENKINS] Archiving <https://builds.apache.org/job/maven-plugin-tools/ws/maven-plugin-tools-javadoc/pom.xml>
to /home/hudson/hudson/jobs/maven-plugin-tools/modules/org.apache.maven.plugin-tools$maven-plugin-tools-javadoc/builds/2012-06-01_00-42-44/archive/org.apache.maven.plugin-tools/maven-plugin-tools-javadoc/3.1-SNAPSHOT/maven-plugin-tools-javadoc-3.1-SNAPSHOT.pom
[JENKINS] Archiving <https://builds.apache.org/job/maven-plugin-tools/ws/maven-plugin-tools-javadoc/target/maven-plugin-tools-javadoc-3.1-SNAPSHOT.jar>
to /home/hudson/hudson/jobs/maven-plugin-tools/modules/org.apache.maven.plugin-tools$maven-plugin-tools-javadoc/builds/2012-06-01_00-42-44/archive/org.apache.maven.plugin-tools/maven-plugin-tools-javadoc/3.1-SNAPSHOT/maven-plugin-tools-javadoc-3.1-SNAPSHOT.jar
[JENKINS] Archiving <https://builds.apache.org/job/maven-plugin-tools/ws/maven-plugin-annotations/pom.xml>
to /home/hudson/hudson/jobs/maven-plugin-tools/modules/org.apache.maven.plugin-tools$maven-plugin-annotations/builds/2012-06-01_00-42-44/archive/org.apache.maven.plugin-tools/maven-plugin-annotations/3.1-SNAPSHOT/maven-plugin-annotations-3.1-SNAPSHOT.pom
[JENKINS] Archiving <https://builds.apache.org/job/maven-plugin-tools/ws/maven-plugin-annotations/target/maven-plugin-annotations-3.1-SNAPSHOT.jar>
to /home/hudson/hudson/jobs/maven-plugin-tools/modules/org.apache.maven.plugin-tools$maven-plugin-annotations/builds/2012-06-01_00-42-44/archive/org.apache.maven.plugin-tools/maven-plugin-annotations/3.1-SNAPSHOT/maven-plugin-annotations-3.1-SNAPSHOT.jar
[JENKINS] Archiving <https://builds.apache.org/job/maven-plugin-tools/ws/maven-plugin-plugin/pom.xml>
to /home/hudson/hudson/jobs/maven-plugin-tools/modules/org.apache.maven.plugins$maven-plugin-plugin/builds/2012-06-01_00-42-44/archive/org.apache.maven.plugins/maven-plugin-plugin/3.1-SNAPSHOT/maven-plugin-plugin-3.1-SNAPSHOT.pom
[JENKINS] Archiving <https://builds.apache.org/job/maven-plugin-tools/ws/maven-plugin-plugin/target/maven-plugin-plugin-3.1-SNAPSHOT.jar>
to /home/hudson/hudson/jobs/maven-plugin-tools/modules/org.apache.maven.plugins$maven-plugin-plugin/builds/2012-06-01_00-42-44/archive/org.apache.maven.plugins/maven-plugin-plugin/3.1-SNAPSHOT/maven-plugin-plugin-3.1-SNAPSHOT.jar
[JENKINS] Archiving <https://builds.apache.org/job/maven-plugin-tools/ws/maven-plugin-tools-model/pom.xml>
to /home/hudson/hudson/jobs/maven-plugin-tools/modules/org.apache.maven.plugin-tools$maven-plugin-tools-model/builds/2012-06-01_00-42-45/archive/org.apache.maven.plugin-tools/maven-plugin-tools-model/3.1-SNAPSHOT/maven-plugin-tools-model-3.1-SNAPSHOT.pom
[JENKINS] Archiving <https://builds.apache.org/job/maven-plugin-tools/ws/maven-plugin-tools-model/target/maven-plugin-tools-model-3.1-SNAPSHOT.jar>
to /home/hudson/hudson/jobs/maven-plugin-tools/modules/org.apache.maven.plugin-tools$maven-plugin-tools-model/builds/2012-06-01_00-42-45/archive/org.apache.maven.plugin-tools/maven-plugin-tools-model/3.1-SNAPSHOT/maven-plugin-tools-model-3.1-SNAPSHOT.jar
[JENKINS] Archiving <https://builds.apache.org/job/maven-plugin-tools/ws/maven-script/pom.xml>
to /home/hudson/hudson/jobs/maven-plugin-tools/modules/org.apache.maven.plugin-tools$maven-script/builds/2012-06-01_00-42-43/archive/org.apache.maven.plugin-tools/maven-script/3.1-SNAPSHOT/maven-script-3.1-SNAPSHOT.pom
[JENKINS] Archiving <https://builds.apache.org/job/maven-plugin-tools/ws/maven-script/target/maven-script-3.1-SNAPSHOT-site.xml>
to /home/hudson/hudson/jobs/maven-plugin-tools/modules/org.apache.maven.plugin-tools$maven-script/builds/2012-06-01_00-42-43/archive/org.apache.maven.plugin-tools/maven-script/3.1-SNAPSHOT/maven-script-3.1-SNAPSHOT-site.xml
[JENKINS] Archiving <https://builds.apache.org/job/maven-plugin-tools/ws/maven-plugin-tools-generators/pom.xml>
to /home/hudson/hudson/jobs/maven-plugin-tools/modules/org.apache.maven.plugin-tools$maven-plugin-tools-generators/builds/2012-06-01_00-42-44/archive/org.apache.maven.plugin-tools/maven-plugin-tools-generators/3.1-SNAPSHOT/maven-plugin-tools-generators-3.1-SNAPSHOT.pom
[JENKINS] Archiving <https://builds.apache.org/job/maven-plugin-tools/ws/maven-plugin-tools-generators/target/maven-plugin-tools-generators-3.1-SNAPSHOT.jar>
to /home/hudson/hudson/jobs/maven-plugin-tools/modules/org.apache.maven.plugin-tools$maven-plugin-tools-generators/builds/2012-06-01_00-42-44/archive/org.apache.maven.plugin-tools/maven-plugin-tools-generators/3.1-SNAPSHOT/maven-plugin-tools-generators-3.1-SNAPSHOT.jar
[JENKINS] Archiving <https://builds.apache.org/job/maven-plugin-tools/ws/maven-script/maven-script-ant/pom.xml>
to /home/hudson/hudson/jobs/maven-plugin-tools/modules/org.apache.maven.plugin-tools$maven-script-ant/builds/2012-06-01_00-42-43/archive/org.apache.maven.plugin-tools/maven-script-ant/3.1-SNAPSHOT/maven-script-ant-3.1-SNAPSHOT.pom
[JENKINS] Archiving <https://builds.apache.org/job/maven-plugin-tools/ws/maven-script/maven-script-ant/target/maven-script-ant-3.1-SNAPSHOT.jar>
to /home/hudson/hudson/jobs/maven-plugin-tools/modules/org.apache.maven.plugin-tools$maven-script-ant/builds/2012-06-01_00-42-43/archive/org.apache.maven.plugin-tools/maven-script-ant/3.1-SNAPSHOT/maven-script-ant-3.1-SNAPSHOT.jar
[JENKINS] Archiving <https://builds.apache.org/job/maven-plugin-tools/ws/maven-plugin-tools-java/pom.xml>
to /home/hudson/hudson/jobs/maven-plugin-tools/modules/org.apache.maven.plugin-tools$maven-plugin-tools-java/builds/2012-06-01_00-42-44/archive/org.apache.maven.plugin-tools/maven-plugin-tools-java/3.1-SNAPSHOT/maven-plugin-tools-java-3.1-SNAPSHOT.pom
[JENKINS] Archiving <https://builds.apache.org/job/maven-plugin-tools/ws/maven-plugin-tools-java/target/maven-plugin-tools-java-3.1-SNAPSHOT.jar>
to /home/hudson/hudson/jobs/maven-plugin-tools/modules/org.apache.maven.plugin-tools$maven-plugin-tools-java/builds/2012-06-01_00-42-44/archive/org.apache.maven.plugin-tools/maven-plugin-tools-java/3.1-SNAPSHOT/maven-plugin-tools-java-3.1-SNAPSHOT.jar
[JENKINS] Archiving <https://builds.apache.org/job/maven-plugin-tools/ws/maven-script/maven-script-beanshell/pom.xml>
to /home/hudson/hudson/jobs/maven-plugin-tools/modules/org.apache.maven.plugin-tools$maven-script-beanshell/builds/2012-06-01_00-42-44/archive/org.apache.maven.plugin-tools/maven-script-beanshell/3.1-SNAPSHOT/maven-script-beanshell-3.1-SNAPSHOT.pom
[JENKINS] Archiving <https://builds.apache.org/job/maven-plugin-tools/ws/maven-script/maven-script-beanshell/target/maven-script-beanshell-3.1-SNAPSHOT.jar>
to /home/hudson/hudson/jobs/maven-plugin-tools/modules/org.apache.maven.plugin-tools$maven-script-beanshell/builds/2012-06-01_00-42-44/archive/org.apache.maven.plugin-tools/maven-script-beanshell/3.1-SNAPSHOT/maven-script-beanshell-3.1-SNAPSHOT.jar
[JENKINS] Archiving <https://builds.apache.org/job/maven-plugin-tools/ws/maven-plugin-tools-annotations/pom.xml>
to /home/hudson/hudson/jobs/maven-plugin-tools/modules/org.apache.maven.plugin-tools$maven-plugin-tools-annotations/builds/2012-06-01_00-42-44/archive/org.apache.maven.plugin-tools/maven-plugin-tools-annotations/3.1-SNAPSHOT/maven-plugin-tools-annotations-3.1-SNAPSHOT.pom
[JENKINS] Archiving <https://builds.apache.org/job/maven-plugin-tools/ws/maven-plugin-tools-annotations/target/maven-plugin-tools-annotations-3.1-SNAPSHOT.jar>
to /home/hudson/hudson/jobs/maven-plugin-tools/modules/org.apache.maven.plugin-tools$maven-plugin-tools-annotations/builds/2012-06-01_00-42-44/archive/org.apache.maven.plugin-tools/maven-plugin-tools-annotations/3.1-SNAPSHOT/maven-plugin-tools-annotations-3.1-SNAPSHOT.jar
[JENKINS] Archiving <https://builds.apache.org/job/maven-plugin-tools/ws/maven-plugin-tools-annotations/target/maven-plugin-tools-annotations-3.1-SNAPSHOT-tests.jar>
to /home/hudson/hudson/jobs/maven-plugin-tools/modules/org.apache.maven.plugin-tools$maven-plugin-tools-annotations/builds/2012-06-01_00-42-44/archive/org.apache.maven.plugin-tools/maven-plugin-tools-annotations/3.1-SNAPSHOT/maven-plugin-tools-annotations-3.1-SNAPSHOT-tests.jar
[JENKINS] Archiving <https://builds.apache.org/job/maven-plugin-tools/ws/maven-plugin-tools-annotations/target/maven-plugin-tools-annotations-3.1-SNAPSHOT-test-sources.jar>
to /home/hudson/hudson/jobs/maven-plugin-tools/modules/org.apache.maven.plugin-tools$maven-plugin-tools-annotations/builds/2012-06-01_00-42-44/archive/org.apache.maven.plugin-tools/maven-plugin-tools-annotations/3.1-SNAPSHOT/maven-plugin-tools-annotations-3.1-SNAPSHOT-test-sources.jar
[JENKINS] Archiving <https://builds.apache.org/job/maven-plugin-tools/ws/maven-plugin-tools-api/pom.xml>
to /home/hudson/hudson/jobs/maven-plugin-tools/modules/org.apache.maven.plugin-tools$maven-plugin-tools-api/builds/2012-06-01_00-42-44/archive/org.apache.maven.plugin-tools/maven-plugin-tools-api/3.1-SNAPSHOT/maven-plugin-tools-api-3.1-SNAPSHOT.pom
[JENKINS] Archiving <https://builds.apache.org/job/maven-plugin-tools/ws/maven-plugin-tools-api/target/maven-plugin-tools-api-3.1-SNAPSHOT.jar>
to /home/hudson/hudson/jobs/maven-plugin-tools/modules/org.apache.maven.plugin-tools$maven-plugin-tools-api/builds/2012-06-01_00-42-44/archive/org.apache.maven.plugin-tools/maven-plugin-tools-api/3.1-SNAPSHOT/maven-plugin-tools-api-3.1-SNAPSHOT.jar
[JENKINS] Archiving <https://builds.apache.org/job/maven-plugin-tools/ws/maven-plugin-tools-ant/pom.xml>
to /home/hudson/hudson/jobs/maven-plugin-tools/modules/org.apache.maven.plugin-tools$maven-plugin-tools-ant/builds/2012-06-01_00-42-44/archive/org.apache.maven.plugin-tools/maven-plugin-tools-ant/3.1-SNAPSHOT/maven-plugin-tools-ant-3.1-SNAPSHOT.pom
[JENKINS] Archiving <https://builds.apache.org/job/maven-plugin-tools/ws/maven-plugin-tools-ant/target/maven-plugin-tools-ant-3.1-SNAPSHOT.jar>
to /home/hudson/hudson/jobs/maven-plugin-tools/modules/org.apache.maven.plugin-tools$maven-plugin-tools-ant/builds/2012-06-01_00-42-44/archive/org.apache.maven.plugin-tools/maven-plugin-tools-ant/3.1-SNAPSHOT/maven-plugin-tools-ant-3.1-SNAPSHOT.jar
[JENKINS] Archiving <https://builds.apache.org/job/maven-plugin-tools/ws/pom.xml> to
/home/hudson/hudson/jobs/maven-plugin-tools/modules/org.apache.maven.plugin-tools$maven-plugin-tools/builds/2012-06-01_00-42-43/archive/org.apache.maven.plugin-tools/maven-plugin-tools/3.1-SNAPSHOT/maven-plugin-tools-3.1-SNAPSHOT.pom
[JENKINS] Archiving <https://builds.apache.org/job/maven-plugin-tools/ws/target/maven-plugin-tools-3.1-SNAPSHOT-site.xml>
to /home/hudson/hudson/jobs/maven-plugin-tools/modules/org.apache.maven.plugin-tools$maven-plugin-tools/builds/2012-06-01_00-42-43/archive/org.apache.maven.plugin-tools/maven-plugin-tools/3.1-SNAPSHOT/maven-plugin-tools-3.1-SNAPSHOT-site.xml
Waiting for Jenkins to finish collecting data
mavenExecutionResult exceptions not empty
message : Failed to execute goal org.apache.maven.plugins:maven-invoker-plugin:1.6:run (integration-test)
on project maven-plugin-plugin: 3 builds failed. See console output above for details.
cause : 3 builds failed. See console output above for details.
Stack trace : 
org.apache.maven.lifecycle.LifecycleExecutionException: Failed to execute goal org.apache.maven.plugins:maven-invoker-plugin:1.6:run
(integration-test) on project maven-plugin-plugin: 3 builds failed. See console output above
for details.
	at org.apache.maven.lifecycle.internal.MojoExecutor.execute(MojoExecutor.java:213)
	at org.apache.maven.lifecycle.internal.MojoExecutor.execute(MojoExecutor.java:153)
	at org.apache.maven.lifecycle.internal.MojoExecutor.execute(MojoExecutor.java:145)
	at org.apache.maven.lifecycle.internal.LifecycleModuleBuilder.buildProject(LifecycleModuleBuilder.java:84)
	at org.apache.maven.lifecycle.internal.LifecycleModuleBuilder.buildProject(LifecycleModuleBuilder.java:59)
	at org.apache.maven.lifecycle.internal.LifecycleStarter.singleThreadedBuild(LifecycleStarter.java:183)
	at org.apache.maven.lifecycle.internal.LifecycleStarter.execute(LifecycleStarter.java:161)
	at org.apache.maven.DefaultMaven.doExecute(DefaultMaven.java:320)
	at org.apache.maven.DefaultMaven.execute(DefaultMaven.java:156)
	at org.jvnet.hudson.maven3.launcher.Maven3Launcher.main(Maven3Launcher.java:79)
	at sun.reflect.NativeMethodAccessorImpl.invoke0(Native Method)
	at sun.reflect.NativeMethodAccessorImpl.invoke(NativeMethodAccessorImpl.java:39)
	at sun.reflect.DelegatingMethodAccessorImpl.invoke(DelegatingMethodAccessorImpl.java:25)
	at java.lang.reflect.Method.invoke(Method.java:592)
	at org.codehaus.plexus.classworlds.launcher.Launcher.launchStandard(Launcher.java:329)
	at org.codehaus.plexus.classworlds.launcher.Launcher.launch(Launcher.java:239)
	at org.jvnet.hudson.maven3.agent.Maven3Main.launch(Maven3Main.java:158)
	at hudson.maven.Maven3Builder.call(Maven3Builder.java:98)
	at hudson.maven.Maven3Builder.call(Maven3Builder.java:64)
	at hudson.remoting.UserRequest.perform(UserRequest.java:118)
	at hudson.remoting.UserRequest.perform(UserRequest.java:48)
	at hudson.remoting.Request$2.run(Request.java:287)
	at hudson.remoting.InterceptingExecutorService$1.call(InterceptingExecutorService.java:72)
	at java.util.concurrent.FutureTask$Sync.innerRun(FutureTask.java:269)
	at java.util.concurrent.FutureTask.run(FutureTask.java:123)
	at java.util.concurrent.ThreadPoolExecutor$Worker.runTask(ThreadPoolExecutor.java:651)
	at java.util.concurrent.ThreadPoolExecutor$Worker.run(ThreadPoolExecutor.java:676)
	at java.lang.Thread.run(Thread.java:595)
Caused by: org.apache.maven.plugin.MojoFailureException: 3 builds failed. See console output
above for details.
	at org.apache.maven.plugin.invoker.InvokerSession.handleFailures(InvokerSession.java:258)
	at org.apache.maven.plugin.invoker.InvokerMojo.processResults(InvokerMojo.java:59)
	at org.apache.maven.plugin.invoker.AbstractInvokerMojo.execute(AbstractInvokerMojo.java:692)
	at org.apache.maven.plugin.DefaultBuildPluginManager.executeMojo(DefaultBuildPluginManager.java:101)
	at org.apache.maven.lifecycle.internal.MojoExecutor.execute(MojoExecutor.java:209)
	... 27 more
channel stopped

Mime
View raw message