maven-notifications mailing list archives

Site index · List index
Message view « Date » · « Thread »
Top « Date » · « Thread »
From Apache Jenkins Server <jenk...@builds.apache.org>
Subject Build failed in Jenkins: maven-plugin-tools-m2 #76
Date Sun, 03 Jun 2012 21:08:00 GMT
See <https://builds.apache.org/job/maven-plugin-tools-m2/76/changes>

Changes:

[hboutemy] extended intro

------------------------------------------
[...truncated 626 lines...]
[INFO] ..SUCCESS (6.0 s)
[INFO] Building: beanshell-simple/pom.xml
[INFO] run script <https://builds.apache.org/job/maven-plugin-tools-m2/ws/maven-plugin-plugin/target/it/beanshell-simple/verify.groovy>
[INFO] ..SUCCESS (5.7 s)
[INFO] Building: mplugin-187/pom.xml
[INFO] ..SUCCESS (3.7 s)
[INFO] Building: plugin-info-jdk-default-version/pom.xml
[INFO] run script <https://builds.apache.org/job/maven-plugin-tools-m2/ws/maven-plugin-plugin/target/it/plugin-info-jdk-default-version/verify.groovy>
[INFO] ..SUCCESS (12.6 s)
[INFO] Building: source-encoding/pom.xml
[INFO] run script <https://builds.apache.org/job/maven-plugin-tools-m2/ws/maven-plugin-plugin/target/it/source-encoding/verify.groovy>
[INFO] ..SUCCESS (5.4 s)
[INFO] Building: skip/pom.xml
[INFO] run script <https://builds.apache.org/job/maven-plugin-tools-m2/ws/maven-plugin-plugin/target/it/skip/verify.groovy>
[INFO] ..SUCCESS (4.1 s)
[INFO] Building: plugin-report/pom.xml
[INFO] run script <https://builds.apache.org/job/maven-plugin-tools-m2/ws/maven-plugin-plugin/target/it/plugin-report/verify.bsh>
[INFO] ..SUCCESS (31.0 s)
[INFO] -------------------------------------------------
[INFO] Build Summary:
[INFO]   Passed: 14, Failed: 4, Errors: 0, Skipped: 0
[INFO] -------------------------------------------------
[ERROR] The following builds failed:
[ERROR] *  ant-simple-usage/pom.xml
[ERROR] *  java-basic-annotations/pom.xml
[ERROR] *  ant-reference-parameter/pom.xml
[ERROR] *  ant-basic/pom.xml
[INFO] -------------------------------------------------
[JENKINS] Archiving <https://builds.apache.org/job/maven-plugin-tools-m2/ws/maven-plugin-plugin/pom.xml>
to /home/hudson/hudson/jobs/maven-plugin-tools-m2/modules/org.apache.maven.plugins$maven-plugin-plugin/builds/2012-06-03_21-03-18/archive/org.apache.maven.plugins/maven-plugin-plugin/3.1-SNAPSHOT/maven-plugin-plugin-3.1-SNAPSHOT.pom
[JENKINS] Archiving <https://builds.apache.org/job/maven-plugin-tools-m2/ws/maven-plugin-plugin/target/maven-plugin-plugin-3.1-SNAPSHOT.jar>
to /home/hudson/hudson/jobs/maven-plugin-tools-m2/modules/org.apache.maven.plugins$maven-plugin-plugin/builds/2012-06-03_21-03-18/archive/org.apache.maven.plugins/maven-plugin-plugin/3.1-SNAPSHOT/maven-plugin-plugin-3.1-SNAPSHOT.jar
[INFO] ------------------------------------------------------------------------
[INFO] Building Maven Plugin Tools Javadoc
[INFO]    task-segment: [clean, install]
[INFO] ------------------------------------------------------------------------
[INFO] [clean:clean {execution: default-clean}]
[INFO] [remote-resources:process {execution: default}]
[debug] execute contextualize
[INFO] [resources:resources {execution: default-resources}]
[INFO] Using 'UTF-8' encoding to copy filtered resources.
[INFO] skip non existing resourceDirectory <https://builds.apache.org/job/maven-plugin-tools-m2/ws/maven-plugin-tools-javadoc/src/main/resources>
[INFO] Copying 3 resources
[INFO] [compiler:compile {execution: default-compile}]
[INFO] Compiling 22 source files to <https://builds.apache.org/job/maven-plugin-tools-m2/ws/maven-plugin-tools-javadoc/target/classes>
[debug] execute contextualize
[INFO] [resources:testResources {execution: default-testResources}]
[INFO] Using 'UTF-8' encoding to copy filtered resources.
[INFO] skip non existing resourceDirectory <https://builds.apache.org/job/maven-plugin-tools-m2/ws/maven-plugin-tools-javadoc/src/test/resources>
[INFO] Copying 3 resources
[INFO] [compiler:testCompile {execution: default-testCompile}]
[INFO] No sources to compile
[INFO] [surefire:test {execution: default-test}]
[INFO] Surefire report directory: <https://builds.apache.org/job/maven-plugin-tools-m2/ws/maven-plugin-tools-javadoc/target/surefire-reports>

-------------------------------------------------------
 T E S T S
-------------------------------------------------------

Results :

Tests run: 0, Failures: 0, Errors: 0, Skipped: 0

[JENKINS] Recording test results
[INFO] [jar:jar {execution: default-jar}]
[INFO] Building jar: <https://builds.apache.org/job/maven-plugin-tools-m2/ws/maven-plugin-tools-javadoc/target/maven-plugin-tools-javadoc-3.1-SNAPSHOT.jar>
[INFO] [invoker:install {execution: integration-test}]
[INFO] Installing <https://builds.apache.org/job/maven-plugin-tools-m2/ws/maven-plugin-tools-java/pom.xml>
to <https://builds.apache.org/job/maven-plugin-tools-m2/ws/maven-plugin-tools-javadoc/target/local-repo/org/apache/maven/plugin-tools/maven-plugin-tools-java/3.1-SNAPSHOT/maven-plugin-tools-java-3.1-SNAPSHOT.pom>
[INFO] Installing <https://builds.apache.org/job/maven-plugin-tools-m2/ws/maven-plugin-tools-java/target/maven-plugin-tools-java-3.1-SNAPSHOT.jar>
to <https://builds.apache.org/job/maven-plugin-tools-m2/ws/maven-plugin-tools-javadoc/target/local-repo/org/apache/maven/plugin-tools/maven-plugin-tools-java/3.1-SNAPSHOT/maven-plugin-tools-java-3.1-SNAPSHOT.jar>
[INFO] Installing <https://builds.apache.org/job/maven-plugin-tools-m2/ws/pom.xml> to
<https://builds.apache.org/job/maven-plugin-tools-m2/ws/maven-plugin-tools-javadoc/target/local-repo/org/apache/maven/plugin-tools/maven-plugin-tools/3.1-SNAPSHOT/maven-plugin-tools-3.1-SNAPSHOT.pom>
[INFO] Installing <https://builds.apache.org/job/maven-plugin-tools-m2/ws/maven-plugin-tools-api/pom.xml>
to <https://builds.apache.org/job/maven-plugin-tools-m2/ws/maven-plugin-tools-javadoc/target/local-repo/org/apache/maven/plugin-tools/maven-plugin-tools-api/3.1-SNAPSHOT/maven-plugin-tools-api-3.1-SNAPSHOT.pom>
[INFO] Installing <https://builds.apache.org/job/maven-plugin-tools-m2/ws/maven-plugin-tools-api/target/maven-plugin-tools-api-3.1-SNAPSHOT.jar>
to <https://builds.apache.org/job/maven-plugin-tools-m2/ws/maven-plugin-tools-javadoc/target/local-repo/org/apache/maven/plugin-tools/maven-plugin-tools-api/3.1-SNAPSHOT/maven-plugin-tools-api-3.1-SNAPSHOT.jar>
[INFO] Installing <https://builds.apache.org/job/maven-plugin-tools-m2/ws/maven-plugin-tools-javadoc/pom.xml>
to <https://builds.apache.org/job/maven-plugin-tools-m2/ws/maven-plugin-tools-javadoc/target/local-repo/org/apache/maven/plugin-tools/maven-plugin-tools-javadoc/3.1-SNAPSHOT/maven-plugin-tools-javadoc-3.1-SNAPSHOT.pom>
[INFO] Installing <https://builds.apache.org/job/maven-plugin-tools-m2/ws/maven-plugin-tools-javadoc/target/maven-plugin-tools-javadoc-3.1-SNAPSHOT.jar>
to <https://builds.apache.org/job/maven-plugin-tools-m2/ws/maven-plugin-tools-javadoc/target/local-repo/org/apache/maven/plugin-tools/maven-plugin-tools-javadoc/3.1-SNAPSHOT/maven-plugin-tools-javadoc-3.1-SNAPSHOT.jar>
[INFO] [invoker:run {execution: integration-test}]
[INFO] Building: basic/pom.xml
[INFO] ..SUCCESS (5.6 s)
[INFO] -------------------------------------------------
[INFO] Build Summary:
[INFO]   Passed: 1, Failed: 0, Errors: 0, Skipped: 0
[INFO] -------------------------------------------------
[INFO] [install:install {execution: default-install}]
[INFO] Installing <https://builds.apache.org/job/maven-plugin-tools-m2/ws/maven-plugin-tools-javadoc/target/maven-plugin-tools-javadoc-3.1-SNAPSHOT.jar>
to /home/jenkins/jenkins-slave/maven-repositories/1/org/apache/maven/plugin-tools/maven-plugin-tools-javadoc/3.1-SNAPSHOT/maven-plugin-tools-javadoc-3.1-SNAPSHOT.jar
[JENKINS] Archiving <https://builds.apache.org/job/maven-plugin-tools-m2/ws/maven-plugin-tools-javadoc/pom.xml>
to /home/hudson/hudson/jobs/maven-plugin-tools-m2/modules/org.apache.maven.plugin-tools$maven-plugin-tools-javadoc/builds/2012-06-03_21-03-19/archive/org.apache.maven.plugin-tools/maven-plugin-tools-javadoc/3.1-SNAPSHOT/maven-plugin-tools-javadoc-3.1-SNAPSHOT.pom
[JENKINS] Archiving <https://builds.apache.org/job/maven-plugin-tools-m2/ws/maven-plugin-tools-javadoc/target/maven-plugin-tools-javadoc-3.1-SNAPSHOT.jar>
to /home/hudson/hudson/jobs/maven-plugin-tools-m2/modules/org.apache.maven.plugin-tools$maven-plugin-tools-javadoc/builds/2012-06-03_21-03-19/archive/org.apache.maven.plugin-tools/maven-plugin-tools-javadoc/3.1-SNAPSHOT/maven-plugin-tools-javadoc-3.1-SNAPSHOT.jar
[INFO] ------------------------------------------------------------------------
[INFO] Building Maven Plugin Metadata Model
[INFO]    task-segment: [clean, install]
[INFO] ------------------------------------------------------------------------
[INFO] [clean:clean {execution: default-clean}]
[INFO] [modello:java {execution: standard}]
[INFO] outputDirectory: <https://builds.apache.org/job/maven-plugin-tools-m2/ws/maven-plugin-tools-model/target/generated-sources/modello>
[INFO] Working on model: src/main/mdo/plugin-metadata.mdo
[INFO] Generating current version: 1.0.0
[INFO] [modello:xpp3-reader {execution: standard}]
[INFO] outputDirectory: <https://builds.apache.org/job/maven-plugin-tools-m2/ws/maven-plugin-tools-model/target/generated-sources/modello>
[INFO] Working on model: src/main/mdo/plugin-metadata.mdo
[INFO] Generating current version: 1.0.0
[INFO] [modello:xpp3-writer {execution: standard}]
[INFO] outputDirectory: <https://builds.apache.org/job/maven-plugin-tools-m2/ws/maven-plugin-tools-model/target/generated-sources/modello>
[INFO] Working on model: src/main/mdo/plugin-metadata.mdo
[INFO] Generating current version: 1.0.0
[INFO] [remote-resources:process {execution: default}]
[debug] execute contextualize
[INFO] [resources:resources {execution: default-resources}]
[INFO] Using 'UTF-8' encoding to copy filtered resources.
[INFO] skip non existing resourceDirectory <https://builds.apache.org/job/maven-plugin-tools-m2/ws/maven-plugin-tools-model/src/main/resources>
[INFO] Copying 3 resources
[INFO] [compiler:compile {execution: default-compile}]
[INFO] Compiling 9 source files to <https://builds.apache.org/job/maven-plugin-tools-m2/ws/maven-plugin-tools-model/target/classes>
[debug] execute contextualize
[INFO] [resources:testResources {execution: default-testResources}]
[INFO] Using 'UTF-8' encoding to copy filtered resources.
[INFO] Copying 2 resources
[INFO] Copying 3 resources
[INFO] [compiler:testCompile {execution: default-testCompile}]
[INFO] Compiling 1 source file to <https://builds.apache.org/job/maven-plugin-tools-m2/ws/maven-plugin-tools-model/target/test-classes>
[INFO] [surefire:test {execution: default-test}]
[INFO] Surefire report directory: <https://builds.apache.org/job/maven-plugin-tools-m2/ws/maven-plugin-tools-model/target/surefire-reports>

-------------------------------------------------------
 T E S T S
-------------------------------------------------------
Running org.apache.maven.plugin.tools.model.PluginMetadataParserTest
Tests run: 2, Failures: 0, Errors: 0, Skipped: 0, Time elapsed: 0.052 sec

Results :

Tests run: 2, Failures: 0, Errors: 0, Skipped: 0

[JENKINS] Recording test results
[INFO] [jar:jar {execution: default-jar}]
[INFO] Building jar: <https://builds.apache.org/job/maven-plugin-tools-m2/ws/maven-plugin-tools-model/target/maven-plugin-tools-model-3.1-SNAPSHOT.jar>
[INFO] [install:install {execution: default-install}]
[INFO] Installing <https://builds.apache.org/job/maven-plugin-tools-m2/ws/maven-plugin-tools-model/target/maven-plugin-tools-model-3.1-SNAPSHOT.jar>
to /home/jenkins/jenkins-slave/maven-repositories/1/org/apache/maven/plugin-tools/maven-plugin-tools-model/3.1-SNAPSHOT/maven-plugin-tools-model-3.1-SNAPSHOT.jar
[JENKINS] Archiving <https://builds.apache.org/job/maven-plugin-tools-m2/ws/maven-plugin-tools-model/pom.xml>
to /home/hudson/hudson/jobs/maven-plugin-tools-m2/modules/org.apache.maven.plugin-tools$maven-plugin-tools-model/builds/2012-06-03_21-03-19/archive/org.apache.maven.plugin-tools/maven-plugin-tools-model/3.1-SNAPSHOT/maven-plugin-tools-model-3.1-SNAPSHOT.pom
[JENKINS] Archiving <https://builds.apache.org/job/maven-plugin-tools-m2/ws/maven-plugin-tools-model/target/maven-plugin-tools-model-3.1-SNAPSHOT.jar>
to /home/hudson/hudson/jobs/maven-plugin-tools-m2/modules/org.apache.maven.plugin-tools$maven-plugin-tools-model/builds/2012-06-03_21-03-19/archive/org.apache.maven.plugin-tools/maven-plugin-tools-model/3.1-SNAPSHOT/maven-plugin-tools-model-3.1-SNAPSHOT.jar
[INFO] ------------------------------------------------------------------------
[INFO] Building Maven Plugin Tool for Ant
[INFO]    task-segment: [clean, install]
[INFO] ------------------------------------------------------------------------
[INFO] [clean:clean {execution: default-clean}]
[INFO] [remote-resources:process {execution: default}]
[debug] execute contextualize
[INFO] [resources:resources {execution: default-resources}]
[INFO] Using 'UTF-8' encoding to copy filtered resources.
[INFO] skip non existing resourceDirectory <https://builds.apache.org/job/maven-plugin-tools-m2/ws/maven-plugin-tools-ant/src/main/resources>
[INFO] Copying 3 resources
[INFO] [compiler:compile {execution: default-compile}]
[INFO] Compiling 1 source file to <https://builds.apache.org/job/maven-plugin-tools-m2/ws/maven-plugin-tools-ant/target/classes>
[INFO] [plexus-component-metadata:generate-metadata {execution: default}]
[INFO] Discovered 1 component descriptors(s)
[debug] execute contextualize
[INFO] [resources:testResources {execution: default-testResources}]
[INFO] Using 'UTF-8' encoding to copy filtered resources.
[INFO] Copying 2 resources
[INFO] Copying 3 resources
[INFO] [compiler:testCompile {execution: default-testCompile}]
[INFO] Compiling 1 source file to <https://builds.apache.org/job/maven-plugin-tools-m2/ws/maven-plugin-tools-ant/target/test-classes>
[INFO] [plexus-component-metadata:generate-test-metadata {execution: default}]
[INFO] [surefire:test {execution: default-test}]
[INFO] Surefire report directory: <https://builds.apache.org/job/maven-plugin-tools-m2/ws/maven-plugin-tools-ant/target/surefire-reports>

-------------------------------------------------------
 T E S T S
-------------------------------------------------------
Running org.apache.maven.tools.plugin.extractor.ant.AntMojoDescriptorExtractorTest
Tests run: 1, Failures: 0, Errors: 0, Skipped: 0, Time elapsed: 0.094 sec

Results :

[JENKINS] Recording test resultsTests run: 1, Failures: 0, Errors: 0, Skipped: 0


[INFO] [jar:jar {execution: default-jar}]
[INFO] Building jar: <https://builds.apache.org/job/maven-plugin-tools-m2/ws/maven-plugin-tools-ant/target/maven-plugin-tools-ant-3.1-SNAPSHOT.jar>
[INFO] [install:install {execution: default-install}]
[INFO] Installing <https://builds.apache.org/job/maven-plugin-tools-m2/ws/maven-plugin-tools-ant/target/maven-plugin-tools-ant-3.1-SNAPSHOT.jar>
to /home/jenkins/jenkins-slave/maven-repositories/1/org/apache/maven/plugin-tools/maven-plugin-tools-ant/3.1-SNAPSHOT/maven-plugin-tools-ant-3.1-SNAPSHOT.jar
[JENKINS] Archiving <https://builds.apache.org/job/maven-plugin-tools-m2/ws/maven-plugin-tools-ant/pom.xml>
to /home/hudson/hudson/jobs/maven-plugin-tools-m2/modules/org.apache.maven.plugin-tools$maven-plugin-tools-ant/builds/2012-06-03_21-03-19/archive/org.apache.maven.plugin-tools/maven-plugin-tools-ant/3.1-SNAPSHOT/maven-plugin-tools-ant-3.1-SNAPSHOT.pom
[JENKINS] Archiving <https://builds.apache.org/job/maven-plugin-tools-m2/ws/maven-plugin-tools-ant/target/maven-plugin-tools-ant-3.1-SNAPSHOT.jar>
to /home/hudson/hudson/jobs/maven-plugin-tools-m2/modules/org.apache.maven.plugin-tools$maven-plugin-tools-ant/builds/2012-06-03_21-03-19/archive/org.apache.maven.plugin-tools/maven-plugin-tools-ant/3.1-SNAPSHOT/maven-plugin-tools-ant-3.1-SNAPSHOT.jar
[INFO] 
[INFO] 
[INFO] ------------------------------------------------------------------------
[INFO] Reactor Summary:
[INFO] ------------------------------------------------------------------------
[INFO] Maven Plugin Tools .................................... SUCCESS [12.034s]
[INFO] Maven Script Mojo Support ............................. SUCCESS [0.250s]
[INFO] Maven Ant Mojo Support ................................ SUCCESS [14.944s]
[INFO] Maven Beanshell Mojo Support .......................... SUCCESS [1.051s]
[INFO] Maven Plugin Tools APIs ............................... SUCCESS [2.561s]
[INFO] Maven Plugin Tools Generators ......................... SUCCESS [4.869s]
[INFO] Maven Plugin Tool for Java with Javadoc Tags .......... SUCCESS [3.445s]
[INFO] Maven Plugin Tool for Beanshell ....................... SUCCESS [1.024s]
[INFO] Maven Plugin Java 5 Annotations ....................... SUCCESS [0.837s]
[INFO] Maven Plugin Tool for Annotations ..................... SUCCESS [3.098s]
[INFO] Maven Plugin Plugin ................................... FAILED [2:57.277s]
[INFO] Maven Plugin Tools Javadoc ............................ SUCCESS [8.443s]
[INFO] Maven Plugin Metadata Model ........................... SUCCESS [1.760s]
[INFO] Maven Plugin Tool for Ant ............................. SUCCESS [1.368s]
[INFO] ------------------------------------------------------------------------
[INFO] Error for project: Maven Plugin Plugin (during install)
[INFO] ------------------------------------------------------------------------
[INFO] 4 builds failed. See console output above for details.
[INFO] ------------------------------------------------------------------------
[INFO] Trace
org.apache.maven.BuildFailureException: 4 builds failed. See console output above for details.
	at org.apache.maven.lifecycle.DefaultLifecycleExecutor.executeGoals(DefaultLifecycleExecutor.java:715)
	at org.apache.maven.lifecycle.DefaultLifecycleExecutor.executeGoalWithLifecycle(DefaultLifecycleExecutor.java:556)
	at org.apache.maven.lifecycle.DefaultLifecycleExecutor.executeGoal(DefaultLifecycleExecutor.java:535)
	at org.apache.maven.lifecycle.DefaultLifecycleExecutor.executeGoalAndHandleFailures(DefaultLifecycleExecutor.java:387)
	at org.apache.maven.lifecycle.DefaultLifecycleExecutor.executeTaskSegments(DefaultLifecycleExecutor.java:348)
	at org.apache.maven.lifecycle.DefaultLifecycleExecutor.execute(DefaultLifecycleExecutor.java:180)
	at org.apache.maven.lifecycle.LifecycleExecutorInterceptor.execute(LifecycleExecutorInterceptor.java:65)
	at org.apache.maven.DefaultMaven.doExecute(DefaultMaven.java:328)
	at org.apache.maven.DefaultMaven.execute(DefaultMaven.java:138)
	at org.apache.maven.cli.MavenCli.main(MavenCli.java:362)
	at sun.reflect.NativeMethodAccessorImpl.invoke0(Native Method)
	at sun.reflect.NativeMethodAccessorImpl.invoke(NativeMethodAccessorImpl.java:39)
	at sun.reflect.DelegatingMethodAccessorImpl.invoke(DelegatingMethodAccessorImpl.java:25)
	at java.lang.reflect.Method.invoke(Method.java:592)
	at org.codehaus.classworlds.Launcher.launchEnhanced(Launcher.java:315)
	at org.codehaus.classworlds.Launcher.launch(Launcher.java:255)
	at hudson.maven.agent.Main.launch(Main.java:185)
	at hudson.maven.MavenBuilder.call(MavenBuilder.java:151)
	at hudson.maven.Maven2Builder.call(Maven2Builder.java:77)
	at hudson.maven.Maven2Builder.call(Maven2Builder.java:53)
	at hudson.remoting.UserRequest.perform(UserRequest.java:118)
	at hudson.remoting.UserRequest.perform(UserRequest.java:48)
	at hudson.remoting.Request$2.run(Request.java:287)
	at hudson.remoting.InterceptingExecutorService$1.call(InterceptingExecutorService.java:72)
	at java.util.concurrent.FutureTask$Sync.innerRun(FutureTask.java:269)
	at java.util.concurrent.FutureTask.run(FutureTask.java:123)
	at java.util.concurrent.ThreadPoolExecutor$Worker.runTask(ThreadPoolExecutor.java:651)
	at java.util.concurrent.ThreadPoolExecutor$Worker.run(ThreadPoolExecutor.java:676)
	at java.lang.Thread.run(Thread.java:595)
Caused by: org.apache.maven.plugin.MojoFailureException: 4 builds failed. See console output
above for details.
	at org.apache.maven.plugin.invoker.InvokerSession.handleFailures(InvokerSession.java:258)
	at org.apache.maven.plugin.invoker.InvokerMojo.processResults(InvokerMojo.java:59)
	at org.apache.maven.plugin.invoker.AbstractInvokerMojo.execute(AbstractInvokerMojo.java:692)
	at org.apache.maven.plugin.DefaultPluginManager.executeMojo(DefaultPluginManager.java:490)
	at hudson.maven.agent.PluginManagerInterceptor.executeMojo(PluginManagerInterceptor.java:182)
	at org.apache.maven.lifecycle.DefaultLifecycleExecutor.executeGoals(DefaultLifecycleExecutor.java:694)
	... 28 more
[INFO] ------------------------------------------------------------------------
[INFO] BUILD ERRORS
[INFO] ------------------------------------------------------------------------
[INFO] Total time: 4 minutes 11 seconds
[INFO] Finished at: Sun Jun 03 21:07:59 UTC 2012
[INFO] Final Memory: 96M/195M
[INFO] ------------------------------------------------------------------------
channel stopped

Mime
View raw message