maven-notifications mailing list archives

Site index · List index
Message view « Date » · « Thread »
Top « Date » · « Thread »
From Apache Jenkins Server <jenk...@builds.apache.org>
Subject Build failed in Jenkins: maven-plugins-ITs-m3 #556
Date Wed, 01 Aug 2012 18:36:04 GMT
See <https://builds.apache.org/job/maven-plugins-ITs-m3/556/changes>

Changes:

[olamy] move version to a property

[olamy] Joakim is in developper list

[olamy] annotations are not needed for plugin execution so mark dependency as provided

[olamy] annotations are not needed for plugin execution so mark dependency as provided

[olamy] [MDEP-363] The plugin should not write debug messages to 'System.out'.

------------------------------------------
[...truncated 9856 lines...]
Running org.apache.maven.plugins.shade.mojo.ShadeMojoTest
Tests run: 4, Failures: 0, Errors: 0, Skipped: 0, Time elapsed: 1.963 sec
Running org.apache.maven.plugins.shade.mojo.RelativizePathTest
Tests run: 1, Failures: 0, Errors: 0, Skipped: 0, Time elapsed: 0.013 sec
Running org.apache.maven.plugins.shade.mojo.ArtifactIdTest
Tests run: 2, Failures: 0, Errors: 0, Skipped: 0, Time elapsed: 0.002 sec
Running org.apache.maven.plugins.shade.DefaultShaderTest
Tests run: 4, Failures: 0, Errors: 0, Skipped: 0, Time elapsed: 0.58 sec
Running org.apache.maven.plugins.shade.relocation.SimpleRelocatorTest
Tests run: 7, Failures: 0, Errors: 0, Skipped: 0, Time elapsed: 0.003 sec
Running org.apache.maven.plugins.shade.relocation.SimpleRelocatorParameterTest
Tests run: 2, Failures: 0, Errors: 0, Skipped: 0, Time elapsed: 0 sec
Running org.apache.maven.plugins.shade.filter.SimpleFilterTest
Tests run: 1, Failures: 0, Errors: 0, Skipped: 0, Time elapsed: 0 sec
Running org.apache.maven.plugins.shade.resource.AppendingTransformerTest
Tests run: 1, Failures: 0, Errors: 0, Skipped: 0, Time elapsed: 0.001 sec
Running org.apache.maven.plugins.shade.resource.ApacheLicenseResourceTransformerTest
Tests run: 1, Failures: 0, Errors: 0, Skipped: 0, Time elapsed: 0 sec
Running org.apache.maven.plugins.shade.resource.ApacheNoticeResourceTransformerTest
Tests run: 1, Failures: 0, Errors: 0, Skipped: 0, Time elapsed: 0.001 sec
Running org.apache.maven.plugins.shade.resource.ComponentsXmlResourceTransformerTest
Tests run: 1, Failures: 0, Errors: 0, Skipped: 0, Time elapsed: 0.039 sec
Running org.apache.maven.plugins.shade.resource.XmlAppendingTransformerTest
Tests run: 1, Failures: 0, Errors: 0, Skipped: 0, Time elapsed: 0.003 sec

Results :

Tests run: 27, Failures: 0, Errors: 0, Skipped: 0

[INFO] 
[INFO] --- maven-jar-plugin:2.4:jar (default-jar) @ maven-shade-plugin ---
[INFO] Building jar: /x1/jenkins/jenkins-slave/workspace/maven-plugins-ITs-m3/maven-shade-plugin/target/maven-shade-plugin-2.0-SNAPSHOT.jar
[INFO] 
[INFO] --- maven-plugin-plugin:3.1:addPluginArtifactMetadata (default-addPluginArtifactMetadata)
@ maven-shade-plugin ---
[INFO] 
[INFO] --- maven-jar-plugin:2.4:test-jar (default) @ maven-shade-plugin ---
[INFO] Building jar: /x1/jenkins/jenkins-slave/workspace/maven-plugins-ITs-m3/maven-shade-plugin/target/maven-shade-plugin-2.0-SNAPSHOT-tests.jar
[INFO] 
[INFO] --- maven-invoker-plugin:1.6:install (integration-test) @ maven-shade-plugin ---
[INFO] Installing /x1/jenkins/jenkins-slave/workspace/maven-plugins-ITs-m3/maven-plugins/pom.xml
to /x1/jenkins/jenkins-slave/workspace/maven-plugins-ITs-m3/maven-shade-plugin/target/local-repo/org/apache/maven/plugins/maven-plugins/23-SNAPSHOT/maven-plugins-23-SNAPSHOT.pom
[INFO] Installing /x1/jenkins/jenkins-slave/workspace/maven-plugins-ITs-m3/maven-shade-plugin/pom.xml
to /x1/jenkins/jenkins-slave/workspace/maven-plugins-ITs-m3/maven-shade-plugin/target/local-repo/org/apache/maven/plugins/maven-shade-plugin/2.0-SNAPSHOT/maven-shade-plugin-2.0-SNAPSHOT.pom
[INFO] Installing /x1/jenkins/jenkins-slave/workspace/maven-plugins-ITs-m3/maven-shade-plugin/target/maven-shade-plugin-2.0-SNAPSHOT.jar
to /x1/jenkins/jenkins-slave/workspace/maven-plugins-ITs-m3/maven-shade-plugin/target/local-repo/org/apache/maven/plugins/maven-shade-plugin/2.0-SNAPSHOT/maven-shade-plugin-2.0-SNAPSHOT.jar
[INFO] Installing /x1/jenkins/jenkins-slave/workspace/maven-plugins-ITs-m3/maven-shade-plugin/target/maven-shade-plugin-2.0-SNAPSHOT-tests.jar
to /x1/jenkins/jenkins-slave/workspace/maven-plugins-ITs-m3/maven-shade-plugin/target/local-repo/org/apache/maven/plugins/maven-shade-plugin/2.0-SNAPSHOT/maven-shade-plugin-2.0-SNAPSHOT-tests.jar
[INFO] 
[INFO] --- maven-invoker-plugin:1.6:integration-test (integration-test) @ maven-shade-plugin
---
[INFO] Building: project-with-reactors-included/pom.xml
[INFO] run script /x1/jenkins/jenkins-slave/workspace/maven-plugins-ITs-m3/maven-shade-plugin/target/it/project-with-reactors-included/verify.bsh
[INFO] ..SUCCESS (6.1 s)
[INFO] Building: manifest-retained/pom.xml
[INFO] run script /x1/jenkins/jenkins-slave/workspace/maven-plugins-ITs-m3/maven-shade-plugin/target/it/manifest-retained/verify.bsh
[INFO] ..SUCCESS (5.6 s)
[INFO] Building: duplicate-classes-with-reloc/pom.xml
[INFO] ..SUCCESS (2.9 s)
[INFO] Building: dep-reduced-pom/pom.xml
[INFO] run script /x1/jenkins/jenkins-slave/workspace/maven-plugins-ITs-m3/maven-shade-plugin/target/it/dep-reduced-pom/verify.groovy
[INFO] ..SUCCESS (2.9 s)
[INFO] Building: dep-reduced-pom-with-local-parent/pom.xml
[INFO] ..SUCCESS (2.2 s)
[INFO] Building: mshade-123/pom.xml
[INFO] ..SUCCESS (5.5 s)
[INFO] Building: finalNameBuild/pom.xml
[INFO] run script /x1/jenkins/jenkins-slave/workspace/maven-plugins-ITs-m3/maven-shade-plugin/target/it/finalNameBuild/setup.bsh
[INFO] run script /x1/jenkins/jenkins-slave/workspace/maven-plugins-ITs-m3/maven-shade-plugin/target/it/finalNameBuild/verify.bsh
[INFO] ..SUCCESS (3.0 s)
[INFO] Building: empty-relocation-pattern/pom.xml
[INFO] ..SUCCESS (2.8 s)
[INFO] Building: non-runtime-scope-excluded/pom.xml
[INFO] run script /x1/jenkins/jenkins-slave/workspace/maven-plugins-ITs-m3/maven-shade-plugin/target/it/non-runtime-scope-excluded/verify.bsh
[INFO] ..SUCCESS (2.9 s)
[INFO] Building: attach-after-lifecycle-fork/pom.xml
[INFO] run script /x1/jenkins/jenkins-slave/workspace/maven-plugins-ITs-m3/maven-shade-plugin/target/it/attach-after-lifecycle-fork/setup.bsh
[INFO] run script /x1/jenkins/jenkins-slave/workspace/maven-plugins-ITs-m3/maven-shade-plugin/target/it/attach-after-lifecycle-fork/verify.bsh
[INFO] ..SUCCESS (3.5 s)
[INFO] Building: empty-relocation-shaded-pattern/pom.xml
[INFO] ..SUCCESS (2.8 s)
[INFO] Building: MSHADE-105/pom.xml
[INFO] run script /x1/jenkins/jenkins-slave/workspace/maven-plugins-ITs-m3/maven-shade-plugin/target/it/MSHADE-105/verify.bsh
[INFO] ..SUCCESS (8.3 s)
[INFO] Building: rerun-without-reloc/pom.xml
[INFO] ..SUCCESS (2.9 s)
[INFO] Building: users-shader-impl/pom.xml
[INFO] run script /x1/jenkins/jenkins-slave/workspace/maven-plugins-ITs-m3/maven-shade-plugin/target/it/users-shader-impl/verify.groovy
[INFO] ..SUCCESS (4.1 s)
[INFO] Building: finalNameBuild-attached/pom.xml
[INFO] run script /x1/jenkins/jenkins-slave/workspace/maven-plugins-ITs-m3/maven-shade-plugin/target/it/finalNameBuild-attached/setup.bsh
[INFO] run script /x1/jenkins/jenkins-slave/workspace/maven-plugins-ITs-m3/maven-shade-plugin/target/it/finalNameBuild-attached/verify.bsh
[INFO] ..SUCCESS (3.0 s)
[INFO] Building: reloc-enum-ref-from-anno/pom.xml
[INFO] ..SUCCESS (12.8 s)
[INFO] Building: xml-transformer-ignores-dtd/pom.xml
[INFO] run script /x1/jenkins/jenkins-slave/workspace/maven-plugins-ITs-m3/maven-shade-plugin/target/it/xml-transformer-ignores-dtd/verify.bsh
[INFO] ..SUCCESS (2.9 s)
[INFO] Building: empty-apache-notice-transform/pom.xml
[INFO] ..SUCCESS (3.4 s)
[INFO] Building: duplicate-classes-without-reloc/pom.xml
[INFO] ..SUCCESS (2.3 s)
[INFO] Building: component-descriptor-relocation/pom.xml
[INFO] ..SUCCESS (3.3 s)
[INFO] Building: manifest-transformed/pom.xml
[INFO] run script /x1/jenkins/jenkins-slave/workspace/maven-plugins-ITs-m3/maven-shade-plugin/target/it/manifest-transformed/verify.bsh
[INFO] ..SUCCESS (3.5 s)
[INFO] Building: mini-jar-malformed-dependencies/pom.xml
[INFO] ..SUCCESS (12.5 s)
[INFO] Building: finalNameShade/pom.xml
[INFO] run script /x1/jenkins/jenkins-slave/workspace/maven-plugins-ITs-m3/maven-shade-plugin/target/it/finalNameShade/setup.bsh
[INFO] run script /x1/jenkins/jenkins-slave/workspace/maven-plugins-ITs-m3/maven-shade-plugin/target/it/finalNameShade/verify.bsh
[INFO] ..SUCCESS (2.9 s)
[INFO] Building: dep-reduced-pom-relocated-result/pom.xml
[INFO] ..SUCCESS (2.2 s)
[INFO] Building: reloc-abs-resource-path/pom.xml
[INFO] ..SUCCESS (6.4 s)
[INFO] Building: pom-packaging/pom.xml
[INFO] run script /x1/jenkins/jenkins-slave/workspace/maven-plugins-ITs-m3/maven-shade-plugin/target/it/pom-packaging/verify.bsh
[INFO] ..SUCCESS (2.1 s)
[INFO] Building: artifact-includes-excludes/pom.xml
[INFO] run script /x1/jenkins/jenkins-slave/workspace/maven-plugins-ITs-m3/maven-shade-plugin/target/it/artifact-includes-excludes/verify.bsh
[INFO] ..SUCCESS (2.9 s)
[INFO] Building: mini-jar-respect-includes/pom.xml
[INFO] run script /x1/jenkins/jenkins-slave/workspace/maven-plugins-ITs-m3/maven-shade-plugin/target/it/mini-jar-respect-includes/verify.bsh
[INFO] ..SUCCESS (3.5 s)
[INFO] Building: services-resource-transformer/pom.xml
[INFO] run script /x1/jenkins/jenkins-slave/workspace/maven-plugins-ITs-m3/maven-shade-plugin/target/it/services-resource-transformer/verify.bsh
[INFO] ..SUCCESS (3.1 s)
[INFO] Building: shadePomDependency/pom.xml
[INFO] ..SUCCESS (3.8 s)
[INFO] Building: reloc-includes-excludes/pom.xml
[INFO] run script /x1/jenkins/jenkins-slave/workspace/maven-plugins-ITs-m3/maven-shade-plugin/target/it/reloc-includes-excludes/verify.bsh
[INFO] ..SUCCESS (3.1 s)
[INFO] Building: rerun-with-reloc/pom.xml
[INFO] ..SUCCESS (3.8 s)
[INFO] Building: mini-jar-package-info/pom.xml
[INFO] run script /x1/jenkins/jenkins-slave/workspace/maven-plugins-ITs-m3/maven-shade-plugin/target/it/mini-jar-package-info/verify.bsh
[INFO] ..SUCCESS (3.8 s)
[INFO] Building: attached-artifact-type/pom.xml
[INFO] ..SUCCESS (4.0 s)
[INFO] Building: implicit-inclusion-of-project-artifact/pom.xml
[INFO] run script /x1/jenkins/jenkins-slave/workspace/maven-plugins-ITs-m3/maven-shade-plugin/target/it/implicit-inclusion-of-project-artifact/verify.bsh
[INFO] ..SUCCESS (3.1 s)
[INFO] Building: finalNameShade-attached/pom.xml
[INFO] run script /x1/jenkins/jenkins-slave/workspace/maven-plugins-ITs-m3/maven-shade-plugin/target/it/finalNameShade-attached/setup.bsh
[INFO] run script /x1/jenkins/jenkins-slave/workspace/maven-plugins-ITs-m3/maven-shade-plugin/target/it/finalNameShade-attached/verify.bsh
[INFO] ..SUCCESS (3.0 s)
[INFO] Building: mini-jar/pom.xml
[INFO] run script /x1/jenkins/jenkins-slave/workspace/maven-plugins-ITs-m3/maven-shade-plugin/target/it/mini-jar/verify.bsh
[INFO] ..SUCCESS (3.2 s)
[INFO] Building: reloc-anno/pom.xml
[INFO] ..SUCCESS (2.6 s)
[INFO] Building: filter-artifact-contents/pom.xml
[INFO] run script /x1/jenkins/jenkins-slave/workspace/maven-plugins-ITs-m3/maven-shade-plugin/target/it/filter-artifact-contents/verify.bsh
[INFO] ..SUCCESS (2.7 s)
[INFO] Building: reloc-class-from-string-pool/pom.xml
[INFO] ..SUCCESS (2.5 s)
[INFO] 
[INFO] --- maven-invoker-plugin:1.6:verify (integration-test) @ maven-shade-plugin ---
[INFO] -------------------------------------------------
[INFO] Build Summary:
[INFO]   Passed: 40, Failed: 0, Errors: 0, Skipped: 0
[INFO] -------------------------------------------------
[INFO] 
[INFO] --- maven-install-plugin:2.3.1:install (default-install) @ maven-shade-plugin ---
[INFO] Installing /x1/jenkins/jenkins-slave/workspace/maven-plugins-ITs-m3/maven-shade-plugin/target/maven-shade-plugin-2.0-SNAPSHOT.jar
to <https://builds.apache.org/job/maven-plugins-ITs-m3/ws/.repository/org/apache/maven/plugins/maven-shade-plugin/2.0-SNAPSHOT/maven-shade-plugin-2.0-SNAPSHOT.jar>
[INFO] Installing /x1/jenkins/jenkins-slave/workspace/maven-plugins-ITs-m3/maven-shade-plugin/pom.xml
to <https://builds.apache.org/job/maven-plugins-ITs-m3/ws/.repository/org/apache/maven/plugins/maven-shade-plugin/2.0-SNAPSHOT/maven-shade-plugin-2.0-SNAPSHOT.pom>
[INFO] Installing /x1/jenkins/jenkins-slave/workspace/maven-plugins-ITs-m3/maven-shade-plugin/target/maven-shade-plugin-2.0-SNAPSHOT-tests.jar
to <https://builds.apache.org/job/maven-plugins-ITs-m3/ws/.repository/org/apache/maven/plugins/maven-shade-plugin/2.0-SNAPSHOT/maven-shade-plugin-2.0-SNAPSHOT-tests.jar>
[INFO]                                                                         
[INFO] ------------------------------------------------------------------------
[INFO] Building Maven Plugins Aggregator 1-SNAPSHOT
[INFO] ------------------------------------------------------------------------
[INFO] 
[INFO] --- maven-clean-plugin:2.4.1:clean (default-clean) @ maven-plugins-aggregator ---
[INFO] Deleting /x1/jenkins/jenkins-slave/workspace/maven-plugins-ITs-m3/target
[INFO] 
[INFO] --- maven-remote-resources-plugin:1.1:process (default) @ maven-plugins-aggregator
---
[INFO] 
[INFO] --- maven-install-plugin:2.3.1:install (default-install) @ maven-plugins-aggregator
---
[INFO] Installing /x1/jenkins/jenkins-slave/workspace/maven-plugins-ITs-m3/pom.xml to <https://builds.apache.org/job/maven-plugins-ITs-m3/ws/.repository/org/apache/maven/plugins/maven-plugins-aggregator/1-SNAPSHOT/maven-plugins-aggregator-1-SNAPSHOT.pom>
[INFO] ------------------------------------------------------------------------
[INFO] Reactor Summary:
[INFO] 
[INFO] Maven Plugins ..................................... SUCCESS [7.184s]
[INFO] Maven ACR Plugin .................................. SUCCESS [24.553s]
[INFO] Maven Ant Plugin .................................. SUCCESS [1:15.587s]
[INFO] Maven AntRun Plugin ............................... SUCCESS [47.558s]
[INFO] Maven Eclipse Plugin .............................. SUCCESS [7:11.334s]
[INFO] Maven Assembly Plugin ............................. SUCCESS [8:57.741s]
[INFO] Maven Changelog Plugin ............................ SUCCESS [47.559s]
[INFO] Maven Changes Report Plugin ....................... SUCCESS [48.060s]
[INFO] Maven Checkstyle Plugin ........................... SUCCESS [1:18.662s]
[INFO] Maven Clean Plugin ................................ SUCCESS [17.445s]
[INFO] Maven Compiler Plugin ............................. SUCCESS [1:08.128s]
[INFO] Maven Dependency Plugin ........................... SUCCESS [2:06.774s]
[INFO] Maven Deploy Plugin ............................... SUCCESS [1:01.478s]
[INFO] Maven DOAP Plugin ................................. SUCCESS [15.899s]
[INFO] Maven Documentation Checker Plugin ................ SUCCESS [7.517s]
[INFO] Maven EAR Plugin .................................. SUCCESS [2:54.356s]
[INFO] Maven EJB Plugin .................................. SUCCESS [22.442s]
[INFO] Maven GPG Plugin .................................. SUCCESS [15.552s]
[INFO] Maven Help Plugin ................................. SUCCESS [34.433s]
[INFO] Maven IDEA Plugin ................................. SUCCESS [6.610s]
[INFO] Maven Install Plugin .............................. SUCCESS [40.705s]
[INFO] Maven JAR Plugin .................................. SUCCESS [1:02.340s]
[INFO] Maven Jarsigner Plugin ............................ SUCCESS [23.654s]
[INFO] Maven Javadoc Plugin .............................. SUCCESS [4:18.514s]
[INFO] Maven Linkcheck Plugin ............................ SUCCESS [2.355s]
[INFO] Maven One Plugin .................................. SUCCESS [1.493s]
[INFO] Maven Patch Plugin ................................ SUCCESS [10.879s]
[INFO] Maven PDF Plugin .................................. SUCCESS [2:25.244s]
[INFO] Maven PMD Plugin .................................. SUCCESS [35.158s]
[INFO] Maven RAR Plugin .................................. SUCCESS [6.631s]
[INFO] Maven Reactor Plugin .............................. SUCCESS [2.472s]
[INFO] Maven Repository Plugin ........................... FAILURE [26.331s]
[INFO] Maven Invoker Plugin .............................. SUCCESS [3:49.742s]
[INFO] Maven Resources Plugin ............................ SUCCESS [47.299s]
[INFO] Maven Site Plugin 3 ............................... SUCCESS [7:10.308s]
[INFO] Maven Source Plugin ............................... SUCCESS [32.731s]
[INFO] Maven Stage Plugin ................................ SUCCESS [1.471s]
[INFO] Maven Toolchains Plugin ........................... SUCCESS [2.081s]
[INFO] Maven Verifier Plugin ............................. SUCCESS [12.875s]
[INFO] Maven WAR Plugin .................................. SUCCESS [1:03.443s]
[INFO] Maven Project Info Reports Plugin ................. SUCCESS [2:17.901s]
[INFO] Maven Remote Resources Plugin ..................... FAILURE [33.553s]
[INFO] Maven Shade Plugin ................................ SUCCESS [2:49.036s]
[INFO] Maven Plugins Aggregator .......................... SUCCESS [0.062s]
[INFO] ------------------------------------------------------------------------
[INFO] BUILD FAILURE
[INFO] ------------------------------------------------------------------------
[INFO] Total time: 1:00:32.253s
[INFO] Finished at: Wed Aug 01 18:35:58 GMT 2012
[INFO] Final Memory: 72M/994M
[INFO] ------------------------------------------------------------------------
[WARNING] The requested profile "apache.snapshots" could not be activated because it does
not exist.
[ERROR] Failed to execute goal org.apache.maven.plugins:maven-surefire-plugin:2.12:test (integration-tests)
on project maven-repository-plugin: There are test failures.
[ERROR] 
[ERROR] Please refer to /x1/jenkins/jenkins-slave/workspace/maven-plugins-ITs-m3/maven-repository-plugin/target/surefire-reports
for the individual test results.
[ERROR] -> [Help 1]
[ERROR] Failed to execute goal org.apache.maven.plugins:maven-failsafe-plugin:2.9:verify (integration-tests)
on project maven-remote-resources-plugin: There are test failures.
[ERROR] 
[ERROR] Please refer to /x1/jenkins/jenkins-slave/workspace/maven-plugins-ITs-m3/maven-remote-resources-plugin/target/failsafe-reports
for the individual test results.
[ERROR] -> [Help 1]
[ERROR] 
[ERROR] To see the full stack trace of the errors, re-run Maven with the -e switch.
[ERROR] Re-run Maven using the -X switch to enable full debug logging.
[ERROR] 
[ERROR] For more information about the errors and possible solutions, please read the following
articles:
[ERROR] [Help 1] http://cwiki.apache.org/confluence/display/MAVEN/MojoFailureException
[ERROR] 
[ERROR] After correcting the problems, you can resume the build with the command
[ERROR]   mvn <goals> -rf :maven-repository-plugin
Build step 'Invoke top-level Maven targets' marked build as failure
Recording test results

Mime
View raw message