maven-notifications mailing list archives

Site index · List index
Message view « Date » · « Thread »
Top « Date » · « Thread »
From Apache Jenkins Server <jenk...@builds.apache.org>
Subject Build failed in Jenkins: maven-plugins-ITs-m2 #668
Date Thu, 02 Aug 2012 20:03:32 GMT
See <https://builds.apache.org/job/maven-plugins-ITs-m2/668/changes>

Changes:

[olamy] code formatting

[olamy] [MRAR-21] Non Java dependencies shouldn't be included in the RAR
Submitted by Cedric Vidal.

------------------------------------------
[...truncated 9817 lines...]
[INFO] Assembling webapp [maven-war-plugin-test] in [<https://builds.apache.org/job/maven-plugins-ITs-m2/ws/maven-war-plugin/target/test-classes/unit/waroverlays/overlays-includes-excludes-multiple-defs]>
[INFO] Processing overlay [ id wartests:overlay-full-3]
[INFO] Processing overlay [ id wartests:overlay-full-1]
[INFO] Processing overlay [ id wartests:overlay-full-3]
[INFO] Processing war project
[INFO] Copying webapp resources [<https://builds.apache.org/job/maven-plugins-ITs-m2/ws/maven-war-plugin/target/test-classes/unit/waroverlays/overlays-includes-excludes-multiple-defs-test-data/source]>
[INFO] Processing overlay [ id wartests:overlay-full-2]
[INFO] Webapp assembled in [1255 msecs]
[INFO] Exploding webapp
[INFO] Assembling webapp [maven-war-plugin-test] in [<https://builds.apache.org/job/maven-plugins-ITs-m2/ws/maven-war-plugin/target/test-classes/unit/waroverlays/overlays-includes-excludes-multiple-defs2]>
[INFO] Processing overlay [ id wartests:overlay-full-3]
[INFO] Processing overlay [ id wartests:overlay-full-1]
[INFO] Processing overlay [ id wartests:overlay-full-3]
[INFO] Processing war project
[INFO] Copying webapp resources [<https://builds.apache.org/job/maven-plugins-ITs-m2/ws/maven-war-plugin/target/test-classes/unit/waroverlays/overlays-includes-excludes-multiple-defs2-test-data/source]>
[INFO] Processing overlay [ id wartests:overlay-full-2]
[INFO] Webapp assembled in [1220 msecs]
[INFO] Exploding webapp
[INFO] Assembling webapp [maven-war-plugin-test] in [<https://builds.apache.org/job/maven-plugins-ITs-m2/ws/maven-war-plugin/target/test-classes/unit/waroverlays/cache-updated-overlay]>
[INFO] Processing war project
[INFO] Copying webapp resources [<https://builds.apache.org/job/maven-plugins-ITs-m2/ws/maven-war-plugin/target/test-classes/unit/waroverlays/cache-updated-overlay-test-data/source]>
[INFO] Processing overlay [ id wartests:overlay-one]
[INFO] Processing overlay [ id wartests:overlay-two]
[INFO] Webapp assembled in [228 msecs]
[INFO] Exploding webapp
[INFO] Assembling webapp [maven-war-plugin-test] in [<https://builds.apache.org/job/maven-plugins-ITs-m2/ws/maven-war-plugin/target/test-classes/unit/waroverlays/cache-updated-overlay]>
[INFO] Processing war project
[INFO] Copying webapp resources [<https://builds.apache.org/job/maven-plugins-ITs-m2/ws/maven-war-plugin/target/test-classes/unit/waroverlays/cache-updated-overlay-test-data/source]>
[INFO] Processing overlay [ id wartests:overlay-two]
[INFO] File [WEB-INF/web.xml] belonged to overlay [wartests:overlay-one] so it will be overwritten.
[INFO] File [index.jsp] belonged to overlay [wartests:overlay-one] so it will be overwritten.
[INFO] Processing overlay [ id wartests:overlay-one]
[INFO] Webapp assembled in [8 msecs]
[INFO] Exploding webapp
[INFO] Assembling webapp [maven-war-plugin-test] in [<https://builds.apache.org/job/maven-plugins-ITs-m2/ws/maven-war-plugin/target/test-classes/unit/waroverlays/cache-removed-overlay]>
[INFO] Processing war project
[INFO] Copying webapp resources [<https://builds.apache.org/job/maven-plugins-ITs-m2/ws/maven-war-plugin/target/test-classes/unit/waroverlays/cache-removed-overlay-test-data/source]>
[INFO] Processing overlay [ id wartests:overlay-one]
[INFO] Processing overlay [ id wartests:overlay-two]
[INFO] Webapp assembled in [231 msecs]
[INFO] Exploding webapp
[INFO] Assembling webapp [maven-war-plugin-test] in [<https://builds.apache.org/job/maven-plugins-ITs-m2/ws/maven-war-plugin/target/test-classes/unit/waroverlays/cache-removed-overlay]>
[WARNING] Dependency [Dependency {groupId=wartests, artifactId=overlay-one, version=0.0-Test,
type=war}] has been removed from the project. If it was included in the build as an overlay,
consider cleaning the target directory of the project (mvn clean)
[INFO] Processing war project
[INFO] Copying webapp resources [<https://builds.apache.org/job/maven-plugins-ITs-m2/ws/maven-war-plugin/target/test-classes/unit/waroverlays/cache-removed-overlay-test-data/source]>
[INFO] Processing overlay [ id wartests:overlay-two]
[WARNING] File [WEB-INF/web.xml] belonged to overlay [wartests:overlay-one] which does not
exist anymore in the current project. It is recommended to invoke clean if the dependencies
of the project changed.
[WARNING] File [index.jsp] belonged to overlay [wartests:overlay-one] which does not exist
anymore in the current project. It is recommended to invoke clean if the dependencies of the
project changed.
[INFO] Webapp assembled in [5 msecs]
Tests run: 11, Failures: 0, Errors: 0, Skipped: 0, Time elapsed: 7.928 sec
Running org.apache.maven.plugin.war.WarInPlaceMojoTest
[INFO] Generating webapp in source directory [<https://builds.apache.org/job/maven-plugins-ITs-m2/ws/maven-war-plugin/target/test-classes/unit/warexplodedinplacemojo/test-dir/SimpleExplodedInplaceWar-test-data/source]>
[INFO] Assembling webapp [maven-war-plugin-test] in [<https://builds.apache.org/job/maven-plugins-ITs-m2/ws/maven-war-plugin/target/test-classes/unit/warexplodedinplacemojo/test-dir/SimpleExplodedInplaceWar-test-data/source]>
[INFO] Processing war project
[INFO] Copying webapp webResources [<https://builds.apache.org/job/maven-plugins-ITs-m2/ws/maven-war-plugin/target/test-classes/unit/warexplodedinplacemojo/test-dir/resources]>
to [<https://builds.apache.org/job/maven-plugins-ITs-m2/ws/maven-war-plugin/target/test-classes/unit/warexplodedinplacemojo/test-dir/SimpleExplodedInplaceWar-test-data/source]>
[INFO] Webapp assembled in [3 msecs]
Tests run: 2, Failures: 0, Errors: 0, Skipped: 0, Time elapsed: 0.088 sec

Results :

Tests run: 85, Failures: 0, Errors: 0, Skipped: 0

[INFO] [jar:jar {execution: default-jar}]
[INFO] Building jar: <https://builds.apache.org/job/maven-plugins-ITs-m2/ws/maven-war-plugin/target/maven-war-plugin-2.3-SNAPSHOT.jar>
[INFO] [plugin:addPluginArtifactMetadata {execution: default-addPluginArtifactMetadata}]
[INFO] [invoker:install {execution: integration-test}]
[INFO] Installing <https://builds.apache.org/job/maven-plugins-ITs-m2/ws/maven-plugins/pom.xml>
to <https://builds.apache.org/job/maven-plugins-ITs-m2/ws/maven-war-plugin/target/local-repo/org/apache/maven/plugins/maven-plugins/23-SNAPSHOT/maven-plugins-23-SNAPSHOT.pom>
[INFO] Installing <https://builds.apache.org/job/maven-plugins-ITs-m2/ws/maven-war-plugin/pom.xml>
to <https://builds.apache.org/job/maven-plugins-ITs-m2/ws/maven-war-plugin/target/local-repo/org/apache/maven/plugins/maven-war-plugin/2.3-SNAPSHOT/maven-war-plugin-2.3-SNAPSHOT.pom>
[INFO] Installing <https://builds.apache.org/job/maven-plugins-ITs-m2/ws/maven-war-plugin/target/maven-war-plugin-2.3-SNAPSHOT.jar>
to <https://builds.apache.org/job/maven-plugins-ITs-m2/ws/maven-war-plugin/target/local-repo/org/apache/maven/plugins/maven-war-plugin/2.3-SNAPSHOT/maven-war-plugin-2.3-SNAPSHOT.jar>
[INFO] [invoker:integration-test {execution: integration-test}]
[INFO] Building: MWAR-133/pom.xml
[INFO] run script <https://builds.apache.org/job/maven-plugins-ITs-m2/ws/maven-war-plugin/target/it/MWAR-133/verify.bsh>
[INFO] ..SUCCESS (2.7 s)
[INFO] Building: web-resources-filtering/pom.xml
[INFO] run script <https://builds.apache.org/job/maven-plugins-ITs-m2/ws/maven-war-plugin/target/it/web-resources-filtering/verify.bsh>
[INFO] ..SUCCESS (4.2 s)
[INFO] Building: MWAR-129/pom.xml
[INFO] run script <https://builds.apache.org/job/maven-plugins-ITs-m2/ws/maven-war-plugin/target/it/MWAR-129/verify.bsh>
[INFO] ..SUCCESS (2.3 s)
[INFO] Building: MWAR-131/pom.xml
[INFO] run script <https://builds.apache.org/job/maven-plugins-ITs-m2/ws/maven-war-plugin/target/it/MWAR-131/verify.bsh>
[INFO] ..SUCCESS (6.4 s)
[INFO] Building: MWAR-139/pom.xml
[INFO] run script <https://builds.apache.org/job/maven-plugins-ITs-m2/ws/maven-war-plugin/target/it/MWAR-139/verify.bsh>
[INFO] ..SUCCESS (3.0 s)
[INFO] Building: MWAR-143/pom.xml
[INFO] run script <https://builds.apache.org/job/maven-plugins-ITs-m2/ws/maven-war-plugin/target/it/MWAR-143/verify.bsh>
[INFO] ..SUCCESS (9.3 s)
[INFO] Building: manifest-content/pom.xml
[INFO] run script <https://builds.apache.org/job/maven-plugins-ITs-m2/ws/maven-war-plugin/target/it/manifest-content/verify.bsh>
[INFO] ..SUCCESS (3.0 s)
[INFO] Building: MWAR-240/pom.xml
[INFO] run script <https://builds.apache.org/job/maven-plugins-ITs-m2/ws/maven-war-plugin/target/it/MWAR-240/verify.bsh>
[INFO] ..SUCCESS (3.2 s)
[INFO] Building: MWAR-96/pom.xml
[INFO] run script <https://builds.apache.org/job/maven-plugins-ITs-m2/ws/maven-war-plugin/target/it/MWAR-96/verify.bsh>
[INFO] ..SUCCESS (3.1 s)
[INFO] Building: MWAR-62/pom.xml
[INFO] run script <https://builds.apache.org/job/maven-plugins-ITs-m2/ws/maven-war-plugin/target/it/MWAR-62/verify.bsh>
[INFO] ..SUCCESS (2.2 s)
[INFO] Building: default/pom.xml
[INFO] run script <https://builds.apache.org/job/maven-plugins-ITs-m2/ws/maven-war-plugin/target/it/default/verify.bsh>
[INFO] ..SUCCESS (3.4 s)
[INFO] Building: simple-war-no-webxml/pom.xml
[INFO] run script <https://builds.apache.org/job/maven-plugins-ITs-m2/ws/maven-war-plugin/target/it/simple-war-no-webxml/verify.bsh>
[INFO] ..SUCCESS (3.1 s)
[INFO] Building: simple-war-project/pom.xml
[INFO] run script <https://builds.apache.org/job/maven-plugins-ITs-m2/ws/maven-war-plugin/target/it/simple-war-project/verify.bsh>
[INFO] ..SUCCESS (3.1 s)
[INFO] Building: scoped-dependency-same-artifact/pom.xml
[INFO] run script <https://builds.apache.org/job/maven-plugins-ITs-m2/ws/maven-war-plugin/target/it/scoped-dependency-same-artifact/verify.bsh>
[INFO] ..SUCCESS (3.3 s)
[INFO] [invoker:verify {execution: integration-test}]
[INFO] -------------------------------------------------
[INFO] Build Summary:
[INFO]   Passed: 14, Failed: 0, Errors: 0, Skipped: 0
[INFO] -------------------------------------------------
[INFO] [install:install {execution: default-install}]
[INFO] Installing <https://builds.apache.org/job/maven-plugins-ITs-m2/ws/maven-war-plugin/target/maven-war-plugin-2.3-SNAPSHOT.jar>
to <https://builds.apache.org/job/maven-plugins-ITs-m2/ws/.repository/org/apache/maven/plugins/maven-war-plugin/2.3-SNAPSHOT/maven-war-plugin-2.3-SNAPSHOT.jar>
[INFO] ------------------------------------------------------------------------
[INFO] Building Maven Plugins Aggregator
[INFO]    task-segment: [clean, install]
[INFO] ------------------------------------------------------------------------
[INFO] [clean:clean {execution: default-clean}]
[INFO] Deleting <https://builds.apache.org/job/maven-plugins-ITs-m2/ws/target>
[INFO] [remote-resources:process {execution: default}]
[INFO] [site:attach-descriptor {execution: default-attach-descriptor}]
[INFO] [install:install {execution: default-install}]
[INFO] Installing <https://builds.apache.org/job/maven-plugins-ITs-m2/ws/pom.xml> to
<https://builds.apache.org/job/maven-plugins-ITs-m2/ws/.repository/org/apache/maven/plugins/maven-plugins-aggregator/1-SNAPSHOT/maven-plugins-aggregator-1-SNAPSHOT.pom>
[INFO] 
[INFO] 
[INFO] ------------------------------------------------------------------------
[INFO] Reactor Summary:
[INFO] ------------------------------------------------------------------------
[INFO] Maven Plugins ......................................... SUCCESS [32.469s]
[INFO] Maven ACR Plugin ...................................... SUCCESS [25.409s]
[INFO] Maven Ant Plugin ...................................... SUCCESS [1:38.309s]
[INFO] Maven AntRun Plugin ................................... SUCCESS [1:39.164s]
[INFO] Maven Eclipse Plugin .................................. SUCCESS [7:56.440s]
[INFO] Maven Assembly Plugin ................................. SUCCESS [11:42.452s]
[INFO] Maven Changelog Plugin ................................ SUCCESS [1:05.564s]
[INFO] Maven Compiler Plugin ................................. SUCCESS [36.756s]
[INFO] Maven Changes Report Plugin ........................... SUCCESS [1:35.129s]
[INFO] Maven Checkstyle Plugin ............................... SUCCESS [2:01.891s]
[INFO] Maven Clean Plugin .................................... SUCCESS [20.728s]
[INFO] Maven Dependency Plugin ............................... FAILED [0.761s]
[INFO] Maven Deploy Plugin ................................... SUCCESS [1:32.959s]
[INFO] Maven DOAP Plugin ..................................... SUCCESS [26.367s]
[INFO] Maven Documentation Checker Plugin .................... SUCCESS [9.528s]
[INFO] Maven EAR Plugin ...................................... SUCCESS [4:04.626s]
[INFO] Maven EJB Plugin ...................................... SUCCESS [29.101s]
[INFO] Maven GPG Plugin ...................................... SUCCESS [13.389s]
[INFO] Maven Help Plugin ..................................... SUCCESS [34.929s]
[INFO] Maven IDEA Plugin ..................................... SUCCESS [11.867s]
[INFO] Maven Install Plugin .................................. SUCCESS [51.663s]
[INFO] Maven JAR Plugin ...................................... SUCCESS [1:31.654s]
[INFO] Maven Jarsigner Plugin ................................ SUCCESS [29.291s]
[INFO] Maven Javadoc Plugin .................................. SUCCESS [6:10.086s]
[INFO] Maven Linkcheck Plugin ................................ SUCCESS [2.769s]
[INFO] Maven One Plugin ...................................... SUCCESS [2.852s]
[INFO] Maven Patch Plugin .................................... SUCCESS [11.649s]
[INFO] Maven PDF Plugin ...................................... SUCCESS [49.500s]
[INFO] Maven PMD Plugin ...................................... SUCCESS [1:17.312s]
[INFO] Maven RAR Plugin ...................................... SUCCESS [7.763s]
[INFO] Maven Reactor Plugin .................................. SUCCESS [2.735s]
[INFO] Maven Repository Plugin ............................... FAILED [24.945s]
[INFO] Maven Resources Plugin ................................ FAILED [0.458s]
[INFO] Maven Site Plugin 3 ................................... SUCCESS [7:26.085s]
[INFO] Maven Source Plugin ................................... SUCCESS [40.681s]
[INFO] Maven Stage Plugin .................................... SUCCESS [2.901s]
[INFO] Maven Toolchains Plugin ............................... SUCCESS [2.353s]
[INFO] Maven Verifier Plugin ................................. SUCCESS [16.412s]
[INFO] Maven WAR Plugin ...................................... SUCCESS [1:16.625s]
[INFO] Maven Plugins Aggregator .............................. SUCCESS [1.299s]
[INFO] ------------------------------------------------------------------------
[INFO] Error for project: Maven Dependency Plugin (during install)
[INFO] ------------------------------------------------------------------------
[INFO] Failed to resolve artifact.

Missing:
----------
1) org.apache.maven.shared:maven-dependency-tree:jar:2.0

  Try downloading the file manually from the project website.

  Then, install it using the command: 
      mvn install:install-file -DgroupId=org.apache.maven.shared -DartifactId=maven-dependency-tree
-Dversion=2.0 -Dpackaging=jar -Dfile=/path/to/file

  Alternatively, if you host your own repository you can deploy the file there: 
      mvn deploy:deploy-file -DgroupId=org.apache.maven.shared -DartifactId=maven-dependency-tree
-Dversion=2.0 -Dpackaging=jar -Dfile=/path/to/file -Durl=[url] -DrepositoryId=[id]

  Path to dependency: 
  	1) org.apache.maven.plugins:maven-dependency-plugin:maven-plugin:2.6-SNAPSHOT
  	2) org.apache.maven.shared:maven-dependency-tree:jar:2.0

----------
1 required artifact is missing.

for artifact: 
  org.apache.maven.plugins:maven-dependency-plugin:maven-plugin:2.6-SNAPSHOT

from the specified remote repositories:
  central (http://repo1.maven.org/maven2),
  Nexus (http://repository.apache.org/snapshots)



[INFO] ------------------------------------------------------------------------
[INFO] Error for project: Maven Repository Plugin (during install)
[INFO] ------------------------------------------------------------------------
[INFO] There are test failures.

Please refer to <https://builds.apache.org/job/maven-plugins-ITs-m2/ws/maven-repository-plugin/target/surefire-reports>
for the individual test results.
[INFO] ------------------------------------------------------------------------
[INFO] Error for project: Maven Resources Plugin (during install)
[INFO] ------------------------------------------------------------------------
[INFO] A required plugin was not found: Plugin could not be found - check that the goal name
is correct: Unable to download the artifact from any repository

Try downloading the file manually from the project website.

Then, install it using the command: 
    mvn install:install-file -DgroupId=org.apache.maven.plugins -DartifactId=maven-invoker-plugin
-Dversion=1.7-SNAPSHOT -Dpackaging=maven-plugin -Dfile=/path/to/file

Alternatively, if you host your own repository you can deploy the file there: 
    mvn deploy:deploy-file -DgroupId=org.apache.maven.plugins -DartifactId=maven-invoker-plugin
-Dversion=1.7-SNAPSHOT -Dpackaging=maven-plugin -Dfile=/path/to/file -Durl=[url] -DrepositoryId=[id]


  org.apache.maven.plugins:maven-invoker-plugin:maven-plugin:1.7-SNAPSHOT

from the specified remote repositories:
  central (http://repo1.maven.org/maven2)


  org.apache.maven.plugins:maven-invoker-plugin:maven-plugin:1.7-SNAPSHOT

from the specified remote repositories:
  central (http://repo1.maven.org/maven2)


[INFO] ------------------------------------------------------------------------
[INFO] For more information, run Maven with the -e switch
[INFO] ------------------------------------------------------------------------
[INFO] BUILD ERRORS
[INFO] ------------------------------------------------------------------------
[INFO] Total time: 59 minutes 9 seconds
[INFO] Finished at: Thu Aug 02 20:03:31 UTC 2012
[INFO] Final Memory: 249M/1016M
[INFO] ------------------------------------------------------------------------
Build step 'Invoke top-level Maven targets' marked build as failure

Mime
View raw message