maven-notifications mailing list archives

Site index · List index
Message view « Date » · « Thread »
Top « Date » · « Thread »
From Apache Jenkins Server <jenk...@builds.apache.org>
Subject Build failed in Jenkins: maven-plugins-ITs-m2 #669
Date Thu, 02 Aug 2012 21:05:45 GMT
See <https://builds.apache.org/job/maven-plugins-ITs-m2/669/changes>

Changes:

[olamy] missing @since

[olamy] missed to add files

[olamy] [MRAR-15] Allow more customizations of resources to be included

[olamy] add it with filtering enabled

[olamy] add missing @since

[olamy] [MRAR-22] Allow filtering of source resources

[snicoll] MEAR-150: Support for no version for ejb file name mapping. Patch submitted by Philippe
Marschall

------------------------------------------
[...truncated 9867 lines...]
[INFO] Webapp assembled in [2 msecs]
[INFO] Building war: <https://builds.apache.org/job/maven-plugins-ITs-m2/ws/maven-war-plugin/target/test-classes/unit/warmojotest/PrimaryArtifact-output/simple.war>
[INFO] WEB-INF/web.xml already added, skipping
[INFO] Packaging webapp
[INFO] Assembling webapp [maven-war-plugin-test] in [<https://builds.apache.org/job/maven-plugins-ITs-m2/ws/maven-war-plugin/target/test-classes/unit/warmojotest/NotPrimaryArtifact]>
[INFO] Processing war project
[INFO] Copying webapp resources [<https://builds.apache.org/job/maven-plugins-ITs-m2/ws/maven-war-plugin/target/test-classes/unit/warmojotest/NotPrimaryArtifact-test-data/source]>
[INFO] Webapp assembled in [2 msecs]
[INFO] Building war: <https://builds.apache.org/job/maven-plugins-ITs-m2/ws/maven-war-plugin/target/test-classes/unit/warmojotest/NotPrimaryArtifact-output/simple.war>
[INFO] WEB-INF/web.xml already added, skipping
[INFO] Packaging webapp
[INFO] Assembling webapp [maven-war-plugin-test] in [<https://builds.apache.org/job/maven-plugins-ITs-m2/ws/maven-war-plugin/target/test-classes/unit/warmojotest/SimpleWarWithMetaInfContent]>
[INFO] Processing war project
[INFO] Copying webapp resources [<https://builds.apache.org/job/maven-plugins-ITs-m2/ws/maven-war-plugin/target/test-classes/unit/warmojotest/SimpleWarWithMetaInfContent-test-data/source]>
[INFO] Webapp assembled in [3 msecs]
[INFO] Building war: <https://builds.apache.org/job/maven-plugins-ITs-m2/ws/maven-war-plugin/target/test-classes/unit/warmojotest/SimpleWarWithMetaInfContent-output/simple.war>
[INFO] WEB-INF/web.xml already added, skipping
[INFO] Packaging webapp
[INFO] Assembling webapp [maven-war-plugin-test] in [<https://builds.apache.org/job/maven-plugins-ITs-m2/ws/maven-war-plugin/target/test-classes/unit/warmojotest/SimpleWarWithContainerConfig]>
[INFO] Processing war project
[INFO] Copying webapp resources [<https://builds.apache.org/job/maven-plugins-ITs-m2/ws/maven-war-plugin/target/test-classes/unit/warmojotest/SimpleWarWithContainerConfig-test-data/source]>
[INFO] Webapp assembled in [3 msecs]
[INFO] Building war: <https://builds.apache.org/job/maven-plugins-ITs-m2/ws/maven-war-plugin/target/test-classes/unit/warmojotest/SimpleWarWithContainerConfig-output/simple.war>
[INFO] WEB-INF/web.xml already added, skipping
[INFO] Packaging webapp
[INFO] Assembling webapp [maven-war-plugin-test] in [<https://builds.apache.org/job/maven-plugins-ITs-m2/ws/maven-war-plugin/target/test-classes/unit/warmojotest/SimpleWarMissingWebXmlFalse]>
[INFO] Processing war project
[INFO] Copying webapp resources [<https://builds.apache.org/job/maven-plugins-ITs-m2/ws/maven-war-plugin/target/test-classes/unit/warmojotest/SimpleWarMissingWebXmlFalse-test-data/source]>
[INFO] Webapp assembled in [2 msecs]
[INFO] Building war: <https://builds.apache.org/job/maven-plugins-ITs-m2/ws/maven-war-plugin/target/test-classes/unit/warmojotest/SimpleWarMissingWebXmlFalse-output/simple.war>
[INFO] Packaging webapp
[INFO] Assembling webapp [maven-war-plugin-test] in [<https://builds.apache.org/job/maven-plugins-ITs-m2/ws/maven-war-plugin/target/test-classes/unit/warmojotest/SimpleWarMissingWebXmlTrue]>
[INFO] Processing war project
[INFO] Copying webapp resources [<https://builds.apache.org/job/maven-plugins-ITs-m2/ws/maven-war-plugin/target/test-classes/unit/warmojotest/SimpleWarMissingWebXmlTrue-test-data/source]>
[INFO] Webapp assembled in [2 msecs]
[INFO] Building war: <https://builds.apache.org/job/maven-plugins-ITs-m2/ws/maven-war-plugin/target/test-classes/unit/warmojotest/SimpleWarMissingWebXmlTrue-output/simple.war>
[INFO] Packaging webapp
[INFO] Assembling webapp [maven-war-plugin-test] in [<https://builds.apache.org/job/maven-plugins-ITs-m2/ws/maven-war-plugin/target/test-classes/unit/warmojotest/AttachClasses]>
[INFO] Processing war project
[INFO] Copying webapp resources [<https://builds.apache.org/job/maven-plugins-ITs-m2/ws/maven-war-plugin/target/test-classes/unit/warmojotest/AttachClasses-test-data/source]>
[INFO] Webapp assembled in [3 msecs]
[INFO] Building war: <https://builds.apache.org/job/maven-plugins-ITs-m2/ws/maven-war-plugin/target/test-classes/unit/warmojotest/AttachClasses-output/simple.war>
[INFO] WEB-INF/web.xml already added, skipping
[INFO] Packaging classes
[INFO] Building jar: <https://builds.apache.org/job/maven-plugins-ITs-m2/ws/maven-war-plugin/target/test-classes/unit/warmojotest/AttachClasses-output/simple-classes.jar>
[INFO] Packaging webapp
[INFO] Assembling webapp [maven-war-plugin-test] in [<https://builds.apache.org/job/maven-plugins-ITs-m2/ws/maven-war-plugin/target/test-classes/unit/warmojotest/AttachClassesCustomClassifier]>
[INFO] Processing war project
[INFO] Copying webapp resources [<https://builds.apache.org/job/maven-plugins-ITs-m2/ws/maven-war-plugin/target/test-classes/unit/warmojotest/AttachClassesCustomClassifier-test-data/source]>
[INFO] Webapp assembled in [3 msecs]
[INFO] Building war: <https://builds.apache.org/job/maven-plugins-ITs-m2/ws/maven-war-plugin/target/test-classes/unit/warmojotest/AttachClassesCustomClassifier-output/simple.war>
[INFO] WEB-INF/web.xml already added, skipping
[INFO] Packaging classes
[INFO] Building jar: <https://builds.apache.org/job/maven-plugins-ITs-m2/ws/maven-war-plugin/target/test-classes/unit/warmojotest/AttachClassesCustomClassifier-output/simple-mystuff.jar>
Tests run: 12, Failures: 0, Errors: 0, Skipped: 0, Time elapsed: 3.335 sec
Running org.apache.maven.plugin.war.overlay.OverlayManagerTest
Tests run: 5, Failures: 0, Errors: 0, Skipped: 0, Time elapsed: 0.185 sec

Results :

Tests run: 85, Failures: 0, Errors: 0, Skipped: 0

[INFO] [jar:jar {execution: default-jar}]
[INFO] Building jar: <https://builds.apache.org/job/maven-plugins-ITs-m2/ws/maven-war-plugin/target/maven-war-plugin-2.3-SNAPSHOT.jar>
[INFO] [plugin:addPluginArtifactMetadata {execution: default-addPluginArtifactMetadata}]
[INFO] [invoker:install {execution: integration-test}]
[INFO] Installing <https://builds.apache.org/job/maven-plugins-ITs-m2/ws/maven-plugins/pom.xml>
to <https://builds.apache.org/job/maven-plugins-ITs-m2/ws/maven-war-plugin/target/local-repo/org/apache/maven/plugins/maven-plugins/23-SNAPSHOT/maven-plugins-23-SNAPSHOT.pom>
[INFO] Installing <https://builds.apache.org/job/maven-plugins-ITs-m2/ws/maven-war-plugin/pom.xml>
to <https://builds.apache.org/job/maven-plugins-ITs-m2/ws/maven-war-plugin/target/local-repo/org/apache/maven/plugins/maven-war-plugin/2.3-SNAPSHOT/maven-war-plugin-2.3-SNAPSHOT.pom>
[INFO] Installing <https://builds.apache.org/job/maven-plugins-ITs-m2/ws/maven-war-plugin/target/maven-war-plugin-2.3-SNAPSHOT.jar>
to <https://builds.apache.org/job/maven-plugins-ITs-m2/ws/maven-war-plugin/target/local-repo/org/apache/maven/plugins/maven-war-plugin/2.3-SNAPSHOT/maven-war-plugin-2.3-SNAPSHOT.jar>
[INFO] [invoker:integration-test {execution: integration-test}]
[INFO] Building: default/pom.xml
[INFO] run script <https://builds.apache.org/job/maven-plugins-ITs-m2/ws/maven-war-plugin/target/it/default/verify.bsh>
[INFO] ..SUCCESS (3.8 s)
[INFO] Building: MWAR-129/pom.xml
[INFO] run script <https://builds.apache.org/job/maven-plugins-ITs-m2/ws/maven-war-plugin/target/it/MWAR-129/verify.bsh>
[INFO] ..SUCCESS (2.2 s)
[INFO] Building: scoped-dependency-same-artifact/pom.xml
[INFO] run script <https://builds.apache.org/job/maven-plugins-ITs-m2/ws/maven-war-plugin/target/it/scoped-dependency-same-artifact/verify.bsh>
[INFO] ..SUCCESS (3.1 s)
[INFO] Building: manifest-content/pom.xml
[INFO] run script <https://builds.apache.org/job/maven-plugins-ITs-m2/ws/maven-war-plugin/target/it/manifest-content/verify.bsh>
[INFO] ..SUCCESS (2.9 s)
[INFO] Building: simple-war-project/pom.xml
[INFO] run script <https://builds.apache.org/job/maven-plugins-ITs-m2/ws/maven-war-plugin/target/it/simple-war-project/verify.bsh>
[INFO] ..SUCCESS (3.1 s)
[INFO] Building: MWAR-131/pom.xml
[INFO] run script <https://builds.apache.org/job/maven-plugins-ITs-m2/ws/maven-war-plugin/target/it/MWAR-131/verify.bsh>
[INFO] ..SUCCESS (6.4 s)
[INFO] Building: web-resources-filtering/pom.xml
[INFO] run script <https://builds.apache.org/job/maven-plugins-ITs-m2/ws/maven-war-plugin/target/it/web-resources-filtering/verify.bsh>
[INFO] ..SUCCESS (3.7 s)
[INFO] Building: MWAR-62/pom.xml
[INFO] run script <https://builds.apache.org/job/maven-plugins-ITs-m2/ws/maven-war-plugin/target/it/MWAR-62/verify.bsh>
[INFO] ..SUCCESS (2.1 s)
[INFO] Building: MWAR-96/pom.xml
[INFO] run script <https://builds.apache.org/job/maven-plugins-ITs-m2/ws/maven-war-plugin/target/it/MWAR-96/verify.bsh>
[INFO] ..SUCCESS (2.9 s)
[INFO] Building: simple-war-no-webxml/pom.xml
[INFO] run script <https://builds.apache.org/job/maven-plugins-ITs-m2/ws/maven-war-plugin/target/it/simple-war-no-webxml/verify.bsh>
[INFO] ..SUCCESS (3.0 s)
[INFO] Building: MWAR-133/pom.xml
[INFO] run script <https://builds.apache.org/job/maven-plugins-ITs-m2/ws/maven-war-plugin/target/it/MWAR-133/verify.bsh>
[INFO] ..SUCCESS (2.1 s)
[INFO] Building: MWAR-143/pom.xml
[INFO] run script <https://builds.apache.org/job/maven-plugins-ITs-m2/ws/maven-war-plugin/target/it/MWAR-143/verify.bsh>
[INFO] ..SUCCESS (7.2 s)
[INFO] Building: MWAR-240/pom.xml
[INFO] run script <https://builds.apache.org/job/maven-plugins-ITs-m2/ws/maven-war-plugin/target/it/MWAR-240/verify.bsh>
[INFO] ..SUCCESS (3.2 s)
[INFO] Building: MWAR-139/pom.xml
[INFO] run script <https://builds.apache.org/job/maven-plugins-ITs-m2/ws/maven-war-plugin/target/it/MWAR-139/verify.bsh>
[INFO] ..SUCCESS (2.8 s)
[INFO] [invoker:verify {execution: integration-test}]
[INFO] -------------------------------------------------
[INFO] Build Summary:
[INFO]   Passed: 14, Failed: 0, Errors: 0, Skipped: 0
[INFO] -------------------------------------------------
[INFO] [install:install {execution: default-install}]
[INFO] Installing <https://builds.apache.org/job/maven-plugins-ITs-m2/ws/maven-war-plugin/target/maven-war-plugin-2.3-SNAPSHOT.jar>
to <https://builds.apache.org/job/maven-plugins-ITs-m2/ws/.repository/org/apache/maven/plugins/maven-war-plugin/2.3-SNAPSHOT/maven-war-plugin-2.3-SNAPSHOT.jar>
[INFO] ------------------------------------------------------------------------
[INFO] Building Maven Plugins Aggregator
[INFO]    task-segment: [clean, install]
[INFO] ------------------------------------------------------------------------
[INFO] [clean:clean {execution: default-clean}]
[INFO] Deleting <https://builds.apache.org/job/maven-plugins-ITs-m2/ws/target>
[INFO] [remote-resources:process {execution: default}]
[INFO] [site:attach-descriptor {execution: default-attach-descriptor}]
[INFO] [install:install {execution: default-install}]
[INFO] Installing <https://builds.apache.org/job/maven-plugins-ITs-m2/ws/pom.xml> to
<https://builds.apache.org/job/maven-plugins-ITs-m2/ws/.repository/org/apache/maven/plugins/maven-plugins-aggregator/1-SNAPSHOT/maven-plugins-aggregator-1-SNAPSHOT.pom>
[INFO] 
[INFO] 
[INFO] ------------------------------------------------------------------------
[INFO] Reactor Summary:
[INFO] ------------------------------------------------------------------------
[INFO] Maven Plugins ......................................... SUCCESS [31.191s]
[INFO] Maven ACR Plugin ...................................... SUCCESS [27.439s]
[INFO] Maven Ant Plugin ...................................... SUCCESS [1:17.550s]
[INFO] Maven AntRun Plugin ................................... SUCCESS [48.801s]
[INFO] Maven Eclipse Plugin .................................. SUCCESS [6:06.748s]
[INFO] Maven Assembly Plugin ................................. SUCCESS [11:44.180s]
[INFO] Maven Changelog Plugin ................................ SUCCESS [49.600s]
[INFO] Maven Compiler Plugin ................................. SUCCESS [31.844s]
[INFO] Maven Changes Report Plugin ........................... SUCCESS [1:27.638s]
[INFO] Maven Checkstyle Plugin ............................... SUCCESS [1:57.384s]
[INFO] Maven Clean Plugin .................................... SUCCESS [14.726s]
[INFO] Maven Dependency Plugin ............................... FAILED [0.453s]
[INFO] Maven Deploy Plugin ................................... SUCCESS [57.646s]
[INFO] Maven DOAP Plugin ..................................... SUCCESS [16.797s]
[INFO] Maven Documentation Checker Plugin .................... SUCCESS [6.957s]
[INFO] Maven EAR Plugin ...................................... SUCCESS [3:17.694s]
[INFO] Maven EJB Plugin ...................................... SUCCESS [25.428s]
[INFO] Maven GPG Plugin ...................................... SUCCESS [10.773s]
[INFO] Maven Help Plugin ..................................... SUCCESS [28.597s]
[INFO] Maven IDEA Plugin ..................................... SUCCESS [12.738s]
[INFO] Maven Install Plugin .................................. SUCCESS [52.851s]
[INFO] Maven JAR Plugin ...................................... SUCCESS [1:35.974s]
[INFO] Maven Jarsigner Plugin ................................ SUCCESS [25.157s]
[INFO] Maven Javadoc Plugin .................................. SUCCESS [5:37.690s]
[INFO] Maven Linkcheck Plugin ................................ SUCCESS [2.781s]
[INFO] Maven One Plugin ...................................... SUCCESS [2.838s]
[INFO] Maven Patch Plugin .................................... SUCCESS [11.445s]
[INFO] Maven PDF Plugin ...................................... SUCCESS [44.490s]
[INFO] Maven PMD Plugin ...................................... SUCCESS [59.374s]
[INFO] Maven RAR Plugin ...................................... SUCCESS [11.316s]
[INFO] Maven Reactor Plugin .................................. SUCCESS [3.280s]
[INFO] Maven Repository Plugin ............................... FAILED [27.677s]
[INFO] Maven Resources Plugin ................................ FAILED [0.291s]
[INFO] Maven Site Plugin 3 ................................... SUCCESS [7:19.160s]
[INFO] Maven Source Plugin ................................... SUCCESS [37.395s]
[INFO] Maven Stage Plugin .................................... SUCCESS [4.040s]
[INFO] Maven Toolchains Plugin ............................... SUCCESS [2.211s]
[INFO] Maven Verifier Plugin ................................. SUCCESS [13.387s]
[INFO] Maven WAR Plugin ...................................... SUCCESS [1:14.822s]
[INFO] Maven Plugins Aggregator .............................. SUCCESS [1.090s]
[INFO] ------------------------------------------------------------------------
[INFO] Error for project: Maven Dependency Plugin (during install)
[INFO] ------------------------------------------------------------------------
[INFO] Failed to resolve artifact.

Missing:
----------
1) org.apache.maven.shared:maven-dependency-tree:jar:2.0

  Try downloading the file manually from the project website.

  Then, install it using the command: 
      mvn install:install-file -DgroupId=org.apache.maven.shared -DartifactId=maven-dependency-tree
-Dversion=2.0 -Dpackaging=jar -Dfile=/path/to/file

  Alternatively, if you host your own repository you can deploy the file there: 
      mvn deploy:deploy-file -DgroupId=org.apache.maven.shared -DartifactId=maven-dependency-tree
-Dversion=2.0 -Dpackaging=jar -Dfile=/path/to/file -Durl=[url] -DrepositoryId=[id]

  Path to dependency: 
  	1) org.apache.maven.plugins:maven-dependency-plugin:maven-plugin:2.6-SNAPSHOT
  	2) org.apache.maven.shared:maven-dependency-tree:jar:2.0

----------
1 required artifact is missing.

for artifact: 
  org.apache.maven.plugins:maven-dependency-plugin:maven-plugin:2.6-SNAPSHOT

from the specified remote repositories:
  central (http://repo1.maven.org/maven2),
  Nexus (http://repository.apache.org/snapshots)



[INFO] ------------------------------------------------------------------------
[INFO] Error for project: Maven Repository Plugin (during install)
[INFO] ------------------------------------------------------------------------
[INFO] There are test failures.

Please refer to <https://builds.apache.org/job/maven-plugins-ITs-m2/ws/maven-repository-plugin/target/surefire-reports>
for the individual test results.
[INFO] ------------------------------------------------------------------------
[INFO] Error for project: Maven Resources Plugin (during install)
[INFO] ------------------------------------------------------------------------
[INFO] A required plugin was not found: Plugin could not be found - check that the goal name
is correct: Unable to download the artifact from any repository

Try downloading the file manually from the project website.

Then, install it using the command: 
    mvn install:install-file -DgroupId=org.apache.maven.plugins -DartifactId=maven-invoker-plugin
-Dversion=1.7-SNAPSHOT -Dpackaging=maven-plugin -Dfile=/path/to/file

Alternatively, if you host your own repository you can deploy the file there: 
    mvn deploy:deploy-file -DgroupId=org.apache.maven.plugins -DartifactId=maven-invoker-plugin
-Dversion=1.7-SNAPSHOT -Dpackaging=maven-plugin -Dfile=/path/to/file -Durl=[url] -DrepositoryId=[id]


  org.apache.maven.plugins:maven-invoker-plugin:maven-plugin:1.7-SNAPSHOT

from the specified remote repositories:
  central (http://repo1.maven.org/maven2)


  org.apache.maven.plugins:maven-invoker-plugin:maven-plugin:1.7-SNAPSHOT

from the specified remote repositories:
  central (http://repo1.maven.org/maven2)


[INFO] ------------------------------------------------------------------------
[INFO] For more information, run Maven with the -e switch
[INFO] ------------------------------------------------------------------------
[INFO] BUILD ERRORS
[INFO] ------------------------------------------------------------------------
[INFO] Total time: 52 minutes 51 seconds
[INFO] Finished at: Thu Aug 02 21:05:44 UTC 2012
[INFO] Final Memory: 248M/1014M
[INFO] ------------------------------------------------------------------------
Build step 'Invoke top-level Maven targets' marked build as failure

Mime
View raw message