maven-notifications mailing list archives

Site index · List index
Message view « Date » · « Thread »
Top « Date » · « Thread »
From Apache Jenkins Server <jenk...@builds.apache.org>
Subject Build failed in Jenkins: maven-plugins-ITs-m3 #609
Date Sun, 02 Sep 2012 00:15:54 GMT
See <https://builds.apache.org/job/maven-plugins-ITs-m3/609/changes>

Changes:

[dennisl] Make fields private wherever possible.
Code formating.

[dennisl] Code formating.

[dennisl] [MCHANGES-285] SAXException parsing JIRA XML from JIRA 5.1 

Submitted by: Ton Swieb
Reviewed by: Dennis Lundberg

Add smarts to make the handling of a single version faster when using JQL.

[dennisl] [MCHANGES-285] SAXException parsing JIRA XML from JIRA 5.1 

Submitted by: Ton Swieb
Reviewed by: Dennis Lundberg

I have reformated the code to follow our code style and added a license header that was missing.

[dennisl] Ignore IDEA files.

[dennisl] Refactor the generation of the query string into a Builder class.

This was part of a patch for
[MCHANGES-285] SAXException parsing JIRA XML from JIRA 5.1 

Submitted by: Ton Swieb
Reviewed by: Dennis Lundberg

I have reformated code to follow our code style and added a license header that was missing.

------------------------------------------
[...truncated 10000 lines...]
Running org.apache.maven.plugins.shade.mojo.ArtifactIdTest
Tests run: 2, Failures: 0, Errors: 0, Skipped: 0, Time elapsed: 0.003 sec
Running org.apache.maven.plugins.shade.DefaultShaderTest
Tests run: 4, Failures: 0, Errors: 0, Skipped: 0, Time elapsed: 0.559 sec
Running org.apache.maven.plugins.shade.relocation.SimpleRelocatorTest
Tests run: 7, Failures: 0, Errors: 0, Skipped: 0, Time elapsed: 0.003 sec
Running org.apache.maven.plugins.shade.relocation.SimpleRelocatorParameterTest
Tests run: 2, Failures: 0, Errors: 0, Skipped: 0, Time elapsed: 0.001 sec
Running org.apache.maven.plugins.shade.filter.SimpleFilterTest
Tests run: 1, Failures: 0, Errors: 0, Skipped: 0, Time elapsed: 0 sec
Running org.apache.maven.plugins.shade.resource.AppendingTransformerTest
Tests run: 1, Failures: 0, Errors: 0, Skipped: 0, Time elapsed: 0.001 sec
Running org.apache.maven.plugins.shade.resource.ApacheLicenseResourceTransformerTest
Tests run: 1, Failures: 0, Errors: 0, Skipped: 0, Time elapsed: 0.001 sec
Running org.apache.maven.plugins.shade.resource.ApacheNoticeResourceTransformerTest
Tests run: 1, Failures: 0, Errors: 0, Skipped: 0, Time elapsed: 0.001 sec
Running org.apache.maven.plugins.shade.resource.ComponentsXmlResourceTransformerTest
Tests run: 1, Failures: 0, Errors: 0, Skipped: 0, Time elapsed: 0.04 sec
Running org.apache.maven.plugins.shade.resource.XmlAppendingTransformerTest
Tests run: 1, Failures: 0, Errors: 0, Skipped: 0, Time elapsed: 0.004 sec

Results :

Tests run: 27, Failures: 0, Errors: 0, Skipped: 0

[INFO] 
[INFO] --- maven-jar-plugin:2.4:jar (default-jar) @ maven-shade-plugin ---
[INFO] Building jar: /x1/jenkins/jenkins-slave/workspace/maven-plugins-ITs-m3/maven-shade-plugin/target/maven-shade-plugin-2.1-SNAPSHOT.jar
[INFO] 
[INFO] --- maven-plugin-plugin:3.1:addPluginArtifactMetadata (default-addPluginArtifactMetadata)
@ maven-shade-plugin ---
[INFO] 
[INFO] --- maven-jar-plugin:2.4:test-jar (default) @ maven-shade-plugin ---
[INFO] Building jar: /x1/jenkins/jenkins-slave/workspace/maven-plugins-ITs-m3/maven-shade-plugin/target/maven-shade-plugin-2.1-SNAPSHOT-tests.jar
[INFO] 
[INFO] --- maven-invoker-plugin:1.6:install (integration-test) @ maven-shade-plugin ---
[INFO] Installing /x1/jenkins/jenkins-slave/workspace/maven-plugins-ITs-m3/maven-shade-plugin/pom.xml
to /x1/jenkins/jenkins-slave/workspace/maven-plugins-ITs-m3/maven-shade-plugin/target/local-repo/org/apache/maven/plugins/maven-shade-plugin/2.1-SNAPSHOT/maven-shade-plugin-2.1-SNAPSHOT.pom
[INFO] Installing /x1/jenkins/jenkins-slave/workspace/maven-plugins-ITs-m3/maven-shade-plugin/target/maven-shade-plugin-2.1-SNAPSHOT.jar
to /x1/jenkins/jenkins-slave/workspace/maven-plugins-ITs-m3/maven-shade-plugin/target/local-repo/org/apache/maven/plugins/maven-shade-plugin/2.1-SNAPSHOT/maven-shade-plugin-2.1-SNAPSHOT.jar
[INFO] Installing /x1/jenkins/jenkins-slave/workspace/maven-plugins-ITs-m3/maven-shade-plugin/target/maven-shade-plugin-2.1-SNAPSHOT-tests.jar
to /x1/jenkins/jenkins-slave/workspace/maven-plugins-ITs-m3/maven-shade-plugin/target/local-repo/org/apache/maven/plugins/maven-shade-plugin/2.1-SNAPSHOT/maven-shade-plugin-2.1-SNAPSHOT-tests.jar
[INFO] 
[INFO] --- maven-invoker-plugin:1.6:integration-test (integration-test) @ maven-shade-plugin
---
[INFO] Building: project-with-reactors-included/pom.xml
[INFO] run script /x1/jenkins/jenkins-slave/workspace/maven-plugins-ITs-m3/maven-shade-plugin/target/it/project-with-reactors-included/verify.bsh
[INFO] ..SUCCESS (5.5 s)
[INFO] Building: manifest-retained/pom.xml
[INFO] run script /x1/jenkins/jenkins-slave/workspace/maven-plugins-ITs-m3/maven-shade-plugin/target/it/manifest-retained/verify.bsh
[INFO] ..SUCCESS (4.6 s)
[INFO] Building: duplicate-classes-with-reloc/pom.xml
[INFO] ..SUCCESS (2.6 s)
[INFO] Building: dep-reduced-pom/pom.xml
[INFO] run script /x1/jenkins/jenkins-slave/workspace/maven-plugins-ITs-m3/maven-shade-plugin/target/it/dep-reduced-pom/verify.groovy
[INFO] ..SUCCESS (2.8 s)
[INFO] Building: dep-reduced-pom-with-local-parent/pom.xml
[INFO] ..SUCCESS (2.2 s)
[INFO] Building: mshade-123/pom.xml
[INFO] ..SUCCESS (4.7 s)
[INFO] Building: finalNameBuild/pom.xml
[INFO] run script /x1/jenkins/jenkins-slave/workspace/maven-plugins-ITs-m3/maven-shade-plugin/target/it/finalNameBuild/setup.bsh
[INFO] run script /x1/jenkins/jenkins-slave/workspace/maven-plugins-ITs-m3/maven-shade-plugin/target/it/finalNameBuild/verify.bsh
[INFO] ..SUCCESS (2.7 s)
[INFO] Building: empty-relocation-pattern/pom.xml
[INFO] ..SUCCESS (2.6 s)
[INFO] Building: non-runtime-scope-excluded/pom.xml
[INFO] run script /x1/jenkins/jenkins-slave/workspace/maven-plugins-ITs-m3/maven-shade-plugin/target/it/non-runtime-scope-excluded/verify.bsh
[INFO] ..SUCCESS (2.9 s)
[INFO] Building: attach-after-lifecycle-fork/pom.xml
[INFO] run script /x1/jenkins/jenkins-slave/workspace/maven-plugins-ITs-m3/maven-shade-plugin/target/it/attach-after-lifecycle-fork/setup.bsh
[INFO] run script /x1/jenkins/jenkins-slave/workspace/maven-plugins-ITs-m3/maven-shade-plugin/target/it/attach-after-lifecycle-fork/verify.bsh
[INFO] ..SUCCESS (2.5 s)
[INFO] Building: empty-relocation-shaded-pattern/pom.xml
[INFO] ..SUCCESS (2.6 s)
[INFO] Building: MSHADE-105/pom.xml
[INFO] run script /x1/jenkins/jenkins-slave/workspace/maven-plugins-ITs-m3/maven-shade-plugin/target/it/MSHADE-105/verify.bsh
[INFO] ..SUCCESS (7.0 s)
[INFO] Building: rerun-without-reloc/pom.xml
[INFO] ..SUCCESS (2.7 s)
[INFO] Building: users-shader-impl/pom.xml
[INFO] run script /x1/jenkins/jenkins-slave/workspace/maven-plugins-ITs-m3/maven-shade-plugin/target/it/users-shader-impl/verify.groovy
[INFO] ..SUCCESS (3.5 s)
[INFO] Building: finalNameBuild-attached/pom.xml
[INFO] run script /x1/jenkins/jenkins-slave/workspace/maven-plugins-ITs-m3/maven-shade-plugin/target/it/finalNameBuild-attached/setup.bsh
[INFO] run script /x1/jenkins/jenkins-slave/workspace/maven-plugins-ITs-m3/maven-shade-plugin/target/it/finalNameBuild-attached/verify.bsh
[INFO] ..SUCCESS (2.8 s)
[INFO] Building: reloc-enum-ref-from-anno/pom.xml
[INFO] ..SUCCESS (3.0 s)
[INFO] Building: xml-transformer-ignores-dtd/pom.xml
[INFO] run script /x1/jenkins/jenkins-slave/workspace/maven-plugins-ITs-m3/maven-shade-plugin/target/it/xml-transformer-ignores-dtd/verify.bsh
[INFO] ..SUCCESS (3.0 s)
[INFO] Building: empty-apache-notice-transform/pom.xml
[INFO] ..SUCCESS (3.5 s)
[INFO] Building: duplicate-classes-without-reloc/pom.xml
[INFO] ..SUCCESS (2.3 s)
[INFO] Building: component-descriptor-relocation/pom.xml
[INFO] ..SUCCESS (3.3 s)
[INFO] Building: manifest-transformed/pom.xml
[INFO] run script /x1/jenkins/jenkins-slave/workspace/maven-plugins-ITs-m3/maven-shade-plugin/target/it/manifest-transformed/verify.bsh
[INFO] ..SUCCESS (3.3 s)
[INFO] Building: mini-jar-malformed-dependencies/pom.xml
[INFO] ..SUCCESS (5.9 s)
[INFO] Building: finalNameShade/pom.xml
[INFO] run script /x1/jenkins/jenkins-slave/workspace/maven-plugins-ITs-m3/maven-shade-plugin/target/it/finalNameShade/setup.bsh
[INFO] run script /x1/jenkins/jenkins-slave/workspace/maven-plugins-ITs-m3/maven-shade-plugin/target/it/finalNameShade/verify.bsh
[INFO] ..SUCCESS (2.7 s)
[INFO] Building: dep-reduced-pom-relocated-result/pom.xml
[INFO] ..SUCCESS (2.2 s)
[INFO] Building: reloc-abs-resource-path/pom.xml
[INFO] ..SUCCESS (4.8 s)
[INFO] Building: pom-packaging/pom.xml
[INFO] run script /x1/jenkins/jenkins-slave/workspace/maven-plugins-ITs-m3/maven-shade-plugin/target/it/pom-packaging/verify.bsh
[INFO] ..SUCCESS (2.1 s)
[INFO] Building: artifact-includes-excludes/pom.xml
[INFO] run script /x1/jenkins/jenkins-slave/workspace/maven-plugins-ITs-m3/maven-shade-plugin/target/it/artifact-includes-excludes/verify.bsh
[INFO] ..SUCCESS (2.7 s)
[INFO] Building: mini-jar-respect-includes/pom.xml
[INFO] run script /x1/jenkins/jenkins-slave/workspace/maven-plugins-ITs-m3/maven-shade-plugin/target/it/mini-jar-respect-includes/verify.bsh
[INFO] ..SUCCESS (3.5 s)
[INFO] Building: dep-reduced-pom-unique/pom.xml
[INFO] run script /x1/jenkins/jenkins-slave/workspace/maven-plugins-ITs-m3/maven-shade-plugin/target/it/dep-reduced-pom-unique/verify.groovy
[INFO] ..SUCCESS (3.5 s)
[INFO] Building: services-resource-transformer/pom.xml
[INFO] run script /x1/jenkins/jenkins-slave/workspace/maven-plugins-ITs-m3/maven-shade-plugin/target/it/services-resource-transformer/verify.bsh
[INFO] ..SUCCESS (2.9 s)
[INFO] Building: shadePomDependency/pom.xml
[INFO] ..SUCCESS (3.5 s)
[INFO] Building: reloc-includes-excludes/pom.xml
[INFO] run script /x1/jenkins/jenkins-slave/workspace/maven-plugins-ITs-m3/maven-shade-plugin/target/it/reloc-includes-excludes/verify.bsh
[INFO] ..SUCCESS (3.2 s)
[INFO] Building: rerun-with-reloc/pom.xml
[INFO] ..SUCCESS (4.3 s)
[INFO] Building: mini-jar-package-info/pom.xml
[INFO] run script /x1/jenkins/jenkins-slave/workspace/maven-plugins-ITs-m3/maven-shade-plugin/target/it/mini-jar-package-info/verify.bsh
[INFO] ..SUCCESS (3.4 s)
[INFO] Building: attached-artifact-type/pom.xml
[INFO] ..SUCCESS (2.7 s)
[INFO] Building: implicit-inclusion-of-project-artifact/pom.xml
[INFO] run script /x1/jenkins/jenkins-slave/workspace/maven-plugins-ITs-m3/maven-shade-plugin/target/it/implicit-inclusion-of-project-artifact/verify.bsh
[INFO] ..SUCCESS (2.9 s)
[INFO] Building: finalNameShade-attached/pom.xml
[INFO] run script /x1/jenkins/jenkins-slave/workspace/maven-plugins-ITs-m3/maven-shade-plugin/target/it/finalNameShade-attached/setup.bsh
[INFO] run script /x1/jenkins/jenkins-slave/workspace/maven-plugins-ITs-m3/maven-shade-plugin/target/it/finalNameShade-attached/verify.bsh
[INFO] ..SUCCESS (2.7 s)
[INFO] Building: mini-jar/pom.xml
[INFO] run script /x1/jenkins/jenkins-slave/workspace/maven-plugins-ITs-m3/maven-shade-plugin/target/it/mini-jar/verify.bsh
[INFO] ..SUCCESS (3.1 s)
[INFO] Building: reloc-anno/pom.xml
[INFO] ..SUCCESS (2.5 s)
[INFO] Building: filter-artifact-contents/pom.xml
[INFO] run script /x1/jenkins/jenkins-slave/workspace/maven-plugins-ITs-m3/maven-shade-plugin/target/it/filter-artifact-contents/verify.bsh
[INFO] ..SUCCESS (2.8 s)
[INFO] Building: reloc-class-from-string-pool/pom.xml
[INFO] ..SUCCESS (2.5 s)
[INFO] 
[INFO] --- maven-invoker-plugin:1.6:verify (integration-test) @ maven-shade-plugin ---
[INFO] -------------------------------------------------
[INFO] Build Summary:
[INFO]   Passed: 41, Failed: 0, Errors: 0, Skipped: 0
[INFO] -------------------------------------------------
[INFO] 
[INFO] --- maven-install-plugin:2.3.1:install (default-install) @ maven-shade-plugin ---
[INFO] Installing /x1/jenkins/jenkins-slave/workspace/maven-plugins-ITs-m3/maven-shade-plugin/target/maven-shade-plugin-2.1-SNAPSHOT.jar
to <https://builds.apache.org/job/maven-plugins-ITs-m3/ws/.repository/org/apache/maven/plugins/maven-shade-plugin/2.1-SNAPSHOT/maven-shade-plugin-2.1-SNAPSHOT.jar>
[INFO] Installing /x1/jenkins/jenkins-slave/workspace/maven-plugins-ITs-m3/maven-shade-plugin/pom.xml
to <https://builds.apache.org/job/maven-plugins-ITs-m3/ws/.repository/org/apache/maven/plugins/maven-shade-plugin/2.1-SNAPSHOT/maven-shade-plugin-2.1-SNAPSHOT.pom>
[INFO] Installing /x1/jenkins/jenkins-slave/workspace/maven-plugins-ITs-m3/maven-shade-plugin/target/maven-shade-plugin-2.1-SNAPSHOT-tests.jar
to <https://builds.apache.org/job/maven-plugins-ITs-m3/ws/.repository/org/apache/maven/plugins/maven-shade-plugin/2.1-SNAPSHOT/maven-shade-plugin-2.1-SNAPSHOT-tests.jar>
[INFO]                                                                         
[INFO] ------------------------------------------------------------------------
[INFO] Building Maven Plugins Aggregator 1-SNAPSHOT
[INFO] ------------------------------------------------------------------------
[INFO] 
[INFO] --- maven-clean-plugin:2.4.1:clean (default-clean) @ maven-plugins-aggregator ---
[INFO] Deleting /x1/jenkins/jenkins-slave/workspace/maven-plugins-ITs-m3/target
[INFO] 
[INFO] --- maven-remote-resources-plugin:1.1:process (default) @ maven-plugins-aggregator
---
[INFO] 
[INFO] --- maven-install-plugin:2.3.1:install (default-install) @ maven-plugins-aggregator
---
[INFO] Installing /x1/jenkins/jenkins-slave/workspace/maven-plugins-ITs-m3/pom.xml to <https://builds.apache.org/job/maven-plugins-ITs-m3/ws/.repository/org/apache/maven/plugins/maven-plugins-aggregator/1-SNAPSHOT/maven-plugins-aggregator-1-SNAPSHOT.pom>
[INFO] ------------------------------------------------------------------------
[INFO] Reactor Summary:
[INFO] 
[INFO] Maven Plugins ..................................... SUCCESS [5.702s]
[INFO] Maven ACR Plugin .................................. SUCCESS [25.212s]
[INFO] Maven Ant Plugin .................................. SUCCESS [1:02.877s]
[INFO] Maven AntRun Plugin ............................... SUCCESS [44.637s]
[INFO] Maven Eclipse Plugin .............................. SUCCESS [5:34.695s]
[INFO] Maven Assembly Plugin ............................. SUCCESS [8:36.968s]
[INFO] Maven Changelog Plugin ............................ SUCCESS [35.424s]
[INFO] Maven Changes Report Plugin ....................... SUCCESS [44.210s]
[INFO] Maven Checkstyle Plugin ........................... SUCCESS [1:13.905s]
[INFO] Maven Clean Plugin ................................ SUCCESS [16.353s]
[INFO] Maven Compiler Plugin ............................. FAILURE [29.935s]
[INFO] Maven Dependency Plugin ........................... SUCCESS [1:41.011s]
[INFO] Maven Deploy Plugin ............................... SUCCESS [58.935s]
[INFO] Maven DOAP Plugin ................................. SUCCESS [13.435s]
[INFO] Maven Documentation Checker Plugin ................ SUCCESS [7.005s]
[INFO] Maven EAR Plugin .................................. SUCCESS [3:02.665s]
[INFO] Maven EJB Plugin .................................. SUCCESS [20.673s]
[INFO] Maven GPG Plugin .................................. SUCCESS [12.353s]
[INFO] Maven Help Plugin ................................. SUCCESS [29.907s]
[INFO] Maven IDEA Plugin ................................. SUCCESS [5.725s]
[INFO] Maven Install Plugin .............................. SUCCESS [33.368s]
[INFO] Maven JAR Plugin .................................. SUCCESS [55.281s]
[INFO] Maven Jarsigner Plugin ............................ SUCCESS [21.869s]
[INFO] Maven Javadoc Plugin .............................. SUCCESS [3:29.213s]
[INFO] Maven Linkcheck Plugin ............................ SUCCESS [1.951s]
[INFO] Maven One Plugin .................................. SUCCESS [1.533s]
[INFO] Maven Patch Plugin ................................ SUCCESS [10.636s]
[INFO] Maven PDF Plugin .................................. SUCCESS [24.457s]
[INFO] Maven PMD Plugin .................................. SUCCESS [32.268s]
[INFO] Maven RAR Plugin .................................. SUCCESS [7.647s]
[INFO] Maven Reactor Plugin .............................. SUCCESS [2.068s]
[INFO] Maven Repository Plugin ........................... FAILURE [26.242s]
[INFO] Maven Resources Plugin ............................ SUCCESS [46.956s]
[INFO] Maven Site Plugin 3 ............................... SUCCESS [6:42.067s]
[INFO] Maven Source Plugin ............................... SUCCESS [31.905s]
[INFO] Maven Stage Plugin ................................ SUCCESS [1.399s]
[INFO] Maven Toolchains Plugin ........................... SUCCESS [1.692s]
[INFO] Maven Verifier Plugin ............................. SUCCESS [12.154s]
[INFO] Maven WAR Plugin .................................. SUCCESS [59.410s]
[INFO] SCM Publish Maven Plugin .......................... SUCCESS [57.201s]
[INFO] Maven Invoker Plugin .............................. SUCCESS [3:15.636s]
[INFO] Maven Project Info Reports Plugin ................. SUCCESS [2:20.955s]
[INFO] Maven Remote Resources Plugin ..................... FAILURE [32.390s]
[INFO] Maven Shade Plugin ................................ SUCCESS [2:25.325s]
[INFO] Maven Plugins Aggregator .......................... SUCCESS [0.120s]
[INFO] ------------------------------------------------------------------------
[INFO] BUILD FAILURE
[INFO] ------------------------------------------------------------------------
[INFO] Total time: 52:56.742s
[INFO] Finished at: Sun Sep 02 00:15:13 GMT 2012
[INFO] Final Memory: 81M/788M
[INFO] ------------------------------------------------------------------------
[WARNING] The requested profile "apache.snapshots" could not be activated because it does
not exist.
[ERROR] Failed to execute goal org.apache.maven.plugins:maven-invoker-plugin:1.6:verify (integration-test)
on project maven-compiler-plugin: 1 build failed. See console output above for details. ->
[Help 1]
[ERROR] Failed to execute goal org.apache.maven.plugins:maven-surefire-plugin:2.12:test (integration-tests)
on project maven-repository-plugin: There are test failures.
[ERROR] 
[ERROR] Please refer to /x1/jenkins/jenkins-slave/workspace/maven-plugins-ITs-m3/maven-repository-plugin/target/surefire-reports
for the individual test results.
[ERROR] -> [Help 1]
[ERROR] Failed to execute goal org.apache.maven.plugins:maven-failsafe-plugin:2.12:verify
(integration-tests) on project maven-remote-resources-plugin: There are test failures.
[ERROR] 
[ERROR] Please refer to /x1/jenkins/jenkins-slave/workspace/maven-plugins-ITs-m3/maven-remote-resources-plugin/target/failsafe-reports
for the individual test results.
[ERROR] -> [Help 1]
[ERROR] 
[ERROR] To see the full stack trace of the errors, re-run Maven with the -e switch.
[ERROR] Re-run Maven using the -X switch to enable full debug logging.
[ERROR] 
[ERROR] For more information about the errors and possible solutions, please read the following
articles:
[ERROR] [Help 1] http://cwiki.apache.org/confluence/display/MAVEN/MojoFailureException
[ERROR] 
[ERROR] After correcting the problems, you can resume the build with the command
[ERROR]   mvn <goals> -rf :maven-compiler-plugin
Build step 'Invoke top-level Maven targets' marked build as failure
Recording test results

Mime
View raw message