maven-notifications mailing list archives

Site index · List index
Message view « Date » · « Thread »
Top « Date » · « Thread »
From Apache Jenkins Server <jenk...@builds.apache.org>
Subject Build failed in Jenkins: maven-plugins-ITs-m2 #750
Date Thu, 13 Sep 2012 15:50:51 GMT
See <https://builds.apache.org/job/maven-plugins-ITs-m2/750/changes>

Changes:

[olamy] last is commons-io is 1.6 required so downgrade :-(

------------------------------------------
[...truncated 9888 lines...]
[INFO] Assembling webapp [maven-war-plugin-test] in [<https://builds.apache.org/job/maven-plugins-ITs-m2/ws/maven-war-plugin/target/test-classes/unit/warexplodedinplacemojo/test-dir/SimpleExplodedInplaceWar-test-data/source]>
[INFO] Processing war project
[INFO] Copying webapp webResources [<https://builds.apache.org/job/maven-plugins-ITs-m2/ws/maven-war-plugin/target/test-classes/unit/warexplodedinplacemojo/test-dir/resources]>
to [<https://builds.apache.org/job/maven-plugins-ITs-m2/ws/maven-war-plugin/target/test-classes/unit/warexplodedinplacemojo/test-dir/SimpleExplodedInplaceWar-test-data/source]>
[INFO] Webapp assembled in [1 msecs]
Tests run: 2, Failures: 0, Errors: 0, Skipped: 0, Time elapsed: 0.097 sec

Results :

Tests run: 85, Failures: 0, Errors: 0, Skipped: 0

[INFO] [jar:jar {execution: default-jar}]
[INFO] Building jar: <https://builds.apache.org/job/maven-plugins-ITs-m2/ws/maven-war-plugin/target/maven-war-plugin-2.3-SNAPSHOT.jar>
[INFO] [plugin:addPluginArtifactMetadata {execution: default-addPluginArtifactMetadata}]
[INFO] [invoker:install {execution: integration-test}]
[INFO] Installing <https://builds.apache.org/job/maven-plugins-ITs-m2/ws/maven-war-plugin/pom.xml>
to <https://builds.apache.org/job/maven-plugins-ITs-m2/ws/maven-war-plugin/target/local-repo/org/apache/maven/plugins/maven-war-plugin/2.3-SNAPSHOT/maven-war-plugin-2.3-SNAPSHOT.pom>
[INFO] Installing <https://builds.apache.org/job/maven-plugins-ITs-m2/ws/maven-war-plugin/target/maven-war-plugin-2.3-SNAPSHOT.jar>
to <https://builds.apache.org/job/maven-plugins-ITs-m2/ws/maven-war-plugin/target/local-repo/org/apache/maven/plugins/maven-war-plugin/2.3-SNAPSHOT/maven-war-plugin-2.3-SNAPSHOT.jar>
[INFO] [invoker:integration-test {execution: integration-test}]
[INFO] Building: MWAR-133/pom.xml
[INFO] run script <https://builds.apache.org/job/maven-plugins-ITs-m2/ws/maven-war-plugin/target/it/MWAR-133/verify.bsh>
[INFO] ..SUCCESS (2.3 s)
[INFO] Building: web-resources-filtering/pom.xml
[INFO] run script <https://builds.apache.org/job/maven-plugins-ITs-m2/ws/maven-war-plugin/target/it/web-resources-filtering/verify.bsh>
[INFO] ..SUCCESS (3.9 s)
[INFO] Building: MWAR-129/pom.xml
[INFO] run script <https://builds.apache.org/job/maven-plugins-ITs-m2/ws/maven-war-plugin/target/it/MWAR-129/verify.bsh>
[INFO] ..SUCCESS (2.3 s)
[INFO] Building: MWAR-131/pom.xml
[INFO] run script <https://builds.apache.org/job/maven-plugins-ITs-m2/ws/maven-war-plugin/target/it/MWAR-131/verify.bsh>
[INFO] ..SUCCESS (6.5 s)
[INFO] Building: MWAR-139/pom.xml
[INFO] run script <https://builds.apache.org/job/maven-plugins-ITs-m2/ws/maven-war-plugin/target/it/MWAR-139/verify.bsh>
[INFO] ..SUCCESS (2.9 s)
[INFO] Building: MWAR-143/pom.xml
[INFO] run script <https://builds.apache.org/job/maven-plugins-ITs-m2/ws/maven-war-plugin/target/it/MWAR-143/verify.bsh>
[INFO] ..SUCCESS (7.5 s)
[INFO] Building: manifest-content/pom.xml
[INFO] run script <https://builds.apache.org/job/maven-plugins-ITs-m2/ws/maven-war-plugin/target/it/manifest-content/verify.bsh>
[INFO] ..SUCCESS (3.0 s)
[INFO] Building: MWAR-240/pom.xml
[INFO] run script <https://builds.apache.org/job/maven-plugins-ITs-m2/ws/maven-war-plugin/target/it/MWAR-240/verify.bsh>
[INFO] ..SUCCESS (3.2 s)
[INFO] Building: MWAR-96/pom.xml
[INFO] run script <https://builds.apache.org/job/maven-plugins-ITs-m2/ws/maven-war-plugin/target/it/MWAR-96/verify.bsh>
[INFO] ..SUCCESS (2.9 s)
[INFO] Building: MWAR-62/pom.xml
[INFO] run script <https://builds.apache.org/job/maven-plugins-ITs-m2/ws/maven-war-plugin/target/it/MWAR-62/verify.bsh>
[INFO] ..SUCCESS (2.2 s)
[INFO] Building: default/pom.xml
[INFO] run script <https://builds.apache.org/job/maven-plugins-ITs-m2/ws/maven-war-plugin/target/it/default/verify.bsh>
[INFO] ..SUCCESS (3.2 s)
[INFO] Building: simple-war-no-webxml/pom.xml
[INFO] run script <https://builds.apache.org/job/maven-plugins-ITs-m2/ws/maven-war-plugin/target/it/simple-war-no-webxml/verify.bsh>
[INFO] ..SUCCESS (2.8 s)
[INFO] Building: simple-war-project/pom.xml
[INFO] run script <https://builds.apache.org/job/maven-plugins-ITs-m2/ws/maven-war-plugin/target/it/simple-war-project/verify.bsh>
[INFO] ..SUCCESS (2.9 s)
[INFO] Building: scoped-dependency-same-artifact/pom.xml
[INFO] run script <https://builds.apache.org/job/maven-plugins-ITs-m2/ws/maven-war-plugin/target/it/scoped-dependency-same-artifact/verify.bsh>
[INFO] ..SUCCESS (3.2 s)
[INFO] Building: overlay-excludes/pom.xml
[INFO] run script <https://builds.apache.org/job/maven-plugins-ITs-m2/ws/maven-war-plugin/target/it/overlay-excludes/verify.bsh>
[INFO] ..SUCCESS (4.2 s)
[INFO] [invoker:verify {execution: integration-test}]
[INFO] -------------------------------------------------
[INFO] Build Summary:
[INFO]   Passed: 15, Failed: 0, Errors: 0, Skipped: 0
[INFO] -------------------------------------------------
[INFO] [install:install {execution: default-install}]
[INFO] Installing <https://builds.apache.org/job/maven-plugins-ITs-m2/ws/maven-war-plugin/target/maven-war-plugin-2.3-SNAPSHOT.jar>
to /home/jenkins/.m2/repository/org/apache/maven/plugins/maven-war-plugin/2.3-SNAPSHOT/maven-war-plugin-2.3-SNAPSHOT.jar
[INFO] ------------------------------------------------------------------------
[INFO] Building SCM Publish Maven Plugin
[INFO]    task-segment: [clean, install]
[INFO] ------------------------------------------------------------------------
[INFO] [clean:clean {execution: default-clean}]
[INFO] Deleting <https://builds.apache.org/job/maven-plugins-ITs-m2/ws/maven-scm-publish-plugin/target>
[INFO] [enforcer:enforce {execution: ensure-no-container-api}]
[INFO] [plugin:helpmojo {execution: generated-helpmojo}]
[INFO] Using 'UTF-8' encoding to read mojo metadata.
[INFO] Applying mojo extractor for language: java
[INFO] Mojo extractor for language: java found 1 mojo descriptors.
[INFO] Applying mojo extractor for language: bsh
[INFO] Mojo extractor for language: bsh found 0 mojo descriptors.
[INFO] Applying mojo extractor for language: java-annotations
[INFO] Mojo extractor for language: java-annotations found 0 mojo descriptors.
[INFO] [plugin:descriptor {execution: default-descriptor}]
[INFO] Using 'UTF-8' encoding to read mojo metadata.
[INFO] Applying mojo extractor for language: java
[INFO] Mojo extractor for language: java found 2 mojo descriptors.
[INFO] Applying mojo extractor for language: bsh
[INFO] Mojo extractor for language: bsh found 0 mojo descriptors.
[INFO] Applying mojo extractor for language: java-annotations
[INFO] Mojo extractor for language: java-annotations found 0 mojo descriptors.
[WARNING] The parameter expression: 'project.build.resources' used in mojo: 'process' has
been deprecated. Use 'project.resources' instead.
[INFO] [remote-resources:process {execution: default}]
[debug] execute contextualize
[INFO] [resources:resources {execution: default-resources}]
[INFO] Using 'UTF-8' encoding to copy filtered resources.
[INFO] Copying 2 resources
[INFO] Copying 3 resources
[INFO] [compiler:compile {execution: default-compile}]
[INFO] Compiling 7 source files to <https://builds.apache.org/job/maven-plugins-ITs-m2/ws/maven-scm-publish-plugin/target/classes>
[INFO] [plugin:descriptor {execution: mojo-descriptor}]
[INFO] Using 'UTF-8' encoding to read mojo metadata.
[INFO] Applying mojo extractor for language: java
[INFO] Mojo extractor for language: java found 2 mojo descriptors.
[INFO] Applying mojo extractor for language: bsh
[INFO] Mojo extractor for language: bsh found 0 mojo descriptors.
[INFO] Applying mojo extractor for language: java-annotations
[INFO] Mojo extractor for language: java-annotations found 3 mojo descriptors.
[debug] execute contextualize
[INFO] [resources:testResources {execution: default-testResources}]
[INFO] Using 'UTF-8' encoding to copy filtered resources.
[INFO] skip non existing resourceDirectory <https://builds.apache.org/job/maven-plugins-ITs-m2/ws/maven-scm-publish-plugin/src/test/resources>
[INFO] Copying 3 resources
[INFO] [compiler:testCompile {execution: default-testCompile}]
[INFO] No sources to compile
[INFO] [surefire:test {execution: default-test}]
[INFO] Surefire report directory: <https://builds.apache.org/job/maven-plugins-ITs-m2/ws/maven-scm-publish-plugin/target/surefire-reports>

-------------------------------------------------------
 T E S T S
-------------------------------------------------------

Results :

Tests run: 0, Failures: 0, Errors: 0, Skipped: 0

[INFO] [jar:jar {execution: default-jar}]
[INFO] Building jar: <https://builds.apache.org/job/maven-plugins-ITs-m2/ws/maven-scm-publish-plugin/target/maven-scm-publish-plugin-1.0-SNAPSHOT.jar>
[INFO] [plugin:addPluginArtifactMetadata {execution: default-addPluginArtifactMetadata}]
[INFO] [invoker:install {execution: integration-test}]
[INFO] Installing <https://builds.apache.org/job/maven-plugins-ITs-m2/ws/maven-scm-publish-plugin/pom.xml>
to <https://builds.apache.org/job/maven-plugins-ITs-m2/ws/maven-scm-publish-plugin/target/local-repo/org/apache/maven/plugins/maven-scm-publish-plugin/1.0-SNAPSHOT/maven-scm-publish-plugin-1.0-SNAPSHOT.pom>
[INFO] Installing <https://builds.apache.org/job/maven-plugins-ITs-m2/ws/maven-scm-publish-plugin/target/maven-scm-publish-plugin-1.0-SNAPSHOT.jar>
to <https://builds.apache.org/job/maven-plugins-ITs-m2/ws/maven-scm-publish-plugin/target/local-repo/org/apache/maven/plugins/maven-scm-publish-plugin/1.0-SNAPSHOT/maven-scm-publish-plugin-1.0-SNAPSHOT.jar>
[INFO] [invoker:integration-test {execution: integration-test}]
[INFO] Building: 001-prepare/pom.xml
[INFO] run script setup.bsh
[INFO] ..SUCCESS (5.9 s)
[INFO] Building: 006-site-multi-module/pom.xml
[INFO] run script setup.bsh
[INFO] ..SUCCESS (22.1 s)
[INFO] Building: 004-publish-scm/pom.xml
[INFO] run script setup.bsh
[INFO] ..SUCCESS (19.8 s)
[INFO] Building: 003-lifecycle/pom.xml
[INFO] run script setup.bsh
[INFO] ..SUCCESS (4.9 s)
[INFO] Building: 005-site-lifecycle/pom.xml
[INFO] run script setup.bsh
[INFO] ..SUCCESS (19.1 s)
[INFO] Building: 002-perform/pom.xml
[INFO] run script setup.bsh
[INFO] ..SUCCESS (20.0 s)
[INFO] [invoker:verify {execution: integration-test}]
[INFO] -------------------------------------------------
[INFO] Build Summary:
[INFO]   Passed: 6, Failed: 0, Errors: 0, Skipped: 0
[INFO] -------------------------------------------------
[INFO] [install:install {execution: default-install}]
[INFO] Installing <https://builds.apache.org/job/maven-plugins-ITs-m2/ws/maven-scm-publish-plugin/target/maven-scm-publish-plugin-1.0-SNAPSHOT.jar>
to /home/jenkins/.m2/repository/org/apache/maven/plugins/maven-scm-publish-plugin/1.0-SNAPSHOT/maven-scm-publish-plugin-1.0-SNAPSHOT.jar
[INFO] ------------------------------------------------------------------------
[INFO] Building Maven Plugins Aggregator
[INFO]    task-segment: [clean, install]
[INFO] ------------------------------------------------------------------------
[INFO] [clean:clean {execution: default-clean}]
[INFO] Deleting <https://builds.apache.org/job/maven-plugins-ITs-m2/ws/target>
[INFO] [remote-resources:process {execution: default}]
[INFO] [site:attach-descriptor {execution: default-attach-descriptor}]
[INFO] [install:install {execution: default-install}]
[INFO] Installing <https://builds.apache.org/job/maven-plugins-ITs-m2/ws/pom.xml> to
/home/jenkins/.m2/repository/org/apache/maven/plugins/maven-plugins-aggregator/1-SNAPSHOT/maven-plugins-aggregator-1-SNAPSHOT.pom
[INFO] 
[INFO] 
[INFO] ------------------------------------------------------------------------
[INFO] Reactor Summary:
[INFO] ------------------------------------------------------------------------
[INFO] Maven Plugins ......................................... SUCCESS [43.043s]
[INFO] Maven ACR Plugin ...................................... FAILED [2.181s]
[INFO] Maven Ant Plugin ...................................... SUCCESS [1:01.499s]
[INFO] Maven AntRun Plugin ................................... SUCCESS [46.375s]
[INFO] Maven Eclipse Plugin .................................. SUCCESS [5:58.840s]
[INFO] Maven Assembly Plugin ................................. SUCCESS [11:14.419s]
[INFO] Maven Changelog Plugin ................................ SUCCESS [40.953s]
[INFO] Maven Compiler Plugin ................................. SUCCESS [35.242s]
[INFO] Maven Changes Report Plugin ........................... SUCCESS [1:11.371s]
[INFO] Maven Checkstyle Plugin ............................... SUCCESS [1:43.005s]
[INFO] Maven Clean Plugin .................................... SUCCESS [13.164s]
[INFO] Maven Dependency Plugin ............................... SUCCESS [2:30.688s]
[INFO] Maven Deploy Plugin ................................... SUCCESS [53.603s]
[INFO] Maven DOAP Plugin ..................................... SUCCESS [16.433s]
[INFO] Maven Documentation Checker Plugin .................... SUCCESS [6.497s]
[INFO] Maven EAR Plugin ...................................... SUCCESS [3:30.691s]
[INFO] Maven EJB Plugin ...................................... FAILED [0.574s]
[INFO] Maven GPG Plugin ...................................... SUCCESS [8.509s]
[INFO] Maven Help Plugin ..................................... SUCCESS [28.048s]
[INFO] Maven IDEA Plugin ..................................... SUCCESS [8.502s]
[INFO] Maven Install Plugin .................................. SUCCESS [36.268s]
[INFO] Maven JAR Plugin ...................................... SUCCESS [1:02.117s]
[INFO] Maven Jarsigner Plugin ................................ SUCCESS [22.498s]
[INFO] Maven Javadoc Plugin .................................. FAILED [1.958s]
[INFO] Maven Linkcheck Plugin ................................ SUCCESS [2.129s]
[INFO] Maven One Plugin ...................................... SUCCESS [2.166s]
[INFO] Maven Patch Plugin .................................... SUCCESS [10.335s]
[INFO] Maven PDF Plugin ...................................... SUCCESS [35.966s]
[INFO] Maven PMD Plugin ...................................... SUCCESS [38.778s]
[INFO] Maven RAR Plugin ...................................... SUCCESS [8.222s]
[INFO] Maven Reactor Plugin .................................. SUCCESS [3.092s]
[INFO] Maven Repository Plugin ............................... SUCCESS [37.667s]
[INFO] Maven Resources Plugin ................................ SUCCESS [51.449s]
[INFO] Maven Site Plugin 3 ................................... SUCCESS [6:48.205s]
[INFO] Maven Source Plugin ................................... SUCCESS [40.054s]
[INFO] Maven Stage Plugin .................................... SUCCESS [1.452s]
[INFO] Maven Toolchains Plugin ............................... SUCCESS [1.702s]
[INFO] Maven Verifier Plugin ................................. SUCCESS [12.381s]
[INFO] Maven WAR Plugin ...................................... SUCCESS [1:11.904s]
[INFO] SCM Publish Maven Plugin .............................. SUCCESS [1:38.457s]
[INFO] Maven Plugins Aggregator .............................. SUCCESS [0.947s]
[INFO] ------------------------------------------------------------------------
[INFO] Error for project: Maven ACR Plugin (during install)
[INFO] ------------------------------------------------------------------------
[INFO] Compilation failure
<https://builds.apache.org/job/maven-plugins-ITs-m2/ws/maven-acr-plugin/src/main/java/org/apache/maven/plugin/acr/AcrMojo.java>:[22,-1]
cannot access org.apache.commons.io.IOUtils
bad class file: /home/jenkins/.m2/repository/commons-io/commons-io/2.3/commons-io-2.3.jar(org/apache/commons/io/IOUtils.class)
class file has wrong version 50.0, should be 49.0

[INFO] ------------------------------------------------------------------------
[INFO] Error for project: Maven EJB Plugin (during install)
[INFO] ------------------------------------------------------------------------
[INFO] Compilation failure
<https://builds.apache.org/job/maven-plugins-ITs-m2/ws/maven-ejb-plugin/src/main/java/org/apache/maven/plugin/ejb/EjbMojo.java>:[22,-1]
cannot access org.apache.commons.io.IOUtils
bad class file: /home/jenkins/.m2/repository/commons-io/commons-io/2.3/commons-io-2.3.jar(org/apache/commons/io/IOUtils.class)
class file has wrong version 50.0, should be 49.0

[INFO] ------------------------------------------------------------------------
[INFO] Error for project: Maven Javadoc Plugin (during install)
[INFO] ------------------------------------------------------------------------
[INFO] Compilation failure
<https://builds.apache.org/job/maven-plugins-ITs-m2/ws/maven-javadoc-plugin/src/main/java/org/apache/maven/plugin/javadoc/AbstractFixJavadocMojo.java>:[34,-1]
cannot access org.apache.commons.io.IOUtils
bad class file: /home/jenkins/.m2/repository/commons-io/commons-io/2.3/commons-io-2.3.jar(org/apache/commons/io/IOUtils.class)
class file has wrong version 50.0, should be 49.0

[INFO] ------------------------------------------------------------------------
[INFO] For more information, run Maven with the -e switch
[INFO] ------------------------------------------------------------------------
[INFO] BUILD ERRORS
[INFO] ------------------------------------------------------------------------
[INFO] Total time: 48 minutes 2 seconds
[INFO] Finished at: Thu Sep 13 15:50:50 UTC 2012
[INFO] Final Memory: 280M/1018M
[INFO] ------------------------------------------------------------------------
Build step 'Invoke top-level Maven targets' marked build as failure

Mime
View raw message